You are viewing a plain text version of this content. The canonical link for it is here.
Posted to commits@jena.apache.org by Apache Jenkins Server <je...@builds.apache.org> on 2024/09/26 21:33:44 UTC
Build failed in Jenkins: Jena » Jena JDK latest #194
See <https://ci-builds.apache.org/job/Jena/job/Jena%20JDK%20latest/194/display/redirect?page=changes>
Changes:
[Andy Seaborne] Bump com.google.protobuf:protobuf-java from 4.28.1 to 4.28.2
[Andy Seaborne] Bump org.roaringbitmap:RoaringBitmap from 1.2.1 to 1.3.0
[Andy Seaborne] Bump org.apache.thrift:libthrift from 0.20.0 to 0.21.0
[Andy Seaborne] Bump ver.commons-io from 2.16.1 to 2.17.0
[Andy Seaborne] Bump com.github.eirslett:frontend-maven-plugin
[Andy Seaborne] Bump rollup from 4.21.0 to 4.22.4 in /jena-fuseki2/jena-fuseki-ui
[Andy Seaborne] GH-2715: Update TokenizerText. Fix signed number tokenizing; add RDF 1.2 tokens.
[Andy Seaborne] Bump the npm-patch-group group
[Andy Seaborne] Bump @eslint/js from 9.10.0 to 9.11.1 in /jena-fuseki2/jena-fuseki-ui
[Andy Seaborne] Tidy up jena-benchmark setup
[Andy Seaborne] Move old comment
[Andy Seaborne] Fix AbstractTestIRIx to use the IRIProvider of the test
[Andy Seaborne] Use RDF 1.2 for test suites
------------------------------------------
Started by an SCM change
Running as SYSTEM
[EnvInject] - Loading node environment variables.
Building remotely on builds41 (ubuntu) in workspace <https://ci-builds.apache.org/job/Jena/job/Jena%20JDK%20latest/ws/>
The recommended git tool is: NONE
No credentials specified
> git rev-parse --resolve-git-dir <https://ci-builds.apache.org/job/Jena/job/Jena%20JDK%20latest/ws/.git> # timeout=10
Fetching changes from the remote Git repository
> git config remote.origin.url https://github.com/apache/jena # timeout=10
Fetching upstream changes from https://github.com/apache/jena
> git --version # timeout=10
> git --version # 'git version 2.34.1'
> git fetch --tags --force --progress -- https://github.com/apache/jena +refs/heads/*:refs/remotes/origin/* # timeout=10
> git rev-parse refs/remotes/origin/main^{commit} # timeout=10
Checking out Revision 49fa76d80943d9acd6dbb4a9a7ed95dbd2a0402a (refs/remotes/origin/main)
> git config core.sparsecheckout # timeout=10
> git checkout -f 49fa76d80943d9acd6dbb4a9a7ed95dbd2a0402a # timeout=10
Commit message: "Use RDF 1.2 for test suites"
> git rev-list --no-walk 11345b8110b8f72d9f0bce9f03c3a5ec9091ddb8 # timeout=10
Parsing POMs
Modules changed, recalculating dependency graph
Established TCP socket on 35115
maven35-agent.jar already up to date
maven35-interceptor.jar already up to date
maven3-interceptor-commons.jar already up to date
[Jena JDK latest] $ /home/jenkins/tools/java/openjdk-22-ea+20/bin/java -cp /home/jenkins/jenkins-agent/maven35-agent.jar:/home/jenkins/tools/maven/latest/boot/plexus-classworlds-2.7.0.jar:/home/jenkins/tools/maven/latest/conf/logging jenkins.maven3.agent.Maven35Main /home/jenkins/tools/maven/latest /home/jenkins/jenkins-agent/agent.jar /home/jenkins/jenkins-agent/maven35-interceptor.jar /home/jenkins/jenkins-agent/maven3-interceptor-commons.jar 35115
ERROR: Failed to parse POMs
java.io.IOException: Cannot run program "/home/jenkins/tools/java/openjdk-22-ea+20/bin/java" (in directory "<https://ci-builds.apache.org/job/Jena/job/Jena%20JDK%20latest/ws/")>: error=2, No such file or directory
at java.base/java.lang.ProcessBuilder.start(ProcessBuilder.java:1128)
at java.base/java.lang.ProcessBuilder.start(ProcessBuilder.java:1071)
at hudson.Proc$LocalProc.<init>(Proc.java:252)
at hudson.Proc$LocalProc.<init>(Proc.java:221)
at hudson.Launcher$LocalLauncher.launch(Launcher.java:994)
at hudson.Launcher$ProcStarter.start(Launcher.java:506)
at hudson.Launcher$RemoteLaunchCallable.call(Launcher.java:1395)
at hudson.Launcher$RemoteLaunchCallable.call(Launcher.java:1337)
at hudson.remoting.UserRequest.perform(UserRequest.java:211)
at hudson.remoting.UserRequest.perform(UserRequest.java:54)
at hudson.remoting.Request$2.run(Request.java:377)
at hudson.remoting.InterceptingExecutorService.lambda$wrap$0(InterceptingExecutorService.java:78)
at java.base/java.util.concurrent.FutureTask.run(FutureTask.java:264)
at java.base/java.util.concurrent.ThreadPoolExecutor.runWorker(ThreadPoolExecutor.java:1128)
at java.base/java.util.concurrent.ThreadPoolExecutor$Worker.run(ThreadPoolExecutor.java:628)
at java.base/java.lang.Thread.run(Thread.java:829)
Suppressed: hudson.remoting.Channel$CallSiteStackTrace: Remote call to builds41
at hudson.remoting.Channel.attachCallSiteStackTrace(Channel.java:1787)
at hudson.remoting.UserRequest$ExceptionResponse.retrieve(UserRequest.java:356)
at hudson.remoting.Channel.call(Channel.java:1003)
at hudson.Launcher$RemoteLauncher.launch(Launcher.java:1121)
at hudson.Launcher$ProcStarter.start(Launcher.java:506)
at hudson.maven.AbstractMavenProcessFactory.newProcess(AbstractMavenProcessFactory.java:282)
at hudson.maven.ProcessCache.get(ProcessCache.java:237)
at hudson.maven.MavenModuleSetBuild$MavenModuleSetBuildExecution.doRun(MavenModuleSetBuild.java:802)
at hudson.model.AbstractBuild$AbstractBuildExecution.run(AbstractBuild.java:526)
at hudson.model.Run.execute(Run.java:1841)
at hudson.maven.MavenModuleSetBuild.run(MavenModuleSetBuild.java:543)
at hudson.model.ResourceController.execute(ResourceController.java:101)
at hudson.model.Executor.run(Executor.java:442)
Caused by: java.io.IOException: error=2, No such file or directory
at java.base/java.lang.ProcessImpl.forkAndExec(Native Method)
at java.base/java.lang.ProcessImpl.<init>(ProcessImpl.java:340)
at java.base/java.lang.ProcessImpl.start(ProcessImpl.java:271)
at java.base/java.lang.ProcessBuilder.start(ProcessBuilder.java:1107)
... 15 more
Build failed in Jenkins: Jena » Jena JDK latest #195
Posted by Apache Jenkins Server <je...@builds.apache.org>.
See <https://ci-builds.apache.org/job/Jena/job/Jena%20JDK%20latest/195/display/redirect?page=changes>
Changes:
[Andy Seaborne] Unwrap Titanium exceptions
[Andy Seaborne] Bump the maven-patch-group group with 7 updates
[Andy Seaborne] Bump org.apache.commons:commons-csv from 1.11.0 to 1.12.0
[Andy Seaborne] Bump org.mockito:mockito-core from 5.13.0 to 5.14.0
[Andy Seaborne] Bump ver.lucene from 9.11.1 to 9.12.0
[Andy Seaborne] GH-2738: Performance improvements to CacheSimple
[Andy Seaborne] Update Grammar/.gitignore
[Andy Seaborne] Bump the npm-patch-group group
[Andy Seaborne] Bump cypress from 13.14.2 to 13.15.0 in /jena-fuseki2/jena-fuseki-ui
[Arne Limburg] GH-2741: Initialize LiteralLabel dtype correctly
------------------------------------------
Started by an SCM change
Running as SYSTEM
[EnvInject] - Loading node environment variables.
Building remotely on builds41 (ubuntu) in workspace <https://ci-builds.apache.org/job/Jena/job/Jena%20JDK%20latest/ws/>
The recommended git tool is: NONE
No credentials specified
> git rev-parse --resolve-git-dir <https://ci-builds.apache.org/job/Jena/job/Jena%20JDK%20latest/ws/.git> # timeout=10
Fetching changes from the remote Git repository
> git config remote.origin.url https://github.com/apache/jena # timeout=10
Fetching upstream changes from https://github.com/apache/jena
> git --version # timeout=10
> git --version # 'git version 2.34.1'
> git fetch --tags --force --progress -- https://github.com/apache/jena +refs/heads/*:refs/remotes/origin/* # timeout=10
> git rev-parse refs/remotes/origin/main^{commit} # timeout=10
Checking out Revision fac447e6a2e9d982f5d1beb380e29977f3c08ca1 (refs/remotes/origin/main)
> git config core.sparsecheckout # timeout=10
> git checkout -f fac447e6a2e9d982f5d1beb380e29977f3c08ca1 # timeout=10
Commit message: "GH-2741: Initialize LiteralLabel dtype correctly"
> git rev-list --no-walk 49fa76d80943d9acd6dbb4a9a7ed95dbd2a0402a # timeout=10
Parsing POMs
Discovered a new module org.apache.jena:jena-benchmarks-shadedJena510 Apache Jena - Benchmarks Shaded Jena 5.1.0
Modules changed, recalculating dependency graph
Established TCP socket on 43485
maven35-agent.jar already up to date
maven35-interceptor.jar already up to date
maven3-interceptor-commons.jar already up to date
[Jena JDK latest] $ /home/jenkins/tools/java/openjdk-22-ea+20/bin/java -cp /home/jenkins/jenkins-agent/maven35-agent.jar:/home/jenkins/tools/maven/latest/boot/plexus-classworlds-2.7.0.jar:/home/jenkins/tools/maven/latest/conf/logging jenkins.maven3.agent.Maven35Main /home/jenkins/tools/maven/latest /home/jenkins/jenkins-agent/agent.jar /home/jenkins/jenkins-agent/maven35-interceptor.jar /home/jenkins/jenkins-agent/maven3-interceptor-commons.jar 43485
ERROR: Failed to parse POMs
java.io.IOException: Cannot run program "/home/jenkins/tools/java/openjdk-22-ea+20/bin/java" (in directory "<https://ci-builds.apache.org/job/Jena/job/Jena%20JDK%20latest/ws/")>: error=2, No such file or directory
at java.base/java.lang.ProcessBuilder.start(ProcessBuilder.java:1128)
at java.base/java.lang.ProcessBuilder.start(ProcessBuilder.java:1071)
at hudson.Proc$LocalProc.<init>(Proc.java:252)
at hudson.Proc$LocalProc.<init>(Proc.java:221)
at hudson.Launcher$LocalLauncher.launch(Launcher.java:994)
at hudson.Launcher$ProcStarter.start(Launcher.java:506)
at hudson.Launcher$RemoteLaunchCallable.call(Launcher.java:1395)
at hudson.Launcher$RemoteLaunchCallable.call(Launcher.java:1337)
at hudson.remoting.UserRequest.perform(UserRequest.java:211)
at hudson.remoting.UserRequest.perform(UserRequest.java:54)
at hudson.remoting.Request$2.run(Request.java:377)
at hudson.remoting.InterceptingExecutorService.lambda$wrap$0(InterceptingExecutorService.java:78)
at java.base/java.util.concurrent.FutureTask.run(FutureTask.java:264)
at java.base/java.util.concurrent.ThreadPoolExecutor.runWorker(ThreadPoolExecutor.java:1128)
at java.base/java.util.concurrent.ThreadPoolExecutor$Worker.run(ThreadPoolExecutor.java:628)
at java.base/java.lang.Thread.run(Thread.java:829)
Suppressed: hudson.remoting.Channel$CallSiteStackTrace: Remote call to builds41
at hudson.remoting.Channel.attachCallSiteStackTrace(Channel.java:1787)
at hudson.remoting.UserRequest$ExceptionResponse.retrieve(UserRequest.java:356)
at hudson.remoting.Channel.call(Channel.java:1003)
at hudson.Launcher$RemoteLauncher.launch(Launcher.java:1121)
at hudson.Launcher$ProcStarter.start(Launcher.java:506)
at hudson.maven.AbstractMavenProcessFactory.newProcess(AbstractMavenProcessFactory.java:282)
at hudson.maven.ProcessCache.get(ProcessCache.java:237)
at hudson.maven.MavenModuleSetBuild$MavenModuleSetBuildExecution.doRun(MavenModuleSetBuild.java:802)
at hudson.model.AbstractBuild$AbstractBuildExecution.run(AbstractBuild.java:526)
at hudson.model.Run.execute(Run.java:1841)
at hudson.maven.MavenModuleSetBuild.run(MavenModuleSetBuild.java:543)
at hudson.model.ResourceController.execute(ResourceController.java:101)
at hudson.model.Executor.run(Executor.java:442)
Caused by: java.io.IOException: error=2, No such file or directory
at java.base/java.lang.ProcessImpl.forkAndExec(Native Method)
at java.base/java.lang.ProcessImpl.<init>(ProcessImpl.java:340)
at java.base/java.lang.ProcessImpl.start(ProcessImpl.java:271)
at java.base/java.lang.ProcessBuilder.start(ProcessBuilder.java:1107)
... 15 more