You are viewing a plain text version of this content. The canonical link for it is here.
Posted to commits@tuscany.apache.org by Apache Hudson Server <hu...@hudson.apache.org> on 2010/10/22 03:18:03 UTC

Build failed in Hudson: Tuscany-2x #905

See <https://hudson.apache.org/hudson/job/Tuscany-2x/905/changes>

Changes:

[rfeng] Set JMSReplyTo based on the latest binding.jms spec

[rfeng] Add sync version of the bi-directional interaction

[slaws] Add README project to comment for completeness

[slaws] TUSCANY-3732 - Brent fixed this so put the test back in

[slaws] A bit of name tidying to make the docs a little more consistent. Still a few that are odd, e.g. the dosgi ones but getting better.

[slaws] point to correct page

[slaws] remove logging-scribe as moved to applications

[slaws] Move logging-scribe into applications

[slaws] Add more words about running

------------------------------------------
[...truncated 56388 lines...]
	at org.apache.tuscany.sca.node.impl.NodeFactoryImpl.configureNode(NodeFactoryImpl.java:319)
	at org.apache.tuscany.sca.node.impl.NodeImpl.start(NodeImpl.java:127)
	... 29 more
java.lang.IllegalStateException: org.oasisopen.sca.ServiceRuntimeException: [Composite: {http://docs.oasis-open.org/ns/opencsa/sca/200912}, Component: TestComponent1] - [ASM40003,ASM60003,JCA90045] Duplicate implementation service name: Component = TestComponent1 Service = Service1
	at org.apache.tuscany.sca.node.impl.NodeImpl.start(NodeImpl.java:173)
	at org.apache.tuscany.sca.otest.TuscanyRuntimeBridge.startContribution(TuscanyRuntimeBridge.java:73)
	at client.BaseJAXWSTestRunner.startContribution(BaseJAXWSTestRunner.java:235)
	at client.BaseJAXWSTestRunner.setUp(BaseJAXWSTestRunner.java:144)
	at sun.reflect.GeneratedMethodAccessor18.invoke(Unknown Source)
	at sun.reflect.DelegatingMethodAccessorImpl.invoke(DelegatingMethodAccessorImpl.java:25)
	at java.lang.reflect.Method.invoke(Method.java:597)
	at org.junit.runners.model.FrameworkMethod$1.runReflectiveCall(FrameworkMethod.java:44)
	at org.junit.internal.runners.model.ReflectiveCallable.run(ReflectiveCallable.java:15)
	at org.junit.runners.model.FrameworkMethod.invokeExplosively(FrameworkMethod.java:41)
	at org.junit.internal.runners.statements.RunBefores.evaluate(RunBefores.java:27)
	at org.junit.internal.runners.statements.RunAfters.evaluate(RunAfters.java:31)
	at org.junit.runners.BlockJUnit4ClassRunner.runChild(BlockJUnit4ClassRunner.java:73)
	at org.junit.runners.BlockJUnit4ClassRunner.runChild(BlockJUnit4ClassRunner.java:46)
	at org.junit.runners.ParentRunner.runChildren(ParentRunner.java:180)
	at org.junit.runners.ParentRunner.access$000(ParentRunner.java:41)
	at org.junit.runners.ParentRunner$1.evaluate(ParentRunner.java:173)
	at org.junit.internal.runners.statements.RunBefores.evaluate(RunBefores.java:28)
	at org.junit.internal.runners.statements.RunAfters.evaluate(RunAfters.java:31)
	at org.junit.runners.ParentRunner.run(ParentRunner.java:220)
	at org.apache.maven.surefire.junit4.JUnit4TestSet.execute(JUnit4TestSet.java:62)
	at org.apache.maven.surefire.suite.AbstractDirectoryTestSuite.executeTestSet(AbstractDirectoryTestSuite.java:140)
	at org.apache.maven.surefire.suite.AbstractDirectoryTestSuite.execute(AbstractDirectoryTestSuite.java:127)
	at org.apache.maven.surefire.Surefire.run(Surefire.java:177)
	at sun.reflect.NativeMethodAccessorImpl.invoke0(Native Method)
	at sun.reflect.NativeMethodAccessorImpl.invoke(NativeMethodAccessorImpl.java:39)
	at sun.reflect.DelegatingMethodAccessorImpl.invoke(DelegatingMethodAccessorImpl.java:25)
	at java.lang.reflect.Method.invoke(Method.java:597)
	at org.apache.maven.surefire.booter.SurefireBooter.runSuitesInProcess(SurefireBooter.java:345)
	at org.apache.maven.surefire.booter.SurefireBooter.main(SurefireBooter.java:1009)
Caused by: org.oasisopen.sca.ServiceRuntimeException: [Composite: {http://docs.oasis-open.org/ns/opencsa/sca/200912}, Component: TestComponent1] - [ASM40003,ASM60003,JCA90045] Duplicate implementation service name: Component = TestComponent1 Service = Service1
	at org.apache.tuscany.sca.node.impl.NodeFactoryImpl.analyzeProblems(NodeFactoryImpl.java:208)
	at org.apache.tuscany.sca.node.impl.NodeFactoryImpl.configureNode(NodeFactoryImpl.java:319)
	at org.apache.tuscany.sca.node.impl.NodeImpl.start(NodeImpl.java:127)
	... 29 more
Exception received during startup - detail: org.oasisopen.sca.ServiceRuntimeException: [Composite: {http://docs.oasis-open.org/ns/opencsa/sca/200912}, Component: TestComponent1] - [ASM40003,ASM60003,JCA90045] Duplicate implementation service name: Component = TestComponent1 Service = Service1
Test ASM_4002 completed successfully
Oct 22, 2010 1:17:43 AM org.apache.tuscany.sca.node.impl.NodeImpl stop
INFO: Stopping node: http://tuscany.apache.org/sca/1.1/nodes/default0
Tests run: 1, Failures: 0, Errors: 0, Skipped: 0, Time elapsed: 0.319 sec
Running client.ASM_13003_TestCase
Implementation language set to: _Java
Oct 22, 2010 1:17:43 AM org.apache.tuscany.sca.node.impl.NodeImpl start
INFO: Starting node: http://tuscany.apache.org/sca/1.1/nodes/default0 domain: default
Oct 22, 2010 1:17:43 AM org.apache.tuscany.sca.node.impl.NodeFactoryImpl loadContributions
INFO: Loading contribution: <https://hudson.apache.org/hudson/job/Tuscany-2x/ws/sca-2x/testing/compliance-tests/assembly/./target/oasis-contributions/ASM_13003/target/ASM_13003.zip>
Oct 22, 2010 1:17:43 AM org.apache.tuscany.sca.contribution.processor.ValidatingXMLStreamReader [Contribution: ASM_13003, Artifact: Test_ASM_13003.composite] (SchemaError)
SEVERE: XMLSchema validation error occured in: Test_ASM_13003.composite ,line = 24, column = 5, Message = cvc-complex-type.2.4.a: Invalid content was found starting with element 'binding.ws'. One of '{"http://docs.oasis-open.org/ns/opencsa/sca/200912":documentation, "http://docs.oasis-open.org/ns/opencsa/sca/200912":include, "http://docs.oasis-open.org/ns/opencsa/sca/200912":requires, "http://docs.oasis-open.org/ns/opencsa/sca/200912":policySetAttachment, "http://docs.oasis-open.org/ns/opencsa/sca/200912":service, "http://docs.oasis-open.org/ns/opencsa/sca/200912":property, "http://docs.oasis-open.org/ns/opencsa/sca/200912":component, "http://docs.oasis-open.org/ns/opencsa/sca/200912":reference, "http://docs.oasis-open.org/ns/opencsa/sca/200912":wire, WC[##other:"http://docs.oasis-open.org/ns/opencsa/sca/200912"]}' is expected.
Oct 22, 2010 1:17:43 AM org.apache.tuscany.sca.assembly.xml.CompositeProcessor [Contribution: ASM_13003, Artifact: Test_ASM_13003.composite] (UnexpectedBindingElement)
SEVERE: Unexpected <binding> element found. It should appear inside a <service> or <reference> element.
org.oasisopen.sca.ServiceRuntimeException: [Contribution: ASM_13003, Artifact: Test_ASM_13003.composite] - XMLSchema validation error occured in: Test_ASM_13003.composite ,line = 24, column = 5, Message = cvc-complex-type.2.4.a: Invalid content was found starting with element 'binding.ws'. One of '{"http://docs.oasis-open.org/ns/opencsa/sca/200912":documentation, "http://docs.oasis-open.org/ns/opencsa/sca/200912":include, "http://docs.oasis-open.org/ns/opencsa/sca/200912":requires, "http://docs.oasis-open.org/ns/opencsa/sca/200912":policySetAttachment, "http://docs.oasis-open.org/ns/opencsa/sca/200912":service, "http://docs.oasis-open.org/ns/opencsa/sca/200912":property, "http://docs.oasis-open.org/ns/opencsa/sca/200912":component, "http://docs.oasis-open.org/ns/opencsa/sca/200912":reference, "http://docs.oasis-open.org/ns/opencsa/sca/200912":wire, WC[##other:"http://docs.oasis-open.org/ns/opencsa/sca/200912"]}' is expected.
java.lang.IllegalStateException: org.oasisopen.sca.ServiceRuntimeException: [Contribution: ASM_13003, Artifact: Test_ASM_13003.composite] - XMLSchema validation error occured in: Test_ASM_13003.composite ,line = 24, column = 5, Message = cvc-complex-type.2.4.a: Invalid content was found starting with element 'binding.ws'. One of '{"http://docs.oasis-open.org/ns/opencsa/sca/200912":documentation, "http://docs.oasis-open.org/ns/opencsa/sca/200912":include, "http://docs.oasis-open.org/ns/opencsa/sca/200912":requires, "http://docs.oasis-open.org/ns/opencsa/sca/200912":policySetAttachment, "http://docs.oasis-open.org/ns/opencsa/sca/200912":service, "http://docs.oasis-open.org/ns/opencsa/sca/200912":property, "http://docs.oasis-open.org/ns/opencsa/sca/200912":component, "http://docs.oasis-open.org/ns/opencsa/sca/200912":reference, "http://docs.oasis-open.org/ns/opencsa/sca/200912":wire, WC[##other:"http://docs.oasis-open.org/ns/opencsa/sca/200912"]}' is expected.
	at org.apache.tuscany.sca.node.impl.NodeImpl.start(NodeImpl.java:173)
	at org.apache.tuscany.sca.otest.TuscanyRuntimeBridge.startContribution(TuscanyRuntimeBridge.java:73)
	at client.BaseJAXWSTestRunner.startContribution(BaseJAXWSTestRunner.java:235)
	at client.BaseJAXWSTestRunner.setUp(BaseJAXWSTestRunner.java:144)
	at sun.reflect.GeneratedMethodAccessor18.invoke(Unknown Source)
	at sun.reflect.DelegatingMethodAccessorImpl.invoke(DelegatingMethodAccessorImpl.java:25)
	at java.lang.reflect.Method.invoke(Method.java:597)
	at org.junit.runners.model.FrameworkMethod$1.runReflectiveCall(FrameworkMethod.java:44)
	at org.junit.internal.runners.model.ReflectiveCallable.run(ReflectiveCallable.java:15)
	at org.junit.runners.model.FrameworkMethod.invokeExplosively(FrameworkMethod.java:41)
	at org.junit.internal.runners.statements.RunBefores.evaluate(RunBefores.java:27)
	at org.junit.internal.runners.statements.RunAfters.evaluate(RunAfters.java:31)
	at org.junit.runners.BlockJUnit4ClassRunner.runChild(BlockJUnit4ClassRunner.java:73)
	at org.junit.runners.BlockJUnit4ClassRunner.runChild(BlockJUnit4ClassRunner.java:46)
	at org.junit.runners.ParentRunner.runChildren(ParentRunner.java:180)
	at org.junit.runners.ParentRunner.access$000(ParentRunner.java:41)
	at org.junit.runners.ParentRunner$1.evaluate(ParentRunner.java:173)
	at org.junit.internal.runners.statements.RunBefores.evaluate(RunBefores.java:28)
	at org.junit.internal.runners.statements.RunAfters.evaluate(RunAfters.java:31)
	at org.junit.runners.ParentRunner.run(ParentRunner.java:220)
	at org.apache.maven.surefire.junit4.JUnit4TestSet.execute(JUnit4TestSet.java:62)
	at org.apache.maven.surefire.suite.AbstractDirectoryTestSuite.executeTestSet(AbstractDirectoryTestSuite.java:140)
	at org.apache.maven.surefire.suite.AbstractDirectoryTestSuite.execute(AbstractDirectoryTestSuite.java:127)
	at org.apache.maven.surefire.Surefire.run(Surefire.java:177)
	at sun.reflect.NativeMethodAccessorImpl.invoke0(Native Method)
	at sun.reflect.NativeMethodAccessorImpl.invoke(NativeMethodAccessorImpl.java:39)
	at sun.reflect.DelegatingMethodAccessorImpl.invoke(DelegatingMethodAccessorImpl.java:25)
	at java.lang.reflect.Method.invoke(Method.java:597)
	at org.apache.maven.surefire.booter.SurefireBooter.runSuitesInProcess(SurefireBooter.java:345)
	at org.apache.maven.surefire.booter.SurefireBooter.main(SurefireBooter.java:1009)
Caused by: org.oasisopen.sca.ServiceRuntimeException: [Contribution: ASM_13003, Artifact: Test_ASM_13003.composite] - XMLSchema validation error occured in: Test_ASM_13003.composite ,line = 24, column = 5, Message = cvc-complex-type.2.4.a: Invalid content was found starting with element 'binding.ws'. One of '{"http://docs.oasis-open.org/ns/opencsa/sca/200912":documentation, "http://docs.oasis-open.org/ns/opencsa/sca/200912":include, "http://docs.oasis-open.org/ns/opencsa/sca/200912":requires, "http://docs.oasis-open.org/ns/opencsa/sca/200912":policySetAttachment, "http://docs.oasis-open.org/ns/opencsa/sca/200912":service, "http://docs.oasis-open.org/ns/opencsa/sca/200912":property, "http://docs.oasis-open.org/ns/opencsa/sca/200912":component, "http://docs.oasis-open.org/ns/opencsa/sca/200912":reference, "http://docs.oasis-open.org/ns/opencsa/sca/200912":wire, WC[##other:"http://docs.oasis-open.org/ns/opencsa/sca/200912"]}' is expected.
	at org.apache.tuscany.sca.node.impl.NodeFactoryImpl.analyzeProblems(NodeFactoryImpl.java:208)
	at org.apache.tuscany.sca.node.impl.NodeFactoryImpl.loadContributions(NodeFactoryImpl.java:441)
	at org.apache.tuscany.sca.node.impl.NodeImpl.start(NodeImpl.java:125)
	... 29 more
Exception received during startup - detail: org.oasisopen.sca.ServiceRuntimeException: [Contribution: ASM_13003, Artifact: Test_ASM_13003.composite] - XMLSchema validation error occured in: Test_ASM_13003.composite ,line = 24, column = 5, Message = cvc-complex-type.2.4.a: Invalid content was found starting with element 'binding.ws'. One of '{"http://docs.oasis-open.org/ns/opencsa/sca/200912":documentation, "http://docs.oasis-open.org/ns/opencsa/sca/200912":include, "http://docs.oasis-open.org/ns/opencsa/sca/200912":requires, "http://docs.oasis-open.org/ns/opencsa/sca/200912":policySetAttachment, "http://docs.oasis-open.org/ns/opencsa/sca/200912":service, "http://docs.oasis-open.org/ns/opencsa/sca/200912":property, "http://docs.oasis-open.org/ns/opencsa/sca/200912":component, "http://docs.oasis-open.org/ns/opencsa/sca/200912":reference, "http://docs.oasis-open.org/ns/opencsa/sca/200912":wire, WC[##other:"http://docs.oasis-open.org/ns/opencsa/sca/200912"]}' is expected.
java.lang.IllegalStateException: org.oasisopen.sca.ServiceRuntimeException: [Contribution: ASM_13003, Artifact: Test_ASM_13003.composite] - XMLSchema validation error occured in: Test_ASM_13003.composite ,line = 24, column = 5, Message = cvc-complex-type.2.4.a: Invalid content was found starting with element 'binding.ws'. One of '{"http://docs.oasis-open.org/ns/opencsa/sca/200912":documentation, "http://docs.oasis-open.org/ns/opencsa/sca/200912":include, "http://docs.oasis-open.org/ns/opencsa/sca/200912":requires, "http://docs.oasis-open.org/ns/opencsa/sca/200912":policySetAttachment, "http://docs.oasis-open.org/ns/opencsa/sca/200912":service, "http://docs.oasis-open.org/ns/opencsa/sca/200912":property, "http://docs.oasis-open.org/ns/opencsa/sca/200912":component, "http://docs.oasis-open.org/ns/opencsa/sca/200912":reference, "http://docs.oasis-open.org/ns/opencsa/sca/200912":wire, WC[##other:"http://docs.oasis-open.org/ns/opencsa/sca/200912"]}' is expected.
	at org.apache.tuscany.sca.node.impl.NodeImpl.start(NodeImpl.java:173)
	at org.apache.tuscany.sca.otest.TuscanyRuntimeBridge.startContribution(TuscanyRuntimeBridge.java:73)
	at client.BaseJAXWSTestRunner.startContribution(BaseJAXWSTestRunner.java:235)
	at client.BaseJAXWSTestRunner.setUp(BaseJAXWSTestRunner.java:144)
	at sun.reflect.GeneratedMethodAccessor18.invoke(Unknown Source)
	at sun.reflect.DelegatingMethodAccessorImpl.invoke(DelegatingMethodAccessorImpl.java:25)
	at java.lang.reflect.Method.invoke(Method.java:597)
	at org.junit.runners.model.FrameworkMethod$1.runReflectiveCall(FrameworkMethod.java:44)
	at org.junit.internal.runners.model.ReflectiveCallable.run(ReflectiveCallable.java:15)
	at org.junit.runners.model.FrameworkMethod.invokeExplosively(FrameworkMethod.java:41)
	at org.junit.internal.runners.statements.RunBefores.evaluate(RunBefores.java:27)
	at org.junit.internal.runners.statements.RunAfters.evaluate(RunAfters.java:31)
	at org.junit.runners.BlockJUnit4ClassRunner.runChild(BlockJUnit4ClassRunner.java:73)
	at org.junit.runners.BlockJUnit4ClassRunner.runChild(BlockJUnit4ClassRunner.java:46)
	at org.junit.runners.ParentRunner.runChildren(ParentRunner.java:180)
	at org.junit.runners.ParentRunner.access$000(ParentRunner.java:41)
	at org.junit.runners.ParentRunner$1.evaluate(ParentRunner.java:173)
	at org.junit.internal.runners.statements.RunBefores.evaluate(RunBefores.java:28)
	at org.junit.internal.runners.statements.RunAfters.evaluate(RunAfters.java:31)
	at org.junit.runners.ParentRunner.run(ParentRunner.java:220)
	at org.apache.maven.surefire.junit4.JUnit4TestSet.execute(JUnit4TestSet.java:62)
	at org.apache.maven.surefire.suite.AbstractDirectoryTestSuite.executeTestSet(AbstractDirectoryTestSuite.java:140)
	at org.apache.maven.surefire.suite.AbstractDirectoryTestSuite.execute(AbstractDirectoryTestSuite.java:127)
	at org.apache.maven.surefire.Surefire.run(Surefire.java:177)
	at sun.reflect.NativeMethodAccessorImpl.invoke0(Native Method)
	at sun.reflect.NativeMethodAccessorImpl.invoke(NativeMethodAccessorImpl.java:39)
	at sun.reflect.DelegatingMethodAccessorImpl.invoke(DelegatingMethodAccessorImpl.java:25)
	at java.lang.reflect.Method.invoke(Method.java:597)
	at org.apache.maven.surefire.booter.SurefireBooter.runSuitesInProcess(SurefireBooter.java:345)
	at org.apache.maven.surefire.booter.SurefireBooter.main(SurefireBooter.java:1009)
Caused by: org.oasisopen.sca.ServiceRuntimeException: [Contribution: ASM_13003, Artifact: Test_ASM_13003.composite] - XMLSchema validation error occured in: Test_ASM_13003.composite ,line = 24, column = 5, Message = cvc-complex-type.2.4.a: Invalid content was found starting with element 'binding.ws'. One of '{"http://docs.oasis-open.org/ns/opencsa/sca/200912":documentation, "http://docs.oasis-open.org/ns/opencsa/sca/200912":include, "http://docs.oasis-open.org/ns/opencsa/sca/200912":requires, "http://docs.oasis-open.org/ns/opencsa/sca/200912":policySetAttachment, "http://docs.oasis-open.org/ns/opencsa/sca/200912":service, "http://docs.oasis-open.org/ns/opencsa/sca/200912":property, "http://docs.oasis-open.org/ns/opencsa/sca/200912":component, "http://docs.oasis-open.org/ns/opencsa/sca/200912":reference, "http://docs.oasis-open.org/ns/opencsa/sca/200912":wire, WC[##other:"http://docs.oasis-open.org/ns/opencsa/sca/200912"]}' is expected.
	at org.apache.tuscany.sca.node.impl.NodeFactoryImpl.analyzeProblems(NodeFactoryImpl.java:208)
	at org.apache.tuscany.sca.node.impl.NodeFactoryImpl.loadContributions(NodeFactoryImpl.java:441)
	at org.apache.tuscany.sca.node.impl.NodeImpl.start(NodeImpl.java:125)
	... 29 more
Test ASM_13003 completed successfully
Oct 22, 2010 1:17:43 AM org.apache.tuscany.sca.node.impl.NodeImpl stop
INFO: Stopping node: http://tuscany.apache.org/sca/1.1/nodes/default0
Tests run: 1, Failures: 0, Errors: 0, Skipped: 0, Time elapsed: 0.067 sec

Results :

Tests run: 124, Failures: 0, Errors: 0, Skipped: 0

[HUDSON] Recording test results
[INFO] [jar:jar {execution: default-jar}]
[INFO] Building jar: <https://hudson.apache.org/hudson/job/Tuscany-2x/ws/sca-2x/testing/compliance-tests/assembly/target/tuscany-compliance-test-assembly.jar>
[INFO] [install:install {execution: default-install}]
[INFO] Installing <https://hudson.apache.org/hudson/job/Tuscany-2x/ws/sca-2x/testing/compliance-tests/assembly/target/tuscany-compliance-test-assembly.jar> to /home/hudson/.m2/repository/org/apache/tuscany/sca/tuscany-compliance-test-assembly/2.0-SNAPSHOT/tuscany-compliance-test-assembly-2.0-SNAPSHOT.jar
[HUDSON] Archiving <https://hudson.apache.org/hudson/job/Tuscany-2x/ws/sca-2x/testing/compliance-tests/assembly/pom.xml> to /home/hudson/hudson/jobs/Tuscany-2x/modules/org.apache.tuscany.sca$tuscany-compliance-test-assembly/builds/2010-10-22_00-25-36/archive/org.apache.tuscany.sca/tuscany-compliance-test-assembly/2.0-SNAPSHOT/pom.xml
[HUDSON] Archiving <https://hudson.apache.org/hudson/job/Tuscany-2x/ws/sca-2x/testing/compliance-tests/assembly/target/tuscany-compliance-test-assembly.jar> to /home/hudson/hudson/jobs/Tuscany-2x/modules/org.apache.tuscany.sca$tuscany-compliance-test-assembly/builds/2010-10-22_00-25-36/archive/org.apache.tuscany.sca/tuscany-compliance-test-assembly/2.0-SNAPSHOT/tuscany-compliance-test-assembly.jar
[INFO] ------------------------------------------------------------------------
[INFO] Building Apache Tuscany SCA Specification Compliance Tests Java CAA
[INFO]    task-segment: [clean, install]
[INFO] ------------------------------------------------------------------------
[INFO] [clean:clean {execution: default-clean}]
[INFO] snapshot org.apache.tuscany.sca:tuscany-otests-sca-j-caa-tests:2.0-SNAPSHOT: checking for updates from oasis.contributions
[INFO] snapshot org.apache.tuscany.sca:tuscany-otests-sca-j-caa-tests:2.0-SNAPSHOT: checking for updates from apache.snapshots
[INFO] [enforcer:enforce {execution: enforce-plugin-versions}]
[INFO] [remote-resources:process {execution: default}]
[INFO] [resources:resources {execution: default-resources}]
[INFO] Using 'UTF-8' encoding to copy filtered resources.
[INFO] skip non existing resourceDirectory <https://hudson.apache.org/hudson/job/Tuscany-2x/ws/sca-2x/testing/compliance-tests/java-caa/src/main/resources>
[INFO] Copying 0 resource
[INFO] Copying 3 resources
[INFO] [compiler:compile {execution: default-compile}]
[INFO] No sources to compile
[INFO] [resources:testResources {execution: default-testResources}]
[INFO] Using 'UTF-8' encoding to copy filtered resources.
[INFO] Copying 2 resources
[INFO] Copying 3 resources
[INFO] [dependency:unpack {execution: unpack}]
[INFO] Configured Artifact: org.apache.tuscany.sca:oasis-javacaa-contributions:2.0-SNAPSHOT:zip
[INFO] snapshot org.apache.tuscany.sca:oasis-javacaa-contributions:2.0-SNAPSHOT: checking for updates from oasis.contributions
[INFO] snapshot org.apache.tuscany.sca:oasis-javacaa-contributions:2.0-SNAPSHOT: checking for updates from apache.snapshots
Downloading: http://svn.apache.org/repos/asf/tuscany/maven/org/apache/tuscany/sca/oasis-javacaa-contributions/2.0-SNAPSHOT/oasis-javacaa-contributions-2.0-SNAPSHOT.zip
[INFO] Configured Artifact: org.apache.tuscany.sca:tuscany-otests-sca-j-caa-tests:2.0-SNAPSHOT:jar
[INFO] Unpacking /home/hudson/.m2/repository/org/apache/tuscany/sca/oasis-javacaa-contributions/2.0-SNAPSHOT/oasis-javacaa-contributions-2.0-SNAPSHOT.zip to
  <https://hudson.apache.org/hudson/job/Tuscany-2x/ws/sca-2x/testing/compliance-tests/java-caa/target/oasis-contributions>
   with includes null and excludes:null
[INFO] Unpacking /home/hudson/.m2/repository/org/apache/tuscany/sca/tuscany-otests-sca-j-caa-tests/2.0-SNAPSHOT/tuscany-otests-sca-j-caa-tests-2.0-SNAPSHOT.jar to
  <https://hudson.apache.org/hudson/job/Tuscany-2x/ws/sca-2x/testing/compliance-tests/java-caa/target/test-classes>
   with includes null and excludes:commons-logging.properties,oasis-sca-tests.properties,tuscany-oasis-sca-tests-errors.properties
[INFO] [compiler:testCompile {execution: default-testCompile}]
[INFO] Compiling 1 source file to <https://hudson.apache.org/hudson/job/Tuscany-2x/ws/sca-2x/testing/compliance-tests/java-caa/target/test-classes>
[INFO] -------------------------------------------------------------
[ERROR] COMPILATION ERROR : 
[INFO] -------------------------------------------------------------
[ERROR] <https://hudson.apache.org/hudson/job/Tuscany-2x/ws/sca-2x/testing/compliance-tests/java-caa/src/test/java/org/apache/tuscany/sca/otest/TuscanyRuntimeBridge.java>:[36,17] package testClient does not exist

[ERROR] <https://hudson.apache.org/hudson/job/Tuscany-2x/ws/sca-2x/testing/compliance-tests/java-caa/src/test/java/org/apache/tuscany/sca/otest/TuscanyRuntimeBridge.java>:[37,13] package client does not exist

[ERROR] <https://hudson.apache.org/hudson/job/Tuscany-2x/ws/sca-2x/testing/compliance-tests/java-caa/src/test/java/org/apache/tuscany/sca/otest/TuscanyRuntimeBridge.java>:[43,45] cannot find symbol
symbol: class RuntimeBridge
public class TuscanyRuntimeBridge implements RuntimeBridge {

[ERROR] <https://hudson.apache.org/hudson/job/Tuscany-2x/ws/sca-2x/testing/compliance-tests/java-caa/src/test/java/org/apache/tuscany/sca/otest/TuscanyRuntimeBridge.java>:[215,26] cannot find symbol
symbol  : class TestException_Exception
location: class org.apache.tuscany.sca.otest.TuscanyRuntimeBridge

[ERROR] <https://hudson.apache.org/hudson/job/Tuscany-2x/ws/sca-2x/testing/compliance-tests/java-caa/src/test/java/org/apache/tuscany/sca/otest/TuscanyRuntimeBridge.java>:[216,12] cannot find symbol
symbol  : class TestException_Exception
location: class org.apache.tuscany.sca.otest.TuscanyRuntimeBridge

[ERROR] <https://hudson.apache.org/hudson/job/Tuscany-2x/ws/sca-2x/testing/compliance-tests/java-caa/src/test/java/org/apache/tuscany/sca/otest/TuscanyRuntimeBridge.java>:[216,42] cannot find symbol
symbol  : class TestException_Exception
location: class org.apache.tuscany.sca.otest.TuscanyRuntimeBridge

[INFO] 6 errors 
[INFO] -------------------------------------------------------------
[HUDSON] Archiving <https://hudson.apache.org/hudson/job/Tuscany-2x/ws/sca-2x/testing/compliance-tests/java-caa/pom.xml> to /home/hudson/hudson/jobs/Tuscany-2x/modules/org.apache.tuscany.sca$tuscany-compliance-test-java-caa/builds/2010-10-22_00-25-36/archive/org.apache.tuscany.sca/tuscany-compliance-test-java-caa/2.0-SNAPSHOT/pom.xml
[INFO] ------------------------------------------------------------------------
[ERROR] BUILD FAILURE
[INFO] ------------------------------------------------------------------------
[INFO] Compilation failure

<https://hudson.apache.org/hudson/job/Tuscany-2x/ws/sca-2x/testing/compliance-tests/java-caa/src/test/java/org/apache/tuscany/sca/otest/TuscanyRuntimeBridge.java>:[36,17] package testClient does not exist

<https://hudson.apache.org/hudson/job/Tuscany-2x/ws/sca-2x/testing/compliance-tests/java-caa/src/test/java/org/apache/tuscany/sca/otest/TuscanyRuntimeBridge.java>:[37,13] package client does not exist

<https://hudson.apache.org/hudson/job/Tuscany-2x/ws/sca-2x/testing/compliance-tests/java-caa/src/test/java/org/apache/tuscany/sca/otest/TuscanyRuntimeBridge.java>:[43,45] cannot find symbol
symbol: class RuntimeBridge
public class TuscanyRuntimeBridge implements RuntimeBridge {

<https://hudson.apache.org/hudson/job/Tuscany-2x/ws/sca-2x/testing/compliance-tests/java-caa/src/test/java/org/apache/tuscany/sca/otest/TuscanyRuntimeBridge.java>:[215,26] cannot find symbol
symbol  : class TestException_Exception
location: class org.apache.tuscany.sca.otest.TuscanyRuntimeBridge

<https://hudson.apache.org/hudson/job/Tuscany-2x/ws/sca-2x/testing/compliance-tests/java-caa/src/test/java/org/apache/tuscany/sca/otest/TuscanyRuntimeBridge.java>:[216,12] cannot find symbol
symbol  : class TestException_Exception
location: class org.apache.tuscany.sca.otest.TuscanyRuntimeBridge

<https://hudson.apache.org/hudson/job/Tuscany-2x/ws/sca-2x/testing/compliance-tests/java-caa/src/test/java/org/apache/tuscany/sca/otest/TuscanyRuntimeBridge.java>:[216,42] cannot find symbol
symbol  : class TestException_Exception
location: class org.apache.tuscany.sca.otest.TuscanyRuntimeBridge


[INFO] ------------------------------------------------------------------------
[INFO] For more information, run Maven with the -e switch
[INFO] ------------------------------------------------------------------------
[INFO] Total time: 52 minutes 3 seconds
[INFO] Finished at: Fri Oct 22 01:17:49 UTC 2010
[INFO] Final Memory: 212M/740M
[INFO] ------------------------------------------------------------------------
Sending e-mails to: commits@tuscany.apache.org
channel stopped
2010-10-22 01:17:50.667::INFO:  Shutdown hook executing
2010-10-22 01:17:50.667::INFO:  Shutdown hook complete
2010-10-22 01:17:51.667::INFO:  Shutdown hook complete
2010-10-22 01:17:52.668::INFO:  Shutdown hook complete
2010-10-22 01:17:53.668::INFO:  Shutdown hook complete
2010-10-22 01:17:54.668::INFO:  Shutdown hook complete
2010-10-22 01:17:55.668::INFO:  Shutdown hook complete
2010-10-22 01:17:56.668::INFO:  Shutdown hook complete
2010-10-22 01:17:57.668::INFO:  Shutdown hook complete
2010-10-22 01:17:58.668::INFO:  Shutdown hook complete


Re: Hudson build is back to normal : Tuscany-2x #908

Posted by Simon Laws <si...@googlemail.com>.
On Fri, Oct 22, 2010 at 2:43 PM, Apache Hudson Server
<hu...@hudson.apache.org> wrote:
> See <https://hudson.apache.org/hudson/job/Tuscany-2x/908/>
>
>
>

Ok so that worked. But again that was on Solaris. I guess we wait and
see what happens when it picks Ubuntu again (as it does regularly).

Simon

-- 
Apache Tuscany committer: tuscany.apache.org
Co-author of a book about Tuscany and SCA: tuscanyinaction.com

Hudson build is back to normal : Tuscany-2x #908

Posted by Apache Hudson Server <hu...@hudson.apache.org>.
See <https://hudson.apache.org/hudson/job/Tuscany-2x/908/>



Build failed in Hudson: Tuscany-2x #907

Posted by Apache Hudson Server <hu...@hudson.apache.org>.
See <https://hudson.apache.org/hudson/job/Tuscany-2x/907/>

------------------------------------------
Started by user SYSTEM
Building remotely on solaris1
FATAL: basedir <https://hudson.apache.org/hudson/job/Tuscany-2x/ws/sca-2x/testing/itest/jms/policy-headers/target/test-classes/org> does not exist.
java.lang.IllegalStateException: basedir <https://hudson.apache.org/hudson/job/Tuscany-2x/ws/sca-2x/testing/itest/jms/policy-headers/target/test-classes/org> does not exist.
	at org.apache.tools.ant.DirectoryScanner.scan(DirectoryScanner.java:852)
	at org.apache.tools.ant.types.AbstractFileSet.getDirectoryScanner(AbstractFileSet.java:490)
	at org.apache.tools.ant.taskdefs.ExecuteOn.runExec(ExecuteOn.java:369)
	at org.apache.tools.ant.taskdefs.ExecTask.execute(ExecTask.java:502)
	at org.apache.tools.ant.taskdefs.Chmod.execute(Chmod.java:181)
	at hudson.Util.makeWritable(Util.java:276)
	at hudson.Util.deleteFile(Util.java:236)
	at hudson.Util.deleteRecursive(Util.java:302)
	at hudson.Util.deleteContentsRecursive(Util.java:221)
	at hudson.Util.deleteRecursive(Util.java:301)
	at hudson.Util.deleteContentsRecursive(Util.java:221)
	at hudson.Util.deleteRecursive(Util.java:301)
	at hudson.Util.deleteContentsRecursive(Util.java:221)
	at hudson.Util.deleteRecursive(Util.java:301)
	at hudson.Util.deleteContentsRecursive(Util.java:221)
	at hudson.Util.deleteRecursive(Util.java:301)
	at hudson.Util.deleteContentsRecursive(Util.java:221)
	at hudson.Util.deleteRecursive(Util.java:301)
	at hudson.Util.deleteContentsRecursive(Util.java:221)
	at hudson.Util.deleteRecursive(Util.java:301)
	at hudson.Util.deleteContentsRecursive(Util.java:221)
	at hudson.Util.deleteRecursive(Util.java:301)
	at hudson.Util.deleteContentsRecursive(Util.java:221)
	at hudson.Util.deleteRecursive(Util.java:301)
	at hudson.Util.deleteContentsRecursive(Util.java:221)
	at hudson.scm.SubversionSCM$CheckOutTask.invoke(SubversionSCM.java:726)
	at hudson.scm.SubversionSCM$CheckOutTask.invoke(SubversionSCM.java:660)
	at hudson.FilePath$FileCallableWrapper.call(FilePath.java:1899)
	at hudson.remoting.UserRequest.perform(UserRequest.java:114)
	at hudson.remoting.UserRequest.perform(UserRequest.java:48)
	at hudson.remoting.Request$2.run(Request.java:270)
	at java.util.concurrent.Executors$RunnableAdapter.call(Executors.java:417)
	at java.util.concurrent.FutureTask$Sync.innerRun(FutureTask.java:269)
	at java.util.concurrent.FutureTask.run(FutureTask.java:123)
	at java.util.concurrent.ThreadPoolExecutor$Worker.runTask(ThreadPoolExecutor.java:651)
	at java.util.concurrent.ThreadPoolExecutor$Worker.run(ThreadPoolExecutor.java:676)
	at java.lang.Thread.run(Thread.java:595)


Build failed in Hudson: Tuscany-2x #906

Posted by Apache Hudson Server <hu...@hudson.apache.org>.
See <https://hudson.apache.org/hudson/job/Tuscany-2x/906/>

------------------------------------------
Started by user SYSTEM
Building remotely on solaris1
SCM check out aborted


Re: Build failed in Hudson: Tuscany-2x #905

Posted by ant elder <an...@gmail.com>.
On Fri, Oct 22, 2010 at 8:50 AM, Simon Laws <si...@googlemail.com> wrote:
> Not sure what's going on here. I'm not seeing it on Windows or Linux
> but on the other hand I'm not starting from a completely clean
> checkout. Anyone seeing it locally?
>
> Simon
>
>

No its fine for me. I think this must be a Hudson problem with not
correctly updating snapshots in the build properly, we have a similar
problem in the Abdera Hudson build. I've just added a -U to the mvn
command in Hudson to see if that helps. I guess if we could get rid of
snapshot dependencies in the build that would fix it.

   ...ant

Re: Build failed in Hudson: Tuscany-2x #905

Posted by Simon Laws <si...@googlemail.com>.
On Fri, Oct 22, 2010 at 9:00 AM, Simon Laws <si...@googlemail.com> wrote:
> On Fri, Oct 22, 2010 at 8:50 AM, Simon Laws <si...@googlemail.com> wrote:
>> Not sure what's going on here. I'm not seeing it on Windows or Linux
>> but on the other hand I'm not starting from a completely clean
>> checkout. Anyone seeing it locally?
>>
>> Simon
>>
>>
>> --
>> Apache Tuscany committer: tuscany.apache.org
>> Co-author of a book about Tuscany and SCA: tuscanyinaction.com
>>
>
> Looking at the workspace it looks like:
>
> tuscany-otests-sca-j-caa-tests
>
> didn't get unpacked to:
>
> sca-2x/testing/compliance-tests/java-caa/target/test-classes/
>
> I notice this run was in Ubuntu which does seem to get mixed results.
> Am restarting to see if the problem persists.
>
> Simon
>
> --
> Apache Tuscany committer: tuscany.apache.org
> Co-author of a book about Tuscany and SCA: tuscanyinaction.com
>

Ah ok, we crossed posts. These compliance artifacts are SNAPSHOTs.

Simon

-- 
Apache Tuscany committer: tuscany.apache.org
Co-author of a book about Tuscany and SCA: tuscanyinaction.com

Re: Build failed in Hudson: Tuscany-2x #905

Posted by Simon Laws <si...@googlemail.com>.
On Fri, Oct 22, 2010 at 8:50 AM, Simon Laws <si...@googlemail.com> wrote:
> Not sure what's going on here. I'm not seeing it on Windows or Linux
> but on the other hand I'm not starting from a completely clean
> checkout. Anyone seeing it locally?
>
> Simon
>
>
> --
> Apache Tuscany committer: tuscany.apache.org
> Co-author of a book about Tuscany and SCA: tuscanyinaction.com
>

Looking at the workspace it looks like:

tuscany-otests-sca-j-caa-tests

didn't get unpacked to:

sca-2x/testing/compliance-tests/java-caa/target/test-classes/

I notice this run was in Ubuntu which does seem to get mixed results.
Am restarting to see if the problem persists.

Simon

-- 
Apache Tuscany committer: tuscany.apache.org
Co-author of a book about Tuscany and SCA: tuscanyinaction.com

Re: Build failed in Hudson: Tuscany-2x #905

Posted by Simon Laws <si...@googlemail.com>.
Not sure what's going on here. I'm not seeing it on Windows or Linux
but on the other hand I'm not starting from a completely clean
checkout. Anyone seeing it locally?

Simon


-- 
Apache Tuscany committer: tuscany.apache.org
Co-author of a book about Tuscany and SCA: tuscanyinaction.com