You are viewing a plain text version of this content. The canonical link for it is here.
Posted to commits@tomee.apache.org by Apache Jenkins Server <je...@builds.apache.org> on 2026/06/02 06:58:38 UTC
Build failed in Jenkins: TomEE » tomee-10-build-full-tck #73
See <https://ci-builds.apache.org/job/Tomee/job/tomee-10-build-full-tck/73/display/redirect?page=changes>
Changes:
[github] TOMEE-4611 Bump tomcat.version from 10.1.54 to 10.1.55 (#2682)
[Markus Jung] [tomee-10.x]: Bump version.arquillian from 1.10.1.Final to 1.10.2.Final
------------------------------------------
[...truncated 1.10 MiB...]
[INFO] TomEE :: Connector Examples :: Connector in EAR :: Connector Impl 10.1.6-SNAPSHOT SUCCESS [ 0.358 s]
[INFO] TomEE :: Connector Examples :: Connector in EAR :: RAR Packaging 10.1.6-SNAPSHOT SUCCESS [ 0.351 s]
[INFO] TomEE :: Connector Examples :: Connector in EAR :: Sample WAR 10.1.6-SNAPSHOT SUCCESS [ 0.194 s]
[INFO] TomEE :: Connector Examples :: Connector in EAR :: EAR Packaging 10.1.6-SNAPSHOT SUCCESS [ 0.401 s]
[INFO] TomEE :: Connector Examples :: Connector in EAR :: Functional Tests 10.1.6-SNAPSHOT SUCCESS [ 0.645 s]
[INFO] TomEE :: Connector Examples :: Connector in WAR 10.1.6-SNAPSHOT SUCCESS [ 0.669 s]
[INFO] TomEE :: Examples :: Cucumber JVM 10.1.6-SNAPSHOT .. SUCCESS [ 0.432 s]
[INFO] TomEE :: Examples :: Expanded support for Env Entries 10.1.6-SNAPSHOT SUCCESS [ 0.302 s]
[INFO] TomEE :: Examples :: Datasource Ciphered Password 10.1.6-SNAPSHOT SUCCESS [ 0.196 s]
[INFO] TomEE :: Examples :: Datasource Definition 10.1.6-SNAPSHOT SUCCESS [ 0.283 s]
[INFO] TomEE :: Examples :: Datasource Versioning 10.1.6-SNAPSHOT SUCCESS [ 0.817 s]
[INFO] TomEE :: Examples :: Decorators 10.1.6-SNAPSHOT .... SUCCESS [ 0.283 s]
[INFO] TomEE :: Examples :: Dynamic DAO Implementation 10.1.6-SNAPSHOT SUCCESS [ 0.316 s]
[INFO] TomEE :: Examples :: Dynamic Datasource Routing 10.1.6-SNAPSHOT SUCCESS [ 0.379 s]
[INFO] TomEE :: Examples :: Dynamic Implementation 10.1.6-SNAPSHOT SUCCESS [ 0.268 s]
[INFO] TomEE :: Examples :: Dynamic MBean Proxy 10.1.6-SNAPSHOT SUCCESS [ 0.362 s]
[INFO] TomEE :: Examples :: Ear Testing 10.1.6-SNAPSHOT ... SUCCESS [ 0.006 s]
[INFO] TomEE :: Examples :: Ear Testing :: Business Model 10.1.6-SNAPSHOT SUCCESS [ 0.087 s]
[INFO] TomEE :: Examples :: Ear Testing :: Business Logic 10.1.6-SNAPSHOT SUCCESS [ 0.223 s]
[INFO] TomEE :: Web Examples :: EJB Examples War 10.1.6-SNAPSHOT SUCCESS [ 0.233 s]
[INFO] TomEE :: Web Examples :: EJB Remote Call 10.1.6-SNAPSHOT SUCCESS [ 0.206 s]
[INFO] TomEE :: Web Examples :: EJB Remote Call 10.1.6-SNAPSHOT SUCCESS [ 0.195 s]
[INFO] TomEE :: Web Examples :: EJB WebService 10.1.6-SNAPSHOT SUCCESS [ 0.088 s]
[INFO] TomEE :: Arquillian Adaptors Parent :: OpenEJB Container 10.1.6-SNAPSHOT SUCCESS [ 2.081 s]
[INFO] TomEE :: Examples :: Groovy CDI 10.1.6-SNAPSHOT .... SUCCESS [ 1.605 s]
[INFO] TomEE :: Examples :: Groovy JPA 10.1.6-SNAPSHOT .... SUCCESS [ 1.188 s]
[INFO] TomEE :: Examples :: Hello World - Weblogic 10.1.6-SNAPSHOT SUCCESS [ 0.258 s]
[INFO] TomEE :: Examples :: @Resource jakarta.jms.ConnectionFactory 10.1.6-SNAPSHOT SUCCESS [ 0.645 s]
[INFO] TomEE :: Examples :: @Resource DataSource Injection 10.1.6-SNAPSHOT SUCCESS [ 0.280 s]
[INFO] TomEE :: Examples :: @EJB Injection 10.1.6-SNAPSHOT SUCCESS [ 0.320 s]
[INFO] TomEE :: Examples :: @PersistenceContext EntityManager Injection 10.1.6-SNAPSHOT SUCCESS [ 0.185 s]
[INFO] TomEE :: Examples :: @Resource env-entry Injection 10.1.6-SNAPSHOT SUCCESS [ 0.215 s]
[INFO] TomEE :: Examples :: Interceptors 10.1.6-SNAPSHOT .. SUCCESS [ 0.297 s]
[INFO] TomEE :: Examples :: JakartaMail API 10.1.6-SNAPSHOT SUCCESS [ 0.659 s]
[INFO] TomEE :: Examples :: Jakarta Mail API with Velocity 10.1.6-SNAPSHOT SUCCESS [ 1.400 s]
[INFO] TomEE :: Web Examples :: Java Modules (Simple REST resource) 10.1.6-SNAPSHOT SUCCESS [ 1.293 s]
[INFO] TomEE :: Examples :: JAXRS Filter 10.1.6-SNAPSHOT .. SUCCESS [ 0.575 s]
[INFO] TomEE :: Examples :: JAXRS JSON Provider with Jettison 10.1.6-SNAPSHOT SUCCESS [ 0.665 s]
[INFO] TomEE :: Examples :: JPA with EclipseLink 10.1.6-SNAPSHOT SUCCESS [ 0.258 s]
[INFO] TomEE :: Utils :: Core Hibernate 10.1.6-SNAPSHOT ... SUCCESS [ 0.148 s]
[INFO] TomEE :: Examples :: JPA with Hibernate 10.1.6-SNAPSHOT SUCCESS [ 0.538 s]
[INFO] TomEE :: Examples :: JPA with Hibernate and arquillian 10.1.6-SNAPSHOT SUCCESS [ 0.405 s]
[INFO] TomEE :: Examples :: JPA @Enumerated 10.1.6-SNAPSHOT SUCCESS [ 0.245 s]
[INFO] TomEE :: Web Examples :: JSF - CDI and EJB 10.1.6-SNAPSHOT SUCCESS [ 0.128 s]
[INFO] TomEE :: Examples :: JUnit 5 :: Application Composer 10.1.6-SNAPSHOT SUCCESS [ 0.295 s]
[INFO] TomEE :: Examples :: JUnit 5 :: Multiple TomEE with Arquillian 10.1.6-SNAPSHOT SUCCESS [ 0.215 s]
[INFO] TomEE :: Examples :: JUnit 5 :: Simple Websockets with Arquillian 10.1.6-SNAPSHOT SUCCESS [ 0.257 s]
[INFO] TomEE :: Examples :: @EJB Lookup 10.1.6-SNAPSHOT ... SUCCESS [ 0.235 s]
[INFO] TomEE :: Examples :: EJB Lookup with descriptor 10.1.6-SNAPSHOT SUCCESS [ 0.242 s]
[INFO] TomEE :: Examples :: Movies Complete (Meta) 10.1.6-SNAPSHOT SUCCESS [ 0.256 s]
[INFO] TomEE :: Examples :: Movies Complete 10.1.6-SNAPSHOT SUCCESS [ 0.336 s]
[INFO] TomEE :: Examples :: MicroProfile Config 10.1.6-SNAPSHOT SUCCESS [ 0.536 s]
[INFO] TomEE :: Examples :: MicroProfile Config Source Database 10.1.6-SNAPSHOT SUCCESS [ 0.366 s]
[INFO] TomEE :: Examples :: Microprofile Fault Tolerance :: Fallback 10.1.6-SNAPSHOT SUCCESS [ 0.245 s]
[INFO] TomEE :: Examples :: Microprofile Fault Tolerance :: Retry 10.1.6-SNAPSHOT SUCCESS [ 0.654 s]
[INFO] TomEE :: Examples :: Microprofile Fault Tolerance :: Timeout 10.1.6-SNAPSHOT SUCCESS [ 0.261 s]
[INFO] TomEE :: Examples :: MicroProfile JWT Bean Validation 10.1.6-SNAPSHOT SUCCESS [ 0.610 s]
[INFO] TomEE :: Examples :: MicroProfile JWT Bean Validation, Strongly-typed Annotations 10.1.6-SNAPSHOT SUCCESS [ 0.582 s]
[INFO] TomEE :: Examples :: Microprofile Metrics Counted 10.1.6-SNAPSHOT SUCCESS [ 0.355 s]
[INFO] TomEE :: Examples :: Microprofile Metrics Histogram 10.1.6-SNAPSHOT SUCCESS [ 0.359 s]
[INFO] TomEE :: Examples :: Microprofile Metrics Timed 10.1.6-SNAPSHOT SUCCESS [ 0.279 s]
[INFO] TomEE :: Examples :: MicroProfile Metrics Gauge 10.1.6-SNAPSHOT SUCCESS [ 0.393 s]
[INFO] TomEE :: Examples :: MicroProfile Metrics Metered 10.1.6-SNAPSHOT SUCCESS [ 0.098 s]
[INFO] TomEE :: Examples :: MP REST JWT JWK 10.1.6-SNAPSHOT SUCCESS [ 0.512 s]
[INFO] TomEE :: Examples :: MP REST JWT PRINCIPAL 10.1.6-SNAPSHOT SUCCESS [ 0.391 s]
[INFO] TomEE :: Examples :: MP REST JWT Public Key 10.1.6-SNAPSHOT SUCCESS [ 0.564 s]
[INFO] TomEE :: Examples :: Microprofile REST Client 10.1.6-SNAPSHOT SUCCESS [ 0.301 s]
[INFO] TomEE :: Examples :: Custom HealthCheck 10.1.6-SNAPSHOT SUCCESS [ 0.374 s]
[INFO] TomEE :: Examples :: Microprofile OpenAPI Reader 10.1.6-SNAPSHOT SUCCESS [ 0.517 s]
[INFO] TomEE :: Examples :: MTOM 10.1.6-SNAPSHOT .......... SUCCESS [ 1.216 s]
[INFO] TomEE :: Examples :: Multiple JPA providers 10.1.6-SNAPSHOT SUCCESS [ 0.667 s]
[INFO] TomEE :: Examples :: Multiple Arquillian Adapters 10.1.6-SNAPSHOT SUCCESS [ 0.644 s]
[INFO] TomEE :: Examples :: Multiple TomEE with Arquillian 10.1.6-SNAPSHOT SUCCESS [ 0.216 s]
[INFO] TomEE :: Examples :: Persistence Fragment 10.1.6-SNAPSHOT SUCCESS [ 0.341 s]
[INFO] TomEE :: Web Examples :: Pojo WS 10.1.6-SNAPSHOT ... SUCCESS [ 0.248 s]
[INFO] TomEE :: Examples :: Quartz 10.1.6-SNAPSHOT ........ SUCCESS [ 0.080 s]
[INFO] TomEE :: Examples :: Quartz :: Quartz Resource Adapter 10.1.6-SNAPSHOT SUCCESS [ 0.077 s]
[INFO] TomEE :: Examples :: Quartz :: Quartz Beans 10.1.6-SNAPSHOT SUCCESS [ 1.045 s]
[INFO] TomEE :: Examples :: DataSource Realm 10.1.6-SNAPSHOT SUCCESS [ 0.027 s]
[INFO] TomEE :: Examples :: Reloadable Persistence Unit Properties 10.1.6-SNAPSHOT SUCCESS [ 0.292 s]
[INFO] TomEE :: Web Examples :: Resource Declared In A Webapp 10.1.6-SNAPSHOT SUCCESS [ 0.111 s]
[INFO] TomEE :: Examples :: REST, Mockito and Application Composer 10.1.6-SNAPSHOT SUCCESS [ 0.342 s]
[INFO] TomEE :: Examples :: REST and Application Composer 10.1.6-SNAPSHOT SUCCESS [ 0.304 s]
[INFO] TomEE :: Examples :: REST CDI 10.1.6-SNAPSHOT ...... SUCCESS [ 0.377 s]
[INFO] TomEE :: Examples :: JAXRS and JAAS 10.1.6-SNAPSHOT SUCCESS [ 0.101 s]
[INFO] TomEE :: Examples :: REST and EJB 10.1.6-SNAPSHOT .. SUCCESS [ 0.342 s]
[INFO] TomEE :: Web Examples :: REST Example 10.1.6-SNAPSHOT SUCCESS [ 1.834 s]
[INFO] TomEE :: Web Examples :: REST Example With Application 10.1.6-SNAPSHOT SUCCESS [ 1.110 s]
[INFO] TomEE :: Examples :: REST XML JSON 10.1.6-SNAPSHOT . SUCCESS [ 0.326 s]
[INFO] TomEE :: Examples :: Basic Scala 10.1.6-SNAPSHOT ... SUCCESS [ 12.043 s]
[INFO] TomEE :: Examples :: ScheduleExpression 10.1.6-SNAPSHOT SUCCESS [ 0.381 s]
[INFO] TomEE :: Examples :: @Schedule Events 10.1.6-SNAPSHOT SUCCESS [ 0.213 s]
[INFO] TomEE :: Examples :: @Schedule Methods (Meta) 10.1.6-SNAPSHOT SUCCESS [ 0.315 s]
[INFO] TomEE :: Examples :: @Schedule Methods 10.1.6-SNAPSHOT SUCCESS [ 0.305 s]
[INFO] TomEE :: Examples :: Server Events 10.1.6-SNAPSHOT . SUCCESS [ 0.334 s]
[INFO] TomEE :: Examples :: Serverless Builder 10.1.6-SNAPSHOT SUCCESS [ 0.685 s]
[INFO] TomEE :: Examples :: Serverless Apache TomEE WebProfile 10.1.6-SNAPSHOT SUCCESS [ 0.692 s]
[INFO] TomEE :: Examples :: Serverless Apache TomEE MicroProfile 10.1.6-SNAPSHOT SUCCESS [ 0.842 s]
[INFO] TomEE :: Examples :: Serverless Apache TomEE Plume 10.1.6-SNAPSHOT SUCCESS [ 0.932 s]
[INFO] TomEE :: Examples :: Serverless Apache TomEE Plus 10.1.6-SNAPSHOT SUCCESS [ 0.759 s]
[INFO] TomEE :: Examples :: Singleton startup ordering 10.1.6-SNAPSHOT SUCCESS [ 0.390 s]
[INFO] TomEE :: Examples :: Simple CDI Interceptor 10.1.6-SNAPSHOT SUCCESS [ 0.212 s]
[INFO] TomEE :: Examples :: Simple EAR 10.1.6-SNAPSHOT .... SUCCESS [ 0.007 s]
[INFO] TomEE :: Examples :: Simple EAR :: Business Model 10.1.6-SNAPSHOT SUCCESS [ 0.068 s]
[INFO] TomEE :: Examples :: Simple EAR :: Business Logic 10.1.6-SNAPSHOT SUCCESS [ 0.274 s]
[INFO] TomEE :: Examples :: Simple EAR :: Webapp 10.1.6-SNAPSHOT SUCCESS [ 0.217 s]
[INFO] TomEE :: Examples :: Simple EAR :: EAR Packaging 10.1.6-SNAPSHOT SUCCESS [ 0.032 s]
[INFO] TomEE :: Examples :: Simple EAR :: Functional Tests 10.1.6-SNAPSHOT SUCCESS [ 0.723 s]
[INFO] TomEE :: Examples :: Simple CMP2 Entity 10.1.6-SNAPSHOT SUCCESS [ 0.249 s]
[INFO] TomEE :: Examples :: Simple JMS 10.1.6-SNAPSHOT .... SUCCESS [ 1.209 s]
[INFO] TomEE :: Examples :: Simple JMS Context 10.1.6-SNAPSHOT SUCCESS [ 0.996 s]
[INFO] TomEE :: Examples :: Simple MDB With a CDI Injection 10.1.6-SNAPSHOT SUCCESS [ 0.567 s]
[INFO] TomEE :: Examples :: Simple MDB Example 10.1.6-SNAPSHOT SUCCESS [ 0.593 s]
[INFO] TomEE :: Examples :: Simple MDB Using Deployment Descriptor Example 10.1.6-SNAPSHOT SUCCESS [ 0.559 s]
[INFO] TomEE :: Examples :: Simple Remote tomcat-users.xml 10.1.6-SNAPSHOT SUCCESS [ 0.410 s]
[INFO] TomEE :: Examples :: Simple REST 10.1.6-SNAPSHOT ... SUCCESS [ 0.362 s]
[INFO] TomEE :: Examples :: Simple Singleton 10.1.6-SNAPSHOT SUCCESS [ 0.231 s]
[INFO] TomEE :: Examples :: Simple Stateful Pojo 10.1.6-SNAPSHOT SUCCESS [ 0.227 s]
[INFO] TomEE :: Examples :: Simple Stateful Pojo Callbacks 10.1.6-SNAPSHOT SUCCESS [ 0.208 s]
[INFO] TomEE :: Examples :: Simple Stateless Pojo 10.1.6-SNAPSHOT SUCCESS [ 0.378 s]
[INFO] TomEE :: Examples :: Simple Stateless Pojo Callbacks 10.1.6-SNAPSHOT SUCCESS [ 0.285 s]
[INFO] TomEE :: Examples :: Simple Stateless With Deployment Descriptor 10.1.6-SNAPSHOT SUCCESS [ 0.215 s]
[INFO] TomEE :: Examples :: Simple Webservice 10.1.6-SNAPSHOT SUCCESS [ 0.486 s]
[INFO] TomEE :: Examples :: Simple Webservice Without Interface 10.1.6-SNAPSHOT SUCCESS [ 0.603 s]
[INFO] TomEE :: Examples :: Async Servlet 10.1.6-SNAPSHOT . SUCCESS [ 0.386 s]
[INFO] TomEE :: Web Examples :: Struts 10.1.6-SNAPSHOT .... SUCCESS [ 0.673 s]
[INFO] TomEE :: Examples :: Telephone Stateful Pojo 10.1.6-SNAPSHOT SUCCESS [ 0.233 s]
[INFO] TomEE :: Examples :: TestCase Injection 10.1.6-SNAPSHOT SUCCESS [ 0.313 s]
[INFO] TomEE :: Examples :: Testing Security (Meta) 10.1.6-SNAPSHOT SUCCESS [ 0.331 s]
[INFO] TomEE :: Examples :: Testing Security 10.1.6-SNAPSHOT SUCCESS [ 0.297 s]
[INFO] TomEE :: Examples :: Testing Security 10.1.6-SNAPSHOT SUCCESS [ 0.294 s]
[INFO] TomEE :: Examples :: Testing Security Service Provider 10.1.6-SNAPSHOT SUCCESS [ 0.362 s]
[INFO] TomEE :: Examples :: Testing Security Script Service Provider 10.1.6-SNAPSHOT SUCCESS [ 0.356 s]
[INFO] TomEE :: Examples :: Testing Transactions 10.1.6-SNAPSHOT SUCCESS [ 0.249 s]
[INFO] TomEE :: Examples :: Testing Transactions BMT 10.1.6-SNAPSHOT SUCCESS [ 0.242 s]
[INFO] TomEE :: TomEE :: IBM MQ AMQ Portability Examples :: MDB Example 1.0 SUCCESS [ 0.271 s]
[INFO] TomEE :: Examples :: Transaction Rollback 10.1.6-SNAPSHOT SUCCESS [ 0.316 s]
[INFO] TomEE :: Examples :: Troubleshooting 10.1.6-SNAPSHOT SUCCESS [ 0.276 s]
[INFO] TomEE :: Examples :: Webservice Attachments 10.1.6-SNAPSHOT SUCCESS [ 0.408 s]
[INFO] TomEE :: Examples :: Webservice Inheritance 10.1.6-SNAPSHOT SUCCESS [ 0.637 s]
[INFO] TomEE :: Web Examples :: EJB WebService with Security 10.1.6-SNAPSHOT SUCCESS [ 0.615 s]
[INFO] TomEE :: Web Examples :: EJB WebService with SSL Client Certificate 10.1.6-SNAPSHOT SUCCESS [ 5.940 s]
[INFO] TomEE :: Web Examples :: EJB WebService with WS-Security 10.1.6-SNAPSHOT SUCCESS [ 6.256 s]
[INFO] TomEE :: Web Examples :: EJB WebService WS Security with resources.xml 10.1.6-SNAPSHOT SUCCESS [ 0.877 s]
[INFO] TomEE :: Examples :: Web Service Handlers 10.1.6-SNAPSHOT SUCCESS [ 0.652 s]
[INFO] TomEE :: Examples :: @WebService Holder 10.1.6-SNAPSHOT SUCCESS [ 0.698 s]
[INFO] TomEE :: Web Examples :: Moviefun 10.1.6-SNAPSHOT .. SUCCESS [ 0.797 s]
[INFO] TomEE :: Web Examples :: Moviefun Rest 10.1.6-SNAPSHOT SUCCESS [ 2.224 s]
[INFO] TomEE :: Examples :: Resources/JMX Example 10.1.6-SNAPSHOT SUCCESS [ 0.063 s]
[INFO] TomEE :: Examples :: Resources/JMX Example :: EJB Module 10.1.6-SNAPSHOT FAILURE [ 0.082 s]
[INFO] TomEE :: Examples :: Resources/JMX Example :: EAR Module 10.1.6-SNAPSHOT SKIPPED
[INFO] TomEE :: Examples :: WebSocket with tls and basic auth Example 10.1.6-SNAPSHOT SKIPPED
[INFO] TomEE :: Examples :: Concurrency utilities example 10.1.6-SNAPSHOT SKIPPED
[INFO] TomEE :: Examples :: Microprofile JSONB Configuration 10.1.6-SNAPSHOT SKIPPED
[INFO] TomEE :: Examples :: Microprofile JSONB Custom Serializer/Deserializer 10.1.6-SNAPSHOT SKIPPED
[INFO] TomEE :: Examples :: Azure deployment example 10.1.6-SNAPSHOT SKIPPED
[INFO] TomEE :: Examples :: XA Datasource configuration and usage 10.1.6-SNAPSHOT SKIPPED
[INFO] TomEE :: Examples :: Websocket JMS 10.1.6-SNAPSHOT . SKIPPED
[INFO] TomEE :: Web Examples :: Multi-Broker 10.1.6-SNAPSHOT SKIPPED
[INFO] TomEE :: Examples :: Jakarta Security tomcat-user.xml Identity Store 10.1.6-SNAPSHOT SKIPPED
[INFO] TomEE :: Examples :: Jakarta Security custom Identity Store 10.1.6-SNAPSHOT SKIPPED
[INFO] TomEE :: Examples :: Jakarta Security OpenID Connect 10.1.6-SNAPSHOT SKIPPED
[INFO] TomEE :: Examples 10.1.6-SNAPSHOT .................. SKIPPED
[INFO] TomEE :: Assembly :: All In One EJB Lite jar 10.1.6-SNAPSHOT SKIPPED
[INFO] TomEE :: Utils :: TomEE Webapps-based Deployer EJB 10.1.6-SNAPSHOT SKIPPED
[INFO] TomEE :: TCK 10.1.6-SNAPSHOT ....................... SKIPPED
[INFO] TomEE :: TCK :: Common 10.1.6-SNAPSHOT ............. SKIPPED
[INFO] TomEE :: TCK :: CDI Embedded 10.1.6-SNAPSHOT ....... SKIPPED
[INFO] TomEE :: TCK :: CDI TomEE 10.1.6-SNAPSHOT .......... SKIPPED
[INFO] TomEE :: TCK :: CDI TCK Signature Tests 10.1.6-SNAPSHOT SKIPPED
[INFO] TomEE :: TCK :: Bean Validation Embedded 10.1.6-SNAPSHOT SKIPPED
[INFO] TomEE :: TCK :: Bean Validation TomEE 10.1.6-SNAPSHOT SKIPPED
[INFO] TomEE :: TCK :: Bean Validation TCK Signature tests 10.1.6-SNAPSHOT SKIPPED
[INFO] TomEE :: TCK :: JSON-P Standalone 10.1.6-SNAPSHOT .. SKIPPED
[INFO] TomEE :: TCK :: JSON-P Signature Tests 10.1.6-SNAPSHOT SKIPPED
[INFO] TomEE :: TCK :: JSON-B Standalone 10.1.6-SNAPSHOT .. SKIPPED
[INFO] TomEE :: TCK :: JSON-B Signature Tests 10.1.6-SNAPSHOT SKIPPED
[INFO] TomEE :: TCK :: Concurrency Standalone 10.1.6-SNAPSHOT SKIPPED
[INFO] TomEE :: TCK :: Concurrency Signature Tests 10.1.6-SNAPSHOT SKIPPED
[INFO] TomEE :: TCK :: MicroProfile 10.1.6-SNAPSHOT ....... SKIPPED
[INFO] TomEE :: TCK :: MicroProfile Config TCK 10.1.6-SNAPSHOT SKIPPED
[INFO] TomEE :: TCK :: MicroProfile JWT TCK 10.1.6-SNAPSHOT SKIPPED
[INFO] TomEE :: TCK :: MicroProfile Health TCK 10.1.6-SNAPSHOT SKIPPED
[INFO] TomEE :: TCK :: MicroProfile Metrics TCK 10.1.6-SNAPSHOT SKIPPED
[INFO] TomEE :: TCK :: MicroProfile Rest Client TCK 10.1.6-SNAPSHOT SKIPPED
[INFO] TomEE :: TCK :: MicroProfile Open API TCK 10.1.6-SNAPSHOT SKIPPED
[INFO] TomEE :: TCK :: MicroProfile Fault Tolerance TCK 10.1.6-SNAPSHOT SKIPPED
[INFO] TomEE :: TCK :: MicroProfile Open Telemetry TCK 10.1.6-SNAPSHOT SKIPPED
[INFO] TomEE :: TCK :: JAX-RS TCK 10.1.6-SNAPSHOT ......... SKIPPED
[INFO] TomEE :: TCK :: JAX-RS TCK :: Tests 10.1.6-SNAPSHOT SKIPPED
[INFO] TomEE :: TCK :: JAX-RS TCK :: Tests Embedded 10.1.6-SNAPSHOT SKIPPED
[INFO] TomEE :: TCK :: JAX-RS TCK :: Signature Test 10.1.6-SNAPSHOT SKIPPED
[INFO] TomEE :: Arquillian Adaptors Parent :: Tests 10.1.6-SNAPSHOT SKIPPED
[INFO] TomEE :: Arquillian Adaptors Parent :: Tests :: Web Profile 10.1.6-SNAPSHOT SKIPPED
[INFO] TomEE :: Arquillian Adaptors Parent :: Tests :: JAXRS 10.1.6-SNAPSHOT SKIPPED
[INFO] TomEE :: Arquillian Adaptors Parent :: Tests :: JAXWS 10.1.6-SNAPSHOT SKIPPED
[INFO] TomEE :: Arquillian Adaptors Parent :: Tests :: JMS 10.1.6-SNAPSHOT SKIPPED
[INFO] TomEE :: Arquillian Adaptors Parent :: Tests :: Configuration Tests 10.1.6-SNAPSHOT SKIPPED
[INFO] TomEE :: Arquillian Adaptors Parent :: Sample :: Moviefun 10.1.6-SNAPSHOT SKIPPED
[INFO] TomEE :: Arquillian Adaptors Parent :: Arquillian TCK 10.1.6-SNAPSHOT SKIPPED
[INFO] TomEE :: Arquillian :: Functional Tests 10.1.6-SNAPSHOT SKIPPED
[INFO] TomEE :: Arquillian :: Functional Tests :: Spring CXF Test 10.1.6-SNAPSHOT SKIPPED
[INFO] TomEE :: Utils :: Provisionning 10.1.6-SNAPSHOT .... SKIPPED
[INFO] TomEE :: Utils :: Log4j2 10.1.6-SNAPSHOT ........... SKIPPED
[INFO] TomEE :: TomEE :: webaccess 10.1.6-SNAPSHOT ........ SKIPPED
[INFO] TomEE :: TomEE :: Overlay Runner 10.1.6-SNAPSHOT ... SKIPPED
[INFO] ------------------------------------------------------------------------
[INFO] BUILD FAILURE
[INFO] ------------------------------------------------------------------------
[INFO] Total time: 11:59 min
[INFO] Finished at: 2026-06-02T06:58:34Z
[INFO] ------------------------------------------------------------------------
[WARNING]
[WARNING] Plugin validation issues were detected in 13 plugin(s)
[WARNING]
[WARNING] * org.apache.maven.plugins:maven-jar-plugin:3.0.2
[WARNING] * org.apache.maven.plugins:maven-compiler-plugin:3.14.1
[WARNING] * org.apache.maven.plugins:maven-compiler-plugin:3.10.1
[WARNING] * org.scalatest:scalatest-maven-plugin:2.2.0
[WARNING] * org.apache.maven.plugins:maven-resources-plugin:3.3.0
[WARNING] * org.apache.openjpa:openjpa-maven-plugin:4.1.1
[WARNING] * org.apache.maven.plugins:maven-surefire-plugin:3.5.3
[WARNING] * org.apache.maven.plugins:maven-war-plugin:3.3.2
[WARNING] * org.apache.maven.plugins:maven-assembly-plugin:2.4.1
[WARNING] * com.googlecode.jslint4java:jslint4java-maven-plugin:2.0.5
[WARNING] * org.apache.tomee.patch:tomee-patch-plugin:0.10
[WARNING] * org.apache.felix:maven-bundle-plugin:6.0.2
[WARNING] * org.apache.maven.plugins:maven-install-plugin:3.0.0-M1
[WARNING]
[WARNING] For more or less details, use 'maven.plugin.validation' property with one of the values (case insensitive): [BRIEF, DEFAULT, VERBOSE]
[WARNING]
[ERROR] Failed to execute goal on project resources-jmx-ejb: Could not resolve dependencies for project org.superbiz:resources-jmx-ejb:ejb:10.1.6-SNAPSHOT: The following artifacts could not be resolved: org.apache.tomee:arquillian-tomee-remote:jar:10.1.5-SNAPSHOT (absent), org.apache.tomee:openejb-provisionning:jar:10.1.5-SNAPSHOT (absent), org.apache.tomee:ziplock:jar:10.1.5-SNAPSHOT (absent): org.apache.tomee:arquillian-tomee-remote:jar:10.1.5-SNAPSHOT was not found in https://repository.apache.org/snapshots during a previous attempt. This failure was cached in the local repository and resolution is not reattempted until the update interval of apache-m2-snapshot has elapsed or updates are forced -> [Help 1]
[ERROR]
[ERROR] To see the full stack trace of the errors, re-run Maven with the -e switch.
[ERROR] Re-run Maven using the -X switch to enable full debug logging.
[ERROR]
[ERROR] For more information about the errors and possible solutions, please read the following articles:
[ERROR] [Help 1] http://cwiki.apache.org/confluence/display/MAVEN/DependencyResolutionException
[ERROR]
[ERROR] After correcting the problems, you can resume the build with the command
[ERROR] mvn <args> -rf :resources-jmx-ejb
Build step 'Execute shell' marked build as failure
INFO: Processing JUnit
INFO: [JUnit] - No test report file(s) were found with the pattern '**/target/surefire-reports/TEST-*.xml' relative to '<https://ci-builds.apache.org/job/Tomee/job/tomee-10-build-full-tck/ws/'> for the testing framework 'JUnit'.
Did you enter a pattern relative to (and within) the workspace directory?
Did you generate the result report(s) for 'JUnit'?"
WARNING: All test reports are empty.
[Checks API] No suitable checks publisher found.
INFO: Setting the build status to SUCCESS
Build failed in Jenkins: TomEE » tomee-10-build-full-tck #78
Posted by Apache Jenkins Server <je...@builds.apache.org>.
See <https://ci-builds.apache.org/job/Tomee/job/tomee-10-build-full-tck/78/display/redirect?page=changes>
Changes:
[Markus Jung] fix BasicSlf4jWebappTest after dependency updates
------------------------------------------
[...truncated 1.10 MiB...]
[INFO] TomEE :: Connector Examples :: Connector in EAR :: Connector Impl 10.1.6-SNAPSHOT SUCCESS [ 0.382 s]
[INFO] TomEE :: Connector Examples :: Connector in EAR :: RAR Packaging 10.1.6-SNAPSHOT SUCCESS [ 0.409 s]
[INFO] TomEE :: Connector Examples :: Connector in EAR :: Sample WAR 10.1.6-SNAPSHOT SUCCESS [ 0.262 s]
[INFO] TomEE :: Connector Examples :: Connector in EAR :: EAR Packaging 10.1.6-SNAPSHOT SUCCESS [ 0.329 s]
[INFO] TomEE :: Connector Examples :: Connector in EAR :: Functional Tests 10.1.6-SNAPSHOT SUCCESS [ 1.223 s]
[INFO] TomEE :: Connector Examples :: Connector in WAR 10.1.6-SNAPSHOT SUCCESS [ 1.058 s]
[INFO] TomEE :: Examples :: Cucumber JVM 10.1.6-SNAPSHOT .. SUCCESS [ 1.626 s]
[INFO] TomEE :: Examples :: Expanded support for Env Entries 10.1.6-SNAPSHOT SUCCESS [ 0.392 s]
[INFO] TomEE :: Examples :: Datasource Ciphered Password 10.1.6-SNAPSHOT SUCCESS [ 0.262 s]
[INFO] TomEE :: Examples :: Datasource Definition 10.1.6-SNAPSHOT SUCCESS [ 0.530 s]
[INFO] TomEE :: Examples :: Datasource Versioning 10.1.6-SNAPSHOT SUCCESS [ 1.051 s]
[INFO] TomEE :: Examples :: Decorators 10.1.6-SNAPSHOT .... SUCCESS [ 0.519 s]
[INFO] TomEE :: Examples :: Dynamic DAO Implementation 10.1.6-SNAPSHOT SUCCESS [ 0.447 s]
[INFO] TomEE :: Examples :: Dynamic Datasource Routing 10.1.6-SNAPSHOT SUCCESS [ 0.506 s]
[INFO] TomEE :: Examples :: Dynamic Implementation 10.1.6-SNAPSHOT SUCCESS [ 0.242 s]
[INFO] TomEE :: Examples :: Dynamic MBean Proxy 10.1.6-SNAPSHOT SUCCESS [ 0.277 s]
[INFO] TomEE :: Examples :: Ear Testing 10.1.6-SNAPSHOT ... SUCCESS [ 0.005 s]
[INFO] TomEE :: Examples :: Ear Testing :: Business Model 10.1.6-SNAPSHOT SUCCESS [ 0.102 s]
[INFO] TomEE :: Examples :: Ear Testing :: Business Logic 10.1.6-SNAPSHOT SUCCESS [ 0.210 s]
[INFO] TomEE :: Web Examples :: EJB Examples War 10.1.6-SNAPSHOT SUCCESS [ 0.253 s]
[INFO] TomEE :: Web Examples :: EJB Remote Call 10.1.6-SNAPSHOT SUCCESS [ 0.189 s]
[INFO] TomEE :: Web Examples :: EJB Remote Call 10.1.6-SNAPSHOT SUCCESS [ 0.161 s]
[INFO] TomEE :: Web Examples :: EJB WebService 10.1.6-SNAPSHOT SUCCESS [ 0.079 s]
[INFO] TomEE :: Arquillian Adaptors Parent :: OpenEJB Container 10.1.6-SNAPSHOT SUCCESS [ 1.872 s]
[INFO] TomEE :: Examples :: Groovy CDI 10.1.6-SNAPSHOT .... SUCCESS [ 1.968 s]
[INFO] TomEE :: Examples :: Groovy JPA 10.1.6-SNAPSHOT .... SUCCESS [ 0.925 s]
[INFO] TomEE :: Examples :: Hello World - Weblogic 10.1.6-SNAPSHOT SUCCESS [ 0.248 s]
[INFO] TomEE :: Examples :: @Resource jakarta.jms.ConnectionFactory 10.1.6-SNAPSHOT SUCCESS [ 0.438 s]
[INFO] TomEE :: Examples :: @Resource DataSource Injection 10.1.6-SNAPSHOT SUCCESS [ 0.248 s]
[INFO] TomEE :: Examples :: @EJB Injection 10.1.6-SNAPSHOT SUCCESS [ 0.247 s]
[INFO] TomEE :: Examples :: @PersistenceContext EntityManager Injection 10.1.6-SNAPSHOT SUCCESS [ 0.292 s]
[INFO] TomEE :: Examples :: @Resource env-entry Injection 10.1.6-SNAPSHOT SUCCESS [ 0.291 s]
[INFO] TomEE :: Examples :: Interceptors 10.1.6-SNAPSHOT .. SUCCESS [ 0.247 s]
[INFO] TomEE :: Examples :: JakartaMail API 10.1.6-SNAPSHOT SUCCESS [ 0.900 s]
[INFO] TomEE :: Examples :: Jakarta Mail API with Velocity 10.1.6-SNAPSHOT SUCCESS [ 1.811 s]
[INFO] TomEE :: Web Examples :: Java Modules (Simple REST resource) 10.1.6-SNAPSHOT SUCCESS [ 1.256 s]
[INFO] TomEE :: Examples :: JAXRS Filter 10.1.6-SNAPSHOT .. SUCCESS [ 0.738 s]
[INFO] TomEE :: Examples :: JAXRS JSON Provider with Jettison 10.1.6-SNAPSHOT SUCCESS [ 0.644 s]
[INFO] TomEE :: Examples :: JPA with EclipseLink 10.1.6-SNAPSHOT SUCCESS [ 0.609 s]
[INFO] TomEE :: Utils :: Core Hibernate 10.1.6-SNAPSHOT ... SUCCESS [ 0.376 s]
[INFO] TomEE :: Examples :: JPA with Hibernate 10.1.6-SNAPSHOT SUCCESS [ 0.958 s]
[INFO] TomEE :: Examples :: JPA with Hibernate and arquillian 10.1.6-SNAPSHOT SUCCESS [ 0.311 s]
[INFO] TomEE :: Examples :: JPA @Enumerated 10.1.6-SNAPSHOT SUCCESS [ 0.231 s]
[INFO] TomEE :: Web Examples :: JSF - CDI and EJB 10.1.6-SNAPSHOT SUCCESS [ 0.092 s]
[INFO] TomEE :: Examples :: JUnit 5 :: Application Composer 10.1.6-SNAPSHOT SUCCESS [ 0.235 s]
[INFO] TomEE :: Examples :: JUnit 5 :: Multiple TomEE with Arquillian 10.1.6-SNAPSHOT SUCCESS [ 0.161 s]
[INFO] TomEE :: Examples :: JUnit 5 :: Simple Websockets with Arquillian 10.1.6-SNAPSHOT SUCCESS [ 0.427 s]
[INFO] TomEE :: Examples :: @EJB Lookup 10.1.6-SNAPSHOT ... SUCCESS [ 0.224 s]
[INFO] TomEE :: Examples :: EJB Lookup with descriptor 10.1.6-SNAPSHOT SUCCESS [ 0.303 s]
[INFO] TomEE :: Examples :: Movies Complete (Meta) 10.1.6-SNAPSHOT SUCCESS [ 0.345 s]
[INFO] TomEE :: Examples :: Movies Complete 10.1.6-SNAPSHOT SUCCESS [ 0.230 s]
[INFO] TomEE :: Examples :: MicroProfile Config 10.1.6-SNAPSHOT SUCCESS [ 0.336 s]
[INFO] TomEE :: Examples :: MicroProfile Config Source Database 10.1.6-SNAPSHOT SUCCESS [ 1.856 s]
[INFO] TomEE :: Examples :: Microprofile Fault Tolerance :: Fallback 10.1.6-SNAPSHOT SUCCESS [ 0.249 s]
[INFO] TomEE :: Examples :: Microprofile Fault Tolerance :: Retry 10.1.6-SNAPSHOT SUCCESS [ 0.462 s]
[INFO] TomEE :: Examples :: Microprofile Fault Tolerance :: Timeout 10.1.6-SNAPSHOT SUCCESS [ 0.250 s]
[INFO] TomEE :: Examples :: MicroProfile JWT Bean Validation 10.1.6-SNAPSHOT SUCCESS [ 0.655 s]
[INFO] TomEE :: Examples :: MicroProfile JWT Bean Validation, Strongly-typed Annotations 10.1.6-SNAPSHOT SUCCESS [ 0.435 s]
[INFO] TomEE :: Examples :: Microprofile Metrics Counted 10.1.6-SNAPSHOT SUCCESS [ 0.576 s]
[INFO] TomEE :: Examples :: Microprofile Metrics Histogram 10.1.6-SNAPSHOT SUCCESS [ 0.313 s]
[INFO] TomEE :: Examples :: Microprofile Metrics Timed 10.1.6-SNAPSHOT SUCCESS [ 0.247 s]
[INFO] TomEE :: Examples :: MicroProfile Metrics Gauge 10.1.6-SNAPSHOT SUCCESS [ 0.361 s]
[INFO] TomEE :: Examples :: MicroProfile Metrics Metered 10.1.6-SNAPSHOT SUCCESS [ 0.258 s]
[INFO] TomEE :: Examples :: MP REST JWT JWK 10.1.6-SNAPSHOT SUCCESS [ 0.659 s]
[INFO] TomEE :: Examples :: MP REST JWT PRINCIPAL 10.1.6-SNAPSHOT SUCCESS [ 0.613 s]
[INFO] TomEE :: Examples :: MP REST JWT Public Key 10.1.6-SNAPSHOT SUCCESS [ 0.486 s]
[INFO] TomEE :: Examples :: Microprofile REST Client 10.1.6-SNAPSHOT SUCCESS [ 0.323 s]
[INFO] TomEE :: Examples :: Custom HealthCheck 10.1.6-SNAPSHOT SUCCESS [ 0.277 s]
[INFO] TomEE :: Examples :: Microprofile OpenAPI Reader 10.1.6-SNAPSHOT SUCCESS [ 0.694 s]
[INFO] TomEE :: Examples :: MTOM 10.1.6-SNAPSHOT .......... SUCCESS [ 1.056 s]
[INFO] TomEE :: Examples :: Multiple JPA providers 10.1.6-SNAPSHOT SUCCESS [ 0.762 s]
[INFO] TomEE :: Examples :: Multiple Arquillian Adapters 10.1.6-SNAPSHOT SUCCESS [ 0.682 s]
[INFO] TomEE :: Examples :: Multiple TomEE with Arquillian 10.1.6-SNAPSHOT SUCCESS [ 0.336 s]
[INFO] TomEE :: Examples :: Persistence Fragment 10.1.6-SNAPSHOT SUCCESS [ 0.222 s]
[INFO] TomEE :: Web Examples :: Pojo WS 10.1.6-SNAPSHOT ... SUCCESS [ 0.116 s]
[INFO] TomEE :: Examples :: Quartz 10.1.6-SNAPSHOT ........ SUCCESS [ 0.018 s]
[INFO] TomEE :: Examples :: Quartz :: Quartz Resource Adapter 10.1.6-SNAPSHOT SUCCESS [ 0.107 s]
[INFO] TomEE :: Examples :: Quartz :: Quartz Beans 10.1.6-SNAPSHOT SUCCESS [ 0.859 s]
[INFO] TomEE :: Examples :: DataSource Realm 10.1.6-SNAPSHOT SUCCESS [ 0.029 s]
[INFO] TomEE :: Examples :: Reloadable Persistence Unit Properties 10.1.6-SNAPSHOT SUCCESS [ 0.220 s]
[INFO] TomEE :: Web Examples :: Resource Declared In A Webapp 10.1.6-SNAPSHOT SUCCESS [ 0.122 s]
[INFO] TomEE :: Examples :: REST, Mockito and Application Composer 10.1.6-SNAPSHOT SUCCESS [ 0.284 s]
[INFO] TomEE :: Examples :: REST and Application Composer 10.1.6-SNAPSHOT SUCCESS [ 0.238 s]
[INFO] TomEE :: Examples :: REST CDI 10.1.6-SNAPSHOT ...... SUCCESS [ 0.372 s]
[INFO] TomEE :: Examples :: JAXRS and JAAS 10.1.6-SNAPSHOT SUCCESS [ 0.253 s]
[INFO] TomEE :: Examples :: REST and EJB 10.1.6-SNAPSHOT .. SUCCESS [ 1.474 s]
[INFO] TomEE :: Web Examples :: REST Example 10.1.6-SNAPSHOT SUCCESS [ 4.906 s]
[INFO] TomEE :: Web Examples :: REST Example With Application 10.1.6-SNAPSHOT SUCCESS [ 0.913 s]
[INFO] TomEE :: Examples :: REST XML JSON 10.1.6-SNAPSHOT . SUCCESS [ 0.332 s]
[INFO] TomEE :: Examples :: Basic Scala 10.1.6-SNAPSHOT ... SUCCESS [ 14.337 s]
[INFO] TomEE :: Examples :: ScheduleExpression 10.1.6-SNAPSHOT SUCCESS [ 0.251 s]
[INFO] TomEE :: Examples :: @Schedule Events 10.1.6-SNAPSHOT SUCCESS [ 0.361 s]
[INFO] TomEE :: Examples :: @Schedule Methods (Meta) 10.1.6-SNAPSHOT SUCCESS [ 0.273 s]
[INFO] TomEE :: Examples :: @Schedule Methods 10.1.6-SNAPSHOT SUCCESS [ 0.251 s]
[INFO] TomEE :: Examples :: Server Events 10.1.6-SNAPSHOT . SUCCESS [ 0.359 s]
[INFO] TomEE :: Examples :: Serverless Builder 10.1.6-SNAPSHOT SUCCESS [ 0.652 s]
[INFO] TomEE :: Examples :: Serverless Apache TomEE WebProfile 10.1.6-SNAPSHOT SUCCESS [ 1.385 s]
[INFO] TomEE :: Examples :: Serverless Apache TomEE MicroProfile 10.1.6-SNAPSHOT SUCCESS [ 0.944 s]
[INFO] TomEE :: Examples :: Serverless Apache TomEE Plume 10.1.6-SNAPSHOT SUCCESS [ 0.926 s]
[INFO] TomEE :: Examples :: Serverless Apache TomEE Plus 10.1.6-SNAPSHOT SUCCESS [ 0.884 s]
[INFO] TomEE :: Examples :: Singleton startup ordering 10.1.6-SNAPSHOT SUCCESS [ 0.379 s]
[INFO] TomEE :: Examples :: Simple CDI Interceptor 10.1.6-SNAPSHOT SUCCESS [ 0.271 s]
[INFO] TomEE :: Examples :: Simple EAR 10.1.6-SNAPSHOT .... SUCCESS [ 0.021 s]
[INFO] TomEE :: Examples :: Simple EAR :: Business Model 10.1.6-SNAPSHOT SUCCESS [ 0.084 s]
[INFO] TomEE :: Examples :: Simple EAR :: Business Logic 10.1.6-SNAPSHOT SUCCESS [ 0.227 s]
[INFO] TomEE :: Examples :: Simple EAR :: Webapp 10.1.6-SNAPSHOT SUCCESS [ 0.716 s]
[INFO] TomEE :: Examples :: Simple EAR :: EAR Packaging 10.1.6-SNAPSHOT SUCCESS [ 0.127 s]
[INFO] TomEE :: Examples :: Simple EAR :: Functional Tests 10.1.6-SNAPSHOT SUCCESS [ 1.438 s]
[INFO] TomEE :: Examples :: Simple CMP2 Entity 10.1.6-SNAPSHOT SUCCESS [ 0.521 s]
[INFO] TomEE :: Examples :: Simple JMS 10.1.6-SNAPSHOT .... SUCCESS [ 1.046 s]
[INFO] TomEE :: Examples :: Simple JMS Context 10.1.6-SNAPSHOT SUCCESS [ 0.964 s]
[INFO] TomEE :: Examples :: Simple MDB With a CDI Injection 10.1.6-SNAPSHOT SUCCESS [ 0.445 s]
[INFO] TomEE :: Examples :: Simple MDB Example 10.1.6-SNAPSHOT SUCCESS [ 0.627 s]
[INFO] TomEE :: Examples :: Simple MDB Using Deployment Descriptor Example 10.1.6-SNAPSHOT SUCCESS [ 0.445 s]
[INFO] TomEE :: Examples :: Simple Remote tomcat-users.xml 10.1.6-SNAPSHOT SUCCESS [ 0.171 s]
[INFO] TomEE :: Examples :: Simple REST 10.1.6-SNAPSHOT ... SUCCESS [ 0.279 s]
[INFO] TomEE :: Examples :: Simple Singleton 10.1.6-SNAPSHOT SUCCESS [ 0.319 s]
[INFO] TomEE :: Examples :: Simple Stateful Pojo 10.1.6-SNAPSHOT SUCCESS [ 0.281 s]
[INFO] TomEE :: Examples :: Simple Stateful Pojo Callbacks 10.1.6-SNAPSHOT SUCCESS [ 0.255 s]
[INFO] TomEE :: Examples :: Simple Stateless Pojo 10.1.6-SNAPSHOT SUCCESS [ 0.196 s]
[INFO] TomEE :: Examples :: Simple Stateless Pojo Callbacks 10.1.6-SNAPSHOT SUCCESS [ 0.203 s]
[INFO] TomEE :: Examples :: Simple Stateless With Deployment Descriptor 10.1.6-SNAPSHOT SUCCESS [ 0.195 s]
[INFO] TomEE :: Examples :: Simple Webservice 10.1.6-SNAPSHOT SUCCESS [ 0.473 s]
[INFO] TomEE :: Examples :: Simple Webservice Without Interface 10.1.6-SNAPSHOT SUCCESS [ 0.440 s]
[INFO] TomEE :: Examples :: Async Servlet 10.1.6-SNAPSHOT . SUCCESS [ 0.308 s]
[INFO] TomEE :: Web Examples :: Struts 10.1.6-SNAPSHOT .... SUCCESS [ 1.115 s]
[INFO] TomEE :: Examples :: Telephone Stateful Pojo 10.1.6-SNAPSHOT SUCCESS [ 0.428 s]
[INFO] TomEE :: Examples :: TestCase Injection 10.1.6-SNAPSHOT SUCCESS [ 0.297 s]
[INFO] TomEE :: Examples :: Testing Security (Meta) 10.1.6-SNAPSHOT SUCCESS [ 0.253 s]
[INFO] TomEE :: Examples :: Testing Security 10.1.6-SNAPSHOT SUCCESS [ 0.331 s]
[INFO] TomEE :: Examples :: Testing Security 10.1.6-SNAPSHOT SUCCESS [ 0.416 s]
[INFO] TomEE :: Examples :: Testing Security Service Provider 10.1.6-SNAPSHOT SUCCESS [ 0.543 s]
[INFO] TomEE :: Examples :: Testing Security Script Service Provider 10.1.6-SNAPSHOT SUCCESS [ 0.271 s]
[INFO] TomEE :: Examples :: Testing Transactions 10.1.6-SNAPSHOT SUCCESS [ 0.196 s]
[INFO] TomEE :: Examples :: Testing Transactions BMT 10.1.6-SNAPSHOT SUCCESS [ 0.214 s]
[INFO] TomEE :: TomEE :: IBM MQ AMQ Portability Examples :: MDB Example 1.0 SUCCESS [ 0.429 s]
[INFO] TomEE :: Examples :: Transaction Rollback 10.1.6-SNAPSHOT SUCCESS [ 0.276 s]
[INFO] TomEE :: Examples :: Troubleshooting 10.1.6-SNAPSHOT SUCCESS [ 0.281 s]
[INFO] TomEE :: Examples :: Webservice Attachments 10.1.6-SNAPSHOT SUCCESS [ 0.347 s]
[INFO] TomEE :: Examples :: Webservice Inheritance 10.1.6-SNAPSHOT SUCCESS [ 0.451 s]
[INFO] TomEE :: Web Examples :: EJB WebService with Security 10.1.6-SNAPSHOT SUCCESS [ 0.693 s]
[INFO] TomEE :: Web Examples :: EJB WebService with SSL Client Certificate 10.1.6-SNAPSHOT SUCCESS [ 4.815 s]
[INFO] TomEE :: Web Examples :: EJB WebService with WS-Security 10.1.6-SNAPSHOT SUCCESS [ 5.277 s]
[INFO] TomEE :: Web Examples :: EJB WebService WS Security with resources.xml 10.1.6-SNAPSHOT SUCCESS [ 0.793 s]
[INFO] TomEE :: Examples :: Web Service Handlers 10.1.6-SNAPSHOT SUCCESS [ 0.587 s]
[INFO] TomEE :: Examples :: @WebService Holder 10.1.6-SNAPSHOT SUCCESS [ 0.547 s]
[INFO] TomEE :: Web Examples :: Moviefun 10.1.6-SNAPSHOT .. SUCCESS [ 1.380 s]
[INFO] TomEE :: Web Examples :: Moviefun Rest 10.1.6-SNAPSHOT SUCCESS [ 3.270 s]
[INFO] TomEE :: Examples :: Resources/JMX Example 10.1.6-SNAPSHOT SUCCESS [ 0.059 s]
[INFO] TomEE :: Examples :: Resources/JMX Example :: EJB Module 10.1.6-SNAPSHOT FAILURE [ 0.118 s]
[INFO] TomEE :: Examples :: Resources/JMX Example :: EAR Module 10.1.6-SNAPSHOT SKIPPED
[INFO] TomEE :: Examples :: WebSocket with tls and basic auth Example 10.1.6-SNAPSHOT SKIPPED
[INFO] TomEE :: Examples :: Concurrency utilities example 10.1.6-SNAPSHOT SKIPPED
[INFO] TomEE :: Examples :: Microprofile JSONB Configuration 10.1.6-SNAPSHOT SKIPPED
[INFO] TomEE :: Examples :: Microprofile JSONB Custom Serializer/Deserializer 10.1.6-SNAPSHOT SKIPPED
[INFO] TomEE :: Examples :: Azure deployment example 10.1.6-SNAPSHOT SKIPPED
[INFO] TomEE :: Examples :: XA Datasource configuration and usage 10.1.6-SNAPSHOT SKIPPED
[INFO] TomEE :: Examples :: Websocket JMS 10.1.6-SNAPSHOT . SKIPPED
[INFO] TomEE :: Web Examples :: Multi-Broker 10.1.6-SNAPSHOT SKIPPED
[INFO] TomEE :: Examples :: Jakarta Security tomcat-user.xml Identity Store 10.1.6-SNAPSHOT SKIPPED
[INFO] TomEE :: Examples :: Jakarta Security custom Identity Store 10.1.6-SNAPSHOT SKIPPED
[INFO] TomEE :: Examples :: Jakarta Security OpenID Connect 10.1.6-SNAPSHOT SKIPPED
[INFO] TomEE :: Examples 10.1.6-SNAPSHOT .................. SKIPPED
[INFO] TomEE :: Assembly :: All In One EJB Lite jar 10.1.6-SNAPSHOT SKIPPED
[INFO] TomEE :: Utils :: TomEE Webapps-based Deployer EJB 10.1.6-SNAPSHOT SKIPPED
[INFO] TomEE :: TCK 10.1.6-SNAPSHOT ....................... SKIPPED
[INFO] TomEE :: TCK :: Common 10.1.6-SNAPSHOT ............. SKIPPED
[INFO] TomEE :: TCK :: CDI Embedded 10.1.6-SNAPSHOT ....... SKIPPED
[INFO] TomEE :: TCK :: CDI TomEE 10.1.6-SNAPSHOT .......... SKIPPED
[INFO] TomEE :: TCK :: CDI TCK Signature Tests 10.1.6-SNAPSHOT SKIPPED
[INFO] TomEE :: TCK :: Bean Validation Embedded 10.1.6-SNAPSHOT SKIPPED
[INFO] TomEE :: TCK :: Bean Validation TomEE 10.1.6-SNAPSHOT SKIPPED
[INFO] TomEE :: TCK :: Bean Validation TCK Signature tests 10.1.6-SNAPSHOT SKIPPED
[INFO] TomEE :: TCK :: JSON-P Standalone 10.1.6-SNAPSHOT .. SKIPPED
[INFO] TomEE :: TCK :: JSON-P Signature Tests 10.1.6-SNAPSHOT SKIPPED
[INFO] TomEE :: TCK :: JSON-B Standalone 10.1.6-SNAPSHOT .. SKIPPED
[INFO] TomEE :: TCK :: JSON-B Signature Tests 10.1.6-SNAPSHOT SKIPPED
[INFO] TomEE :: TCK :: Concurrency Standalone 10.1.6-SNAPSHOT SKIPPED
[INFO] TomEE :: TCK :: Concurrency Signature Tests 10.1.6-SNAPSHOT SKIPPED
[INFO] TomEE :: TCK :: MicroProfile 10.1.6-SNAPSHOT ....... SKIPPED
[INFO] TomEE :: TCK :: MicroProfile Config TCK 10.1.6-SNAPSHOT SKIPPED
[INFO] TomEE :: TCK :: MicroProfile JWT TCK 10.1.6-SNAPSHOT SKIPPED
[INFO] TomEE :: TCK :: MicroProfile Health TCK 10.1.6-SNAPSHOT SKIPPED
[INFO] TomEE :: TCK :: MicroProfile Metrics TCK 10.1.6-SNAPSHOT SKIPPED
[INFO] TomEE :: TCK :: MicroProfile Rest Client TCK 10.1.6-SNAPSHOT SKIPPED
[INFO] TomEE :: TCK :: MicroProfile Open API TCK 10.1.6-SNAPSHOT SKIPPED
[INFO] TomEE :: TCK :: MicroProfile Fault Tolerance TCK 10.1.6-SNAPSHOT SKIPPED
[INFO] TomEE :: TCK :: MicroProfile Open Telemetry TCK 10.1.6-SNAPSHOT SKIPPED
[INFO] TomEE :: TCK :: JAX-RS TCK 10.1.6-SNAPSHOT ......... SKIPPED
[INFO] TomEE :: TCK :: JAX-RS TCK :: Tests 10.1.6-SNAPSHOT SKIPPED
[INFO] TomEE :: TCK :: JAX-RS TCK :: Tests Embedded 10.1.6-SNAPSHOT SKIPPED
[INFO] TomEE :: TCK :: JAX-RS TCK :: Signature Test 10.1.6-SNAPSHOT SKIPPED
[INFO] TomEE :: Arquillian Adaptors Parent :: Tests 10.1.6-SNAPSHOT SKIPPED
[INFO] TomEE :: Arquillian Adaptors Parent :: Tests :: Web Profile 10.1.6-SNAPSHOT SKIPPED
[INFO] TomEE :: Arquillian Adaptors Parent :: Tests :: JAXRS 10.1.6-SNAPSHOT SKIPPED
[INFO] TomEE :: Arquillian Adaptors Parent :: Tests :: JAXWS 10.1.6-SNAPSHOT SKIPPED
[INFO] TomEE :: Arquillian Adaptors Parent :: Tests :: JMS 10.1.6-SNAPSHOT SKIPPED
[INFO] TomEE :: Arquillian Adaptors Parent :: Tests :: Configuration Tests 10.1.6-SNAPSHOT SKIPPED
[INFO] TomEE :: Arquillian Adaptors Parent :: Sample :: Moviefun 10.1.6-SNAPSHOT SKIPPED
[INFO] TomEE :: Arquillian Adaptors Parent :: Arquillian TCK 10.1.6-SNAPSHOT SKIPPED
[INFO] TomEE :: Arquillian :: Functional Tests 10.1.6-SNAPSHOT SKIPPED
[INFO] TomEE :: Arquillian :: Functional Tests :: Spring CXF Test 10.1.6-SNAPSHOT SKIPPED
[INFO] TomEE :: Utils :: Provisionning 10.1.6-SNAPSHOT .... SKIPPED
[INFO] TomEE :: Utils :: Log4j2 10.1.6-SNAPSHOT ........... SKIPPED
[INFO] TomEE :: TomEE :: webaccess 10.1.6-SNAPSHOT ........ SKIPPED
[INFO] TomEE :: TomEE :: Overlay Runner 10.1.6-SNAPSHOT ... SKIPPED
[INFO] ------------------------------------------------------------------------
[INFO] BUILD FAILURE
[INFO] ------------------------------------------------------------------------
[INFO] Total time: 22:18 min
[INFO] Finished at: 2026-06-05T19:43:37Z
[INFO] ------------------------------------------------------------------------
[WARNING]
[WARNING] Plugin validation issues were detected in 13 plugin(s)
[WARNING]
[WARNING] * org.apache.maven.plugins:maven-jar-plugin:3.0.2
[WARNING] * org.apache.maven.plugins:maven-compiler-plugin:3.14.1
[WARNING] * org.apache.maven.plugins:maven-compiler-plugin:3.10.1
[WARNING] * org.scalatest:scalatest-maven-plugin:2.2.0
[WARNING] * org.apache.maven.plugins:maven-resources-plugin:3.3.0
[WARNING] * org.apache.openjpa:openjpa-maven-plugin:4.1.1
[WARNING] * org.apache.maven.plugins:maven-surefire-plugin:3.5.3
[WARNING] * org.apache.maven.plugins:maven-war-plugin:3.3.2
[WARNING] * org.apache.maven.plugins:maven-assembly-plugin:2.4.1
[WARNING] * com.googlecode.jslint4java:jslint4java-maven-plugin:2.0.5
[WARNING] * org.apache.tomee.patch:tomee-patch-plugin:0.10
[WARNING] * org.apache.felix:maven-bundle-plugin:6.0.2
[WARNING] * org.apache.maven.plugins:maven-install-plugin:3.0.0-M1
[WARNING]
[WARNING] For more or less details, use 'maven.plugin.validation' property with one of the values (case insensitive): [BRIEF, DEFAULT, VERBOSE]
[WARNING]
[ERROR] Failed to execute goal on project resources-jmx-ejb: Could not resolve dependencies for project org.superbiz:resources-jmx-ejb:ejb:10.1.6-SNAPSHOT: The following artifacts could not be resolved: org.apache.tomee:arquillian-tomee-remote:jar:10.1.5-SNAPSHOT (absent), org.apache.tomee:openejb-provisionning:jar:10.1.5-SNAPSHOT (absent), org.apache.tomee:ziplock:jar:10.1.5-SNAPSHOT (absent): org.apache.tomee:arquillian-tomee-remote:jar:10.1.5-SNAPSHOT was not found in https://repository.apache.org/snapshots during a previous attempt. This failure was cached in the local repository and resolution is not reattempted until the update interval of apache-m2-snapshot has elapsed or updates are forced -> [Help 1]
[ERROR]
[ERROR] To see the full stack trace of the errors, re-run Maven with the -e switch.
[ERROR] Re-run Maven using the -X switch to enable full debug logging.
[ERROR]
[ERROR] For more information about the errors and possible solutions, please read the following articles:
[ERROR] [Help 1] http://cwiki.apache.org/confluence/display/MAVEN/DependencyResolutionException
[ERROR]
[ERROR] After correcting the problems, you can resume the build with the command
[ERROR] mvn <args> -rf :resources-jmx-ejb
Build step 'Execute shell' marked build as failure
INFO: Processing JUnit
INFO: [JUnit] - No test report file(s) were found with the pattern '**/target/surefire-reports/TEST-*.xml' relative to '<https://ci-builds.apache.org/job/Tomee/job/tomee-10-build-full-tck/ws/'> for the testing framework 'JUnit'.
Did you enter a pattern relative to (and within) the workspace directory?
Did you generate the result report(s) for 'JUnit'?"
WARNING: All test reports are empty.
[Checks API] No suitable checks publisher found.
INFO: Setting the build status to SUCCESS
Build failed in Jenkins: TomEE » tomee-10-build-full-tck #77
Posted by Apache Jenkins Server <je...@builds.apache.org>.
See <https://ci-builds.apache.org/job/Tomee/job/tomee-10-build-full-tck/77/display/redirect?page=changes>
Changes:
[github] Minor: Regenerated BOMs for 6f38f361f23c92f8c2d0394980774babf1014a8c (#2687)
------------------------------------------
[...truncated 1.10 MiB...]
[INFO] TomEE :: Connector Examples :: Connector in EAR :: Connector Impl 10.1.6-SNAPSHOT SUCCESS [ 0.432 s]
[INFO] TomEE :: Connector Examples :: Connector in EAR :: RAR Packaging 10.1.6-SNAPSHOT SUCCESS [ 0.425 s]
[INFO] TomEE :: Connector Examples :: Connector in EAR :: Sample WAR 10.1.6-SNAPSHOT SUCCESS [ 0.174 s]
[INFO] TomEE :: Connector Examples :: Connector in EAR :: EAR Packaging 10.1.6-SNAPSHOT SUCCESS [ 0.447 s]
[INFO] TomEE :: Connector Examples :: Connector in EAR :: Functional Tests 10.1.6-SNAPSHOT SUCCESS [ 0.893 s]
[INFO] TomEE :: Connector Examples :: Connector in WAR 10.1.6-SNAPSHOT SUCCESS [ 0.629 s]
[INFO] TomEE :: Examples :: Cucumber JVM 10.1.6-SNAPSHOT .. SUCCESS [ 2.294 s]
[INFO] TomEE :: Examples :: Expanded support for Env Entries 10.1.6-SNAPSHOT SUCCESS [ 0.375 s]
[INFO] TomEE :: Examples :: Datasource Ciphered Password 10.1.6-SNAPSHOT SUCCESS [ 0.262 s]
[INFO] TomEE :: Examples :: Datasource Definition 10.1.6-SNAPSHOT SUCCESS [ 0.546 s]
[INFO] TomEE :: Examples :: Datasource Versioning 10.1.6-SNAPSHOT SUCCESS [ 0.957 s]
[INFO] TomEE :: Examples :: Decorators 10.1.6-SNAPSHOT .... SUCCESS [ 0.285 s]
[INFO] TomEE :: Examples :: Dynamic DAO Implementation 10.1.6-SNAPSHOT SUCCESS [ 0.360 s]
[INFO] TomEE :: Examples :: Dynamic Datasource Routing 10.1.6-SNAPSHOT SUCCESS [ 0.371 s]
[INFO] TomEE :: Examples :: Dynamic Implementation 10.1.6-SNAPSHOT SUCCESS [ 0.295 s]
[INFO] TomEE :: Examples :: Dynamic MBean Proxy 10.1.6-SNAPSHOT SUCCESS [ 0.360 s]
[INFO] TomEE :: Examples :: Ear Testing 10.1.6-SNAPSHOT ... SUCCESS [ 0.007 s]
[INFO] TomEE :: Examples :: Ear Testing :: Business Model 10.1.6-SNAPSHOT SUCCESS [ 0.078 s]
[INFO] TomEE :: Examples :: Ear Testing :: Business Logic 10.1.6-SNAPSHOT SUCCESS [ 0.292 s]
[INFO] TomEE :: Web Examples :: EJB Examples War 10.1.6-SNAPSHOT SUCCESS [ 0.323 s]
[INFO] TomEE :: Web Examples :: EJB Remote Call 10.1.6-SNAPSHOT SUCCESS [ 0.183 s]
[INFO] TomEE :: Web Examples :: EJB Remote Call 10.1.6-SNAPSHOT SUCCESS [ 0.185 s]
[INFO] TomEE :: Web Examples :: EJB WebService 10.1.6-SNAPSHOT SUCCESS [ 0.100 s]
[INFO] TomEE :: Arquillian Adaptors Parent :: OpenEJB Container 10.1.6-SNAPSHOT SUCCESS [ 2.339 s]
[INFO] TomEE :: Examples :: Groovy CDI 10.1.6-SNAPSHOT .... SUCCESS [ 1.338 s]
[INFO] TomEE :: Examples :: Groovy JPA 10.1.6-SNAPSHOT .... SUCCESS [ 1.294 s]
[INFO] TomEE :: Examples :: Hello World - Weblogic 10.1.6-SNAPSHOT SUCCESS [ 0.252 s]
[INFO] TomEE :: Examples :: @Resource jakarta.jms.ConnectionFactory 10.1.6-SNAPSHOT SUCCESS [ 0.619 s]
[INFO] TomEE :: Examples :: @Resource DataSource Injection 10.1.6-SNAPSHOT SUCCESS [ 0.317 s]
[INFO] TomEE :: Examples :: @EJB Injection 10.1.6-SNAPSHOT SUCCESS [ 0.279 s]
[INFO] TomEE :: Examples :: @PersistenceContext EntityManager Injection 10.1.6-SNAPSHOT SUCCESS [ 0.189 s]
[INFO] TomEE :: Examples :: @Resource env-entry Injection 10.1.6-SNAPSHOT SUCCESS [ 0.279 s]
[INFO] TomEE :: Examples :: Interceptors 10.1.6-SNAPSHOT .. SUCCESS [ 0.379 s]
[INFO] TomEE :: Examples :: JakartaMail API 10.1.6-SNAPSHOT SUCCESS [ 0.883 s]
[INFO] TomEE :: Examples :: Jakarta Mail API with Velocity 10.1.6-SNAPSHOT SUCCESS [ 1.537 s]
[INFO] TomEE :: Web Examples :: Java Modules (Simple REST resource) 10.1.6-SNAPSHOT SUCCESS [ 1.624 s]
[INFO] TomEE :: Examples :: JAXRS Filter 10.1.6-SNAPSHOT .. SUCCESS [ 0.629 s]
[INFO] TomEE :: Examples :: JAXRS JSON Provider with Jettison 10.1.6-SNAPSHOT SUCCESS [ 0.748 s]
[INFO] TomEE :: Examples :: JPA with EclipseLink 10.1.6-SNAPSHOT SUCCESS [ 0.319 s]
[INFO] TomEE :: Utils :: Core Hibernate 10.1.6-SNAPSHOT ... SUCCESS [ 0.112 s]
[INFO] TomEE :: Examples :: JPA with Hibernate 10.1.6-SNAPSHOT SUCCESS [ 0.707 s]
[INFO] TomEE :: Examples :: JPA with Hibernate and arquillian 10.1.6-SNAPSHOT SUCCESS [ 0.302 s]
[INFO] TomEE :: Examples :: JPA @Enumerated 10.1.6-SNAPSHOT SUCCESS [ 0.245 s]
[INFO] TomEE :: Web Examples :: JSF - CDI and EJB 10.1.6-SNAPSHOT SUCCESS [ 0.121 s]
[INFO] TomEE :: Examples :: JUnit 5 :: Application Composer 10.1.6-SNAPSHOT SUCCESS [ 0.310 s]
[INFO] TomEE :: Examples :: JUnit 5 :: Multiple TomEE with Arquillian 10.1.6-SNAPSHOT SUCCESS [ 0.264 s]
[INFO] TomEE :: Examples :: JUnit 5 :: Simple Websockets with Arquillian 10.1.6-SNAPSHOT SUCCESS [ 0.408 s]
[INFO] TomEE :: Examples :: @EJB Lookup 10.1.6-SNAPSHOT ... SUCCESS [ 0.265 s]
[INFO] TomEE :: Examples :: EJB Lookup with descriptor 10.1.6-SNAPSHOT SUCCESS [ 0.277 s]
[INFO] TomEE :: Examples :: Movies Complete (Meta) 10.1.6-SNAPSHOT SUCCESS [ 0.303 s]
[INFO] TomEE :: Examples :: Movies Complete 10.1.6-SNAPSHOT SUCCESS [ 0.352 s]
[INFO] TomEE :: Examples :: MicroProfile Config 10.1.6-SNAPSHOT SUCCESS [ 0.325 s]
[INFO] TomEE :: Examples :: MicroProfile Config Source Database 10.1.6-SNAPSHOT SUCCESS [ 0.789 s]
[INFO] TomEE :: Examples :: Microprofile Fault Tolerance :: Fallback 10.1.6-SNAPSHOT SUCCESS [ 0.267 s]
[INFO] TomEE :: Examples :: Microprofile Fault Tolerance :: Retry 10.1.6-SNAPSHOT SUCCESS [ 0.607 s]
[INFO] TomEE :: Examples :: Microprofile Fault Tolerance :: Timeout 10.1.6-SNAPSHOT SUCCESS [ 0.236 s]
[INFO] TomEE :: Examples :: MicroProfile JWT Bean Validation 10.1.6-SNAPSHOT SUCCESS [ 0.604 s]
[INFO] TomEE :: Examples :: MicroProfile JWT Bean Validation, Strongly-typed Annotations 10.1.6-SNAPSHOT SUCCESS [ 0.581 s]
[INFO] TomEE :: Examples :: Microprofile Metrics Counted 10.1.6-SNAPSHOT SUCCESS [ 0.397 s]
[INFO] TomEE :: Examples :: Microprofile Metrics Histogram 10.1.6-SNAPSHOT SUCCESS [ 0.369 s]
[INFO] TomEE :: Examples :: Microprofile Metrics Timed 10.1.6-SNAPSHOT SUCCESS [ 0.296 s]
[INFO] TomEE :: Examples :: MicroProfile Metrics Gauge 10.1.6-SNAPSHOT SUCCESS [ 0.357 s]
[INFO] TomEE :: Examples :: MicroProfile Metrics Metered 10.1.6-SNAPSHOT SUCCESS [ 0.096 s]
[INFO] TomEE :: Examples :: MP REST JWT JWK 10.1.6-SNAPSHOT SUCCESS [ 0.505 s]
[INFO] TomEE :: Examples :: MP REST JWT PRINCIPAL 10.1.6-SNAPSHOT SUCCESS [ 0.414 s]
[INFO] TomEE :: Examples :: MP REST JWT Public Key 10.1.6-SNAPSHOT SUCCESS [ 0.518 s]
[INFO] TomEE :: Examples :: Microprofile REST Client 10.1.6-SNAPSHOT SUCCESS [ 0.340 s]
[INFO] TomEE :: Examples :: Custom HealthCheck 10.1.6-SNAPSHOT SUCCESS [ 0.356 s]
[INFO] TomEE :: Examples :: Microprofile OpenAPI Reader 10.1.6-SNAPSHOT SUCCESS [ 0.794 s]
[INFO] TomEE :: Examples :: MTOM 10.1.6-SNAPSHOT .......... SUCCESS [ 0.878 s]
[INFO] TomEE :: Examples :: Multiple JPA providers 10.1.6-SNAPSHOT SUCCESS [ 0.742 s]
[INFO] TomEE :: Examples :: Multiple Arquillian Adapters 10.1.6-SNAPSHOT SUCCESS [ 0.606 s]
[INFO] TomEE :: Examples :: Multiple TomEE with Arquillian 10.1.6-SNAPSHOT SUCCESS [ 0.215 s]
[INFO] TomEE :: Examples :: Persistence Fragment 10.1.6-SNAPSHOT SUCCESS [ 0.272 s]
[INFO] TomEE :: Web Examples :: Pojo WS 10.1.6-SNAPSHOT ... SUCCESS [ 0.098 s]
[INFO] TomEE :: Examples :: Quartz 10.1.6-SNAPSHOT ........ SUCCESS [ 0.006 s]
[INFO] TomEE :: Examples :: Quartz :: Quartz Resource Adapter 10.1.6-SNAPSHOT SUCCESS [ 0.138 s]
[INFO] TomEE :: Examples :: Quartz :: Quartz Beans 10.1.6-SNAPSHOT SUCCESS [ 0.997 s]
[INFO] TomEE :: Examples :: DataSource Realm 10.1.6-SNAPSHOT SUCCESS [ 0.046 s]
[INFO] TomEE :: Examples :: Reloadable Persistence Unit Properties 10.1.6-SNAPSHOT SUCCESS [ 0.313 s]
[INFO] TomEE :: Web Examples :: Resource Declared In A Webapp 10.1.6-SNAPSHOT SUCCESS [ 0.150 s]
[INFO] TomEE :: Examples :: REST, Mockito and Application Composer 10.1.6-SNAPSHOT SUCCESS [ 0.294 s]
[INFO] TomEE :: Examples :: REST and Application Composer 10.1.6-SNAPSHOT SUCCESS [ 0.297 s]
[INFO] TomEE :: Examples :: REST CDI 10.1.6-SNAPSHOT ...... SUCCESS [ 0.291 s]
[INFO] TomEE :: Examples :: JAXRS and JAAS 10.1.6-SNAPSHOT SUCCESS [ 0.107 s]
[INFO] TomEE :: Examples :: REST and EJB 10.1.6-SNAPSHOT .. SUCCESS [ 0.417 s]
[INFO] TomEE :: Web Examples :: REST Example 10.1.6-SNAPSHOT SUCCESS [ 2.102 s]
[INFO] TomEE :: Web Examples :: REST Example With Application 10.1.6-SNAPSHOT SUCCESS [ 1.174 s]
[INFO] TomEE :: Examples :: REST XML JSON 10.1.6-SNAPSHOT . SUCCESS [ 0.263 s]
[INFO] TomEE :: Examples :: Basic Scala 10.1.6-SNAPSHOT ... SUCCESS [ 15.529 s]
[INFO] TomEE :: Examples :: ScheduleExpression 10.1.6-SNAPSHOT SUCCESS [ 0.337 s]
[INFO] TomEE :: Examples :: @Schedule Events 10.1.6-SNAPSHOT SUCCESS [ 0.333 s]
[INFO] TomEE :: Examples :: @Schedule Methods (Meta) 10.1.6-SNAPSHOT SUCCESS [ 0.357 s]
[INFO] TomEE :: Examples :: @Schedule Methods 10.1.6-SNAPSHOT SUCCESS [ 0.277 s]
[INFO] TomEE :: Examples :: Server Events 10.1.6-SNAPSHOT . SUCCESS [ 0.334 s]
[INFO] TomEE :: Examples :: Serverless Builder 10.1.6-SNAPSHOT SUCCESS [ 0.893 s]
[INFO] TomEE :: Examples :: Serverless Apache TomEE WebProfile 10.1.6-SNAPSHOT SUCCESS [ 0.809 s]
[INFO] TomEE :: Examples :: Serverless Apache TomEE MicroProfile 10.1.6-SNAPSHOT SUCCESS [ 0.938 s]
[INFO] TomEE :: Examples :: Serverless Apache TomEE Plume 10.1.6-SNAPSHOT SUCCESS [ 0.944 s]
[INFO] TomEE :: Examples :: Serverless Apache TomEE Plus 10.1.6-SNAPSHOT SUCCESS [ 1.075 s]
[INFO] TomEE :: Examples :: Singleton startup ordering 10.1.6-SNAPSHOT SUCCESS [ 0.416 s]
[INFO] TomEE :: Examples :: Simple CDI Interceptor 10.1.6-SNAPSHOT SUCCESS [ 0.281 s]
[INFO] TomEE :: Examples :: Simple EAR 10.1.6-SNAPSHOT .... SUCCESS [ 0.005 s]
[INFO] TomEE :: Examples :: Simple EAR :: Business Model 10.1.6-SNAPSHOT SUCCESS [ 0.096 s]
[INFO] TomEE :: Examples :: Simple EAR :: Business Logic 10.1.6-SNAPSHOT SUCCESS [ 0.236 s]
[INFO] TomEE :: Examples :: Simple EAR :: Webapp 10.1.6-SNAPSHOT SUCCESS [ 0.381 s]
[INFO] TomEE :: Examples :: Simple EAR :: EAR Packaging 10.1.6-SNAPSHOT SUCCESS [ 0.034 s]
[INFO] TomEE :: Examples :: Simple EAR :: Functional Tests 10.1.6-SNAPSHOT SUCCESS [ 0.818 s]
[INFO] TomEE :: Examples :: Simple CMP2 Entity 10.1.6-SNAPSHOT SUCCESS [ 0.206 s]
[INFO] TomEE :: Examples :: Simple JMS 10.1.6-SNAPSHOT .... SUCCESS [ 0.959 s]
[INFO] TomEE :: Examples :: Simple JMS Context 10.1.6-SNAPSHOT SUCCESS [ 1.089 s]
[INFO] TomEE :: Examples :: Simple MDB With a CDI Injection 10.1.6-SNAPSHOT SUCCESS [ 0.627 s]
[INFO] TomEE :: Examples :: Simple MDB Example 10.1.6-SNAPSHOT SUCCESS [ 0.603 s]
[INFO] TomEE :: Examples :: Simple MDB Using Deployment Descriptor Example 10.1.6-SNAPSHOT SUCCESS [ 0.637 s]
[INFO] TomEE :: Examples :: Simple Remote tomcat-users.xml 10.1.6-SNAPSHOT SUCCESS [ 0.285 s]
[INFO] TomEE :: Examples :: Simple REST 10.1.6-SNAPSHOT ... SUCCESS [ 0.326 s]
[INFO] TomEE :: Examples :: Simple Singleton 10.1.6-SNAPSHOT SUCCESS [ 0.229 s]
[INFO] TomEE :: Examples :: Simple Stateful Pojo 10.1.6-SNAPSHOT SUCCESS [ 0.261 s]
[INFO] TomEE :: Examples :: Simple Stateful Pojo Callbacks 10.1.6-SNAPSHOT SUCCESS [ 0.259 s]
[INFO] TomEE :: Examples :: Simple Stateless Pojo 10.1.6-SNAPSHOT SUCCESS [ 0.262 s]
[INFO] TomEE :: Examples :: Simple Stateless Pojo Callbacks 10.1.6-SNAPSHOT SUCCESS [ 0.279 s]
[INFO] TomEE :: Examples :: Simple Stateless With Deployment Descriptor 10.1.6-SNAPSHOT SUCCESS [ 0.229 s]
[INFO] TomEE :: Examples :: Simple Webservice 10.1.6-SNAPSHOT SUCCESS [ 0.814 s]
[INFO] TomEE :: Examples :: Simple Webservice Without Interface 10.1.6-SNAPSHOT SUCCESS [ 0.738 s]
[INFO] TomEE :: Examples :: Async Servlet 10.1.6-SNAPSHOT . SUCCESS [ 0.410 s]
[INFO] TomEE :: Web Examples :: Struts 10.1.6-SNAPSHOT .... SUCCESS [ 0.970 s]
[INFO] TomEE :: Examples :: Telephone Stateful Pojo 10.1.6-SNAPSHOT SUCCESS [ 0.259 s]
[INFO] TomEE :: Examples :: TestCase Injection 10.1.6-SNAPSHOT SUCCESS [ 0.231 s]
[INFO] TomEE :: Examples :: Testing Security (Meta) 10.1.6-SNAPSHOT SUCCESS [ 0.325 s]
[INFO] TomEE :: Examples :: Testing Security 10.1.6-SNAPSHOT SUCCESS [ 0.211 s]
[INFO] TomEE :: Examples :: Testing Security 10.1.6-SNAPSHOT SUCCESS [ 0.297 s]
[INFO] TomEE :: Examples :: Testing Security Service Provider 10.1.6-SNAPSHOT SUCCESS [ 0.339 s]
[INFO] TomEE :: Examples :: Testing Security Script Service Provider 10.1.6-SNAPSHOT SUCCESS [ 0.330 s]
[INFO] TomEE :: Examples :: Testing Transactions 10.1.6-SNAPSHOT SUCCESS [ 0.275 s]
[INFO] TomEE :: Examples :: Testing Transactions BMT 10.1.6-SNAPSHOT SUCCESS [ 0.262 s]
[INFO] TomEE :: TomEE :: IBM MQ AMQ Portability Examples :: MDB Example 1.0 SUCCESS [ 0.378 s]
[INFO] TomEE :: Examples :: Transaction Rollback 10.1.6-SNAPSHOT SUCCESS [ 0.588 s]
[INFO] TomEE :: Examples :: Troubleshooting 10.1.6-SNAPSHOT SUCCESS [ 0.276 s]
[INFO] TomEE :: Examples :: Webservice Attachments 10.1.6-SNAPSHOT SUCCESS [ 0.386 s]
[INFO] TomEE :: Examples :: Webservice Inheritance 10.1.6-SNAPSHOT SUCCESS [ 0.679 s]
[INFO] TomEE :: Web Examples :: EJB WebService with Security 10.1.6-SNAPSHOT SUCCESS [ 0.573 s]
[INFO] TomEE :: Web Examples :: EJB WebService with SSL Client Certificate 10.1.6-SNAPSHOT SUCCESS [ 6.359 s]
[INFO] TomEE :: Web Examples :: EJB WebService with WS-Security 10.1.6-SNAPSHOT SUCCESS [ 6.453 s]
[INFO] TomEE :: Web Examples :: EJB WebService WS Security with resources.xml 10.1.6-SNAPSHOT SUCCESS [ 0.912 s]
[INFO] TomEE :: Examples :: Web Service Handlers 10.1.6-SNAPSHOT SUCCESS [ 0.671 s]
[INFO] TomEE :: Examples :: @WebService Holder 10.1.6-SNAPSHOT SUCCESS [ 0.604 s]
[INFO] TomEE :: Web Examples :: Moviefun 10.1.6-SNAPSHOT .. SUCCESS [ 0.943 s]
[INFO] TomEE :: Web Examples :: Moviefun Rest 10.1.6-SNAPSHOT SUCCESS [ 2.292 s]
[INFO] TomEE :: Examples :: Resources/JMX Example 10.1.6-SNAPSHOT SUCCESS [ 0.066 s]
[INFO] TomEE :: Examples :: Resources/JMX Example :: EJB Module 10.1.6-SNAPSHOT FAILURE [ 2.374 s]
[INFO] TomEE :: Examples :: Resources/JMX Example :: EAR Module 10.1.6-SNAPSHOT SKIPPED
[INFO] TomEE :: Examples :: WebSocket with tls and basic auth Example 10.1.6-SNAPSHOT SKIPPED
[INFO] TomEE :: Examples :: Concurrency utilities example 10.1.6-SNAPSHOT SKIPPED
[INFO] TomEE :: Examples :: Microprofile JSONB Configuration 10.1.6-SNAPSHOT SKIPPED
[INFO] TomEE :: Examples :: Microprofile JSONB Custom Serializer/Deserializer 10.1.6-SNAPSHOT SKIPPED
[INFO] TomEE :: Examples :: Azure deployment example 10.1.6-SNAPSHOT SKIPPED
[INFO] TomEE :: Examples :: XA Datasource configuration and usage 10.1.6-SNAPSHOT SKIPPED
[INFO] TomEE :: Examples :: Websocket JMS 10.1.6-SNAPSHOT . SKIPPED
[INFO] TomEE :: Web Examples :: Multi-Broker 10.1.6-SNAPSHOT SKIPPED
[INFO] TomEE :: Examples :: Jakarta Security tomcat-user.xml Identity Store 10.1.6-SNAPSHOT SKIPPED
[INFO] TomEE :: Examples :: Jakarta Security custom Identity Store 10.1.6-SNAPSHOT SKIPPED
[INFO] TomEE :: Examples :: Jakarta Security OpenID Connect 10.1.6-SNAPSHOT SKIPPED
[INFO] TomEE :: Examples 10.1.6-SNAPSHOT .................. SKIPPED
[INFO] TomEE :: Assembly :: All In One EJB Lite jar 10.1.6-SNAPSHOT SKIPPED
[INFO] TomEE :: Utils :: TomEE Webapps-based Deployer EJB 10.1.6-SNAPSHOT SKIPPED
[INFO] TomEE :: TCK 10.1.6-SNAPSHOT ....................... SKIPPED
[INFO] TomEE :: TCK :: Common 10.1.6-SNAPSHOT ............. SKIPPED
[INFO] TomEE :: TCK :: CDI Embedded 10.1.6-SNAPSHOT ....... SKIPPED
[INFO] TomEE :: TCK :: CDI TomEE 10.1.6-SNAPSHOT .......... SKIPPED
[INFO] TomEE :: TCK :: CDI TCK Signature Tests 10.1.6-SNAPSHOT SKIPPED
[INFO] TomEE :: TCK :: Bean Validation Embedded 10.1.6-SNAPSHOT SKIPPED
[INFO] TomEE :: TCK :: Bean Validation TomEE 10.1.6-SNAPSHOT SKIPPED
[INFO] TomEE :: TCK :: Bean Validation TCK Signature tests 10.1.6-SNAPSHOT SKIPPED
[INFO] TomEE :: TCK :: JSON-P Standalone 10.1.6-SNAPSHOT .. SKIPPED
[INFO] TomEE :: TCK :: JSON-P Signature Tests 10.1.6-SNAPSHOT SKIPPED
[INFO] TomEE :: TCK :: JSON-B Standalone 10.1.6-SNAPSHOT .. SKIPPED
[INFO] TomEE :: TCK :: JSON-B Signature Tests 10.1.6-SNAPSHOT SKIPPED
[INFO] TomEE :: TCK :: Concurrency Standalone 10.1.6-SNAPSHOT SKIPPED
[INFO] TomEE :: TCK :: Concurrency Signature Tests 10.1.6-SNAPSHOT SKIPPED
[INFO] TomEE :: TCK :: MicroProfile 10.1.6-SNAPSHOT ....... SKIPPED
[INFO] TomEE :: TCK :: MicroProfile Config TCK 10.1.6-SNAPSHOT SKIPPED
[INFO] TomEE :: TCK :: MicroProfile JWT TCK 10.1.6-SNAPSHOT SKIPPED
[INFO] TomEE :: TCK :: MicroProfile Health TCK 10.1.6-SNAPSHOT SKIPPED
[INFO] TomEE :: TCK :: MicroProfile Metrics TCK 10.1.6-SNAPSHOT SKIPPED
[INFO] TomEE :: TCK :: MicroProfile Rest Client TCK 10.1.6-SNAPSHOT SKIPPED
[INFO] TomEE :: TCK :: MicroProfile Open API TCK 10.1.6-SNAPSHOT SKIPPED
[INFO] TomEE :: TCK :: MicroProfile Fault Tolerance TCK 10.1.6-SNAPSHOT SKIPPED
[INFO] TomEE :: TCK :: MicroProfile Open Telemetry TCK 10.1.6-SNAPSHOT SKIPPED
[INFO] TomEE :: TCK :: JAX-RS TCK 10.1.6-SNAPSHOT ......... SKIPPED
[INFO] TomEE :: TCK :: JAX-RS TCK :: Tests 10.1.6-SNAPSHOT SKIPPED
[INFO] TomEE :: TCK :: JAX-RS TCK :: Tests Embedded 10.1.6-SNAPSHOT SKIPPED
[INFO] TomEE :: TCK :: JAX-RS TCK :: Signature Test 10.1.6-SNAPSHOT SKIPPED
[INFO] TomEE :: Arquillian Adaptors Parent :: Tests 10.1.6-SNAPSHOT SKIPPED
[INFO] TomEE :: Arquillian Adaptors Parent :: Tests :: Web Profile 10.1.6-SNAPSHOT SKIPPED
[INFO] TomEE :: Arquillian Adaptors Parent :: Tests :: JAXRS 10.1.6-SNAPSHOT SKIPPED
[INFO] TomEE :: Arquillian Adaptors Parent :: Tests :: JAXWS 10.1.6-SNAPSHOT SKIPPED
[INFO] TomEE :: Arquillian Adaptors Parent :: Tests :: JMS 10.1.6-SNAPSHOT SKIPPED
[INFO] TomEE :: Arquillian Adaptors Parent :: Tests :: Configuration Tests 10.1.6-SNAPSHOT SKIPPED
[INFO] TomEE :: Arquillian Adaptors Parent :: Sample :: Moviefun 10.1.6-SNAPSHOT SKIPPED
[INFO] TomEE :: Arquillian Adaptors Parent :: Arquillian TCK 10.1.6-SNAPSHOT SKIPPED
[INFO] TomEE :: Arquillian :: Functional Tests 10.1.6-SNAPSHOT SKIPPED
[INFO] TomEE :: Arquillian :: Functional Tests :: Spring CXF Test 10.1.6-SNAPSHOT SKIPPED
[INFO] TomEE :: Utils :: Provisionning 10.1.6-SNAPSHOT .... SKIPPED
[INFO] TomEE :: Utils :: Log4j2 10.1.6-SNAPSHOT ........... SKIPPED
[INFO] TomEE :: TomEE :: webaccess 10.1.6-SNAPSHOT ........ SKIPPED
[INFO] TomEE :: TomEE :: Overlay Runner 10.1.6-SNAPSHOT ... SKIPPED
[INFO] ------------------------------------------------------------------------
[INFO] BUILD FAILURE
[INFO] ------------------------------------------------------------------------
[INFO] Total time: 12:26 min
[INFO] Finished at: 2026-06-05T11:52:40Z
[INFO] ------------------------------------------------------------------------
[WARNING]
[WARNING] Plugin validation issues were detected in 13 plugin(s)
[WARNING]
[WARNING] * org.apache.maven.plugins:maven-jar-plugin:3.0.2
[WARNING] * org.apache.maven.plugins:maven-compiler-plugin:3.14.1
[WARNING] * org.apache.maven.plugins:maven-compiler-plugin:3.10.1
[WARNING] * org.scalatest:scalatest-maven-plugin:2.2.0
[WARNING] * org.apache.maven.plugins:maven-resources-plugin:3.3.0
[WARNING] * org.apache.openjpa:openjpa-maven-plugin:4.1.1
[WARNING] * org.apache.maven.plugins:maven-surefire-plugin:3.5.3
[WARNING] * org.apache.maven.plugins:maven-war-plugin:3.3.2
[WARNING] * org.apache.maven.plugins:maven-assembly-plugin:2.4.1
[WARNING] * com.googlecode.jslint4java:jslint4java-maven-plugin:2.0.5
[WARNING] * org.apache.tomee.patch:tomee-patch-plugin:0.10
[WARNING] * org.apache.felix:maven-bundle-plugin:6.0.2
[WARNING] * org.apache.maven.plugins:maven-install-plugin:3.0.0-M1
[WARNING]
[WARNING] For more or less details, use 'maven.plugin.validation' property with one of the values (case insensitive): [BRIEF, DEFAULT, VERBOSE]
[WARNING]
[ERROR] Failed to execute goal on project resources-jmx-ejb: Could not resolve dependencies for project org.superbiz:resources-jmx-ejb:ejb:10.1.6-SNAPSHOT: The following artifacts could not be resolved: org.apache.tomee:arquillian-tomee-remote:jar:10.1.5-SNAPSHOT (absent), org.apache.tomee:openejb-provisionning:jar:10.1.5-SNAPSHOT (absent), org.apache.tomee:ziplock:jar:10.1.5-SNAPSHOT (absent): Could not find artifact org.apache.tomee:arquillian-tomee-remote:jar:10.1.5-SNAPSHOT in apache-m2-snapshot (https://repository.apache.org/snapshots) -> [Help 1]
[ERROR]
[ERROR] To see the full stack trace of the errors, re-run Maven with the -e switch.
[ERROR] Re-run Maven using the -X switch to enable full debug logging.
[ERROR]
[ERROR] For more information about the errors and possible solutions, please read the following articles:
[ERROR] [Help 1] http://cwiki.apache.org/confluence/display/MAVEN/DependencyResolutionException
[ERROR]
[ERROR] After correcting the problems, you can resume the build with the command
[ERROR] mvn <args> -rf :resources-jmx-ejb
Build step 'Execute shell' marked build as failure
INFO: Processing JUnit
INFO: [JUnit] - No test report file(s) were found with the pattern '**/target/surefire-reports/TEST-*.xml' relative to '<https://ci-builds.apache.org/job/Tomee/job/tomee-10-build-full-tck/ws/'> for the testing framework 'JUnit'.
Did you enter a pattern relative to (and within) the workspace directory?
Did you generate the result report(s) for 'JUnit'?"
WARNING: All test reports are empty.
[Checks API] No suitable checks publisher found.
INFO: Setting the build status to SUCCESS
Build failed in Jenkins: TomEE » tomee-10-build-full-tck #76
Posted by Apache Jenkins Server <je...@builds.apache.org>.
See <https://ci-builds.apache.org/job/Tomee/job/tomee-10-build-full-tck/76/display/redirect>
Changes:
------------------------------------------
[...truncated 1.10 MiB...]
[INFO] TomEE :: Connector Examples :: Connector in EAR :: Connector Impl 10.1.6-SNAPSHOT SUCCESS [ 0.367 s]
[INFO] TomEE :: Connector Examples :: Connector in EAR :: RAR Packaging 10.1.6-SNAPSHOT SUCCESS [ 0.618 s]
[INFO] TomEE :: Connector Examples :: Connector in EAR :: Sample WAR 10.1.6-SNAPSHOT SUCCESS [ 0.155 s]
[INFO] TomEE :: Connector Examples :: Connector in EAR :: EAR Packaging 10.1.6-SNAPSHOT SUCCESS [ 0.516 s]
[INFO] TomEE :: Connector Examples :: Connector in EAR :: Functional Tests 10.1.6-SNAPSHOT SUCCESS [ 2.607 s]
[INFO] TomEE :: Connector Examples :: Connector in WAR 10.1.6-SNAPSHOT SUCCESS [ 0.691 s]
[INFO] TomEE :: Examples :: Cucumber JVM 10.1.6-SNAPSHOT .. SUCCESS [ 1.043 s]
[INFO] TomEE :: Examples :: Expanded support for Env Entries 10.1.6-SNAPSHOT SUCCESS [ 0.292 s]
[INFO] TomEE :: Examples :: Datasource Ciphered Password 10.1.6-SNAPSHOT SUCCESS [ 0.181 s]
[INFO] TomEE :: Examples :: Datasource Definition 10.1.6-SNAPSHOT SUCCESS [ 0.377 s]
[INFO] TomEE :: Examples :: Datasource Versioning 10.1.6-SNAPSHOT SUCCESS [ 0.923 s]
[INFO] TomEE :: Examples :: Decorators 10.1.6-SNAPSHOT .... SUCCESS [ 0.354 s]
[INFO] TomEE :: Examples :: Dynamic DAO Implementation 10.1.6-SNAPSHOT SUCCESS [ 0.471 s]
[INFO] TomEE :: Examples :: Dynamic Datasource Routing 10.1.6-SNAPSHOT SUCCESS [ 0.612 s]
[INFO] TomEE :: Examples :: Dynamic Implementation 10.1.6-SNAPSHOT SUCCESS [ 0.281 s]
[INFO] TomEE :: Examples :: Dynamic MBean Proxy 10.1.6-SNAPSHOT SUCCESS [ 0.344 s]
[INFO] TomEE :: Examples :: Ear Testing 10.1.6-SNAPSHOT ... SUCCESS [ 0.015 s]
[INFO] TomEE :: Examples :: Ear Testing :: Business Model 10.1.6-SNAPSHOT SUCCESS [ 0.090 s]
[INFO] TomEE :: Examples :: Ear Testing :: Business Logic 10.1.6-SNAPSHOT SUCCESS [ 0.263 s]
[INFO] TomEE :: Web Examples :: EJB Examples War 10.1.6-SNAPSHOT SUCCESS [ 0.276 s]
[INFO] TomEE :: Web Examples :: EJB Remote Call 10.1.6-SNAPSHOT SUCCESS [ 0.193 s]
[INFO] TomEE :: Web Examples :: EJB Remote Call 10.1.6-SNAPSHOT SUCCESS [ 0.172 s]
[INFO] TomEE :: Web Examples :: EJB WebService 10.1.6-SNAPSHOT SUCCESS [ 0.089 s]
[INFO] TomEE :: Arquillian Adaptors Parent :: OpenEJB Container 10.1.6-SNAPSHOT SUCCESS [ 1.713 s]
[INFO] TomEE :: Examples :: Groovy CDI 10.1.6-SNAPSHOT .... SUCCESS [ 2.609 s]
[INFO] TomEE :: Examples :: Groovy JPA 10.1.6-SNAPSHOT .... SUCCESS [ 0.884 s]
[INFO] TomEE :: Examples :: Hello World - Weblogic 10.1.6-SNAPSHOT SUCCESS [ 0.206 s]
[INFO] TomEE :: Examples :: @Resource jakarta.jms.ConnectionFactory 10.1.6-SNAPSHOT SUCCESS [ 0.413 s]
[INFO] TomEE :: Examples :: @Resource DataSource Injection 10.1.6-SNAPSHOT SUCCESS [ 0.215 s]
[INFO] TomEE :: Examples :: @EJB Injection 10.1.6-SNAPSHOT SUCCESS [ 0.330 s]
[INFO] TomEE :: Examples :: @PersistenceContext EntityManager Injection 10.1.6-SNAPSHOT SUCCESS [ 0.148 s]
[INFO] TomEE :: Examples :: @Resource env-entry Injection 10.1.6-SNAPSHOT SUCCESS [ 0.446 s]
[INFO] TomEE :: Examples :: Interceptors 10.1.6-SNAPSHOT .. SUCCESS [ 0.380 s]
[INFO] TomEE :: Examples :: JakartaMail API 10.1.6-SNAPSHOT SUCCESS [ 2.053 s]
[INFO] TomEE :: Examples :: Jakarta Mail API with Velocity 10.1.6-SNAPSHOT SUCCESS [ 1.492 s]
[INFO] TomEE :: Web Examples :: Java Modules (Simple REST resource) 10.1.6-SNAPSHOT SUCCESS [ 1.740 s]
[INFO] TomEE :: Examples :: JAXRS Filter 10.1.6-SNAPSHOT .. SUCCESS [ 1.290 s]
[INFO] TomEE :: Examples :: JAXRS JSON Provider with Jettison 10.1.6-SNAPSHOT SUCCESS [ 0.678 s]
[INFO] TomEE :: Examples :: JPA with EclipseLink 10.1.6-SNAPSHOT SUCCESS [ 0.241 s]
[INFO] TomEE :: Utils :: Core Hibernate 10.1.6-SNAPSHOT ... SUCCESS [ 0.147 s]
[INFO] TomEE :: Examples :: JPA with Hibernate 10.1.6-SNAPSHOT SUCCESS [ 0.469 s]
[INFO] TomEE :: Examples :: JPA with Hibernate and arquillian 10.1.6-SNAPSHOT SUCCESS [ 0.243 s]
[INFO] TomEE :: Examples :: JPA @Enumerated 10.1.6-SNAPSHOT SUCCESS [ 0.327 s]
[INFO] TomEE :: Web Examples :: JSF - CDI and EJB 10.1.6-SNAPSHOT SUCCESS [ 0.166 s]
[INFO] TomEE :: Examples :: JUnit 5 :: Application Composer 10.1.6-SNAPSHOT SUCCESS [ 0.382 s]
[INFO] TomEE :: Examples :: JUnit 5 :: Multiple TomEE with Arquillian 10.1.6-SNAPSHOT SUCCESS [ 0.150 s]
[INFO] TomEE :: Examples :: JUnit 5 :: Simple Websockets with Arquillian 10.1.6-SNAPSHOT SUCCESS [ 0.565 s]
[INFO] TomEE :: Examples :: @EJB Lookup 10.1.6-SNAPSHOT ... SUCCESS [ 0.262 s]
[INFO] TomEE :: Examples :: EJB Lookup with descriptor 10.1.6-SNAPSHOT SUCCESS [ 0.239 s]
[INFO] TomEE :: Examples :: Movies Complete (Meta) 10.1.6-SNAPSHOT SUCCESS [ 0.705 s]
[INFO] TomEE :: Examples :: Movies Complete 10.1.6-SNAPSHOT SUCCESS [ 0.280 s]
[INFO] TomEE :: Examples :: MicroProfile Config 10.1.6-SNAPSHOT SUCCESS [ 0.299 s]
[INFO] TomEE :: Examples :: MicroProfile Config Source Database 10.1.6-SNAPSHOT SUCCESS [ 0.698 s]
[INFO] TomEE :: Examples :: Microprofile Fault Tolerance :: Fallback 10.1.6-SNAPSHOT SUCCESS [ 0.231 s]
[INFO] TomEE :: Examples :: Microprofile Fault Tolerance :: Retry 10.1.6-SNAPSHOT SUCCESS [ 0.413 s]
[INFO] TomEE :: Examples :: Microprofile Fault Tolerance :: Timeout 10.1.6-SNAPSHOT SUCCESS [ 0.222 s]
[INFO] TomEE :: Examples :: MicroProfile JWT Bean Validation 10.1.6-SNAPSHOT SUCCESS [ 0.783 s]
[INFO] TomEE :: Examples :: MicroProfile JWT Bean Validation, Strongly-typed Annotations 10.1.6-SNAPSHOT SUCCESS [ 0.522 s]
[INFO] TomEE :: Examples :: Microprofile Metrics Counted 10.1.6-SNAPSHOT SUCCESS [ 0.299 s]
[INFO] TomEE :: Examples :: Microprofile Metrics Histogram 10.1.6-SNAPSHOT SUCCESS [ 0.250 s]
[INFO] TomEE :: Examples :: Microprofile Metrics Timed 10.1.6-SNAPSHOT SUCCESS [ 0.277 s]
[INFO] TomEE :: Examples :: MicroProfile Metrics Gauge 10.1.6-SNAPSHOT SUCCESS [ 0.426 s]
[INFO] TomEE :: Examples :: MicroProfile Metrics Metered 10.1.6-SNAPSHOT SUCCESS [ 0.624 s]
[INFO] TomEE :: Examples :: MP REST JWT JWK 10.1.6-SNAPSHOT SUCCESS [ 0.603 s]
[INFO] TomEE :: Examples :: MP REST JWT PRINCIPAL 10.1.6-SNAPSHOT SUCCESS [ 0.326 s]
[INFO] TomEE :: Examples :: MP REST JWT Public Key 10.1.6-SNAPSHOT SUCCESS [ 0.530 s]
[INFO] TomEE :: Examples :: Microprofile REST Client 10.1.6-SNAPSHOT SUCCESS [ 0.343 s]
[INFO] TomEE :: Examples :: Custom HealthCheck 10.1.6-SNAPSHOT SUCCESS [ 0.376 s]
[INFO] TomEE :: Examples :: Microprofile OpenAPI Reader 10.1.6-SNAPSHOT SUCCESS [ 1.005 s]
[INFO] TomEE :: Examples :: MTOM 10.1.6-SNAPSHOT .......... SUCCESS [ 0.797 s]
[INFO] TomEE :: Examples :: Multiple JPA providers 10.1.6-SNAPSHOT SUCCESS [ 0.802 s]
[INFO] TomEE :: Examples :: Multiple Arquillian Adapters 10.1.6-SNAPSHOT SUCCESS [ 0.455 s]
[INFO] TomEE :: Examples :: Multiple TomEE with Arquillian 10.1.6-SNAPSHOT SUCCESS [ 0.250 s]
[INFO] TomEE :: Examples :: Persistence Fragment 10.1.6-SNAPSHOT SUCCESS [ 0.198 s]
[INFO] TomEE :: Web Examples :: Pojo WS 10.1.6-SNAPSHOT ... SUCCESS [ 0.113 s]
[INFO] TomEE :: Examples :: Quartz 10.1.6-SNAPSHOT ........ SUCCESS [ 0.009 s]
[INFO] TomEE :: Examples :: Quartz :: Quartz Resource Adapter 10.1.6-SNAPSHOT SUCCESS [ 0.122 s]
[INFO] TomEE :: Examples :: Quartz :: Quartz Beans 10.1.6-SNAPSHOT SUCCESS [ 0.690 s]
[INFO] TomEE :: Examples :: DataSource Realm 10.1.6-SNAPSHOT SUCCESS [ 0.033 s]
[INFO] TomEE :: Examples :: Reloadable Persistence Unit Properties 10.1.6-SNAPSHOT SUCCESS [ 0.187 s]
[INFO] TomEE :: Web Examples :: Resource Declared In A Webapp 10.1.6-SNAPSHOT SUCCESS [ 0.131 s]
[INFO] TomEE :: Examples :: REST, Mockito and Application Composer 10.1.6-SNAPSHOT SUCCESS [ 0.318 s]
[INFO] TomEE :: Examples :: REST and Application Composer 10.1.6-SNAPSHOT SUCCESS [ 0.266 s]
[INFO] TomEE :: Examples :: REST CDI 10.1.6-SNAPSHOT ...... SUCCESS [ 0.211 s]
[INFO] TomEE :: Examples :: JAXRS and JAAS 10.1.6-SNAPSHOT SUCCESS [ 0.075 s]
[INFO] TomEE :: Examples :: REST and EJB 10.1.6-SNAPSHOT .. SUCCESS [ 0.394 s]
[INFO] TomEE :: Web Examples :: REST Example 10.1.6-SNAPSHOT SUCCESS [ 2.858 s]
[INFO] TomEE :: Web Examples :: REST Example With Application 10.1.6-SNAPSHOT SUCCESS [ 1.704 s]
[INFO] TomEE :: Examples :: REST XML JSON 10.1.6-SNAPSHOT . SUCCESS [ 1.113 s]
[INFO] TomEE :: Examples :: Basic Scala 10.1.6-SNAPSHOT ... SUCCESS [ 21.531 s]
[INFO] TomEE :: Examples :: ScheduleExpression 10.1.6-SNAPSHOT SUCCESS [ 0.275 s]
[INFO] TomEE :: Examples :: @Schedule Events 10.1.6-SNAPSHOT SUCCESS [ 0.240 s]
[INFO] TomEE :: Examples :: @Schedule Methods (Meta) 10.1.6-SNAPSHOT SUCCESS [ 0.252 s]
[INFO] TomEE :: Examples :: @Schedule Methods 10.1.6-SNAPSHOT SUCCESS [ 0.285 s]
[INFO] TomEE :: Examples :: Server Events 10.1.6-SNAPSHOT . SUCCESS [ 0.469 s]
[INFO] TomEE :: Examples :: Serverless Builder 10.1.6-SNAPSHOT SUCCESS [ 1.433 s]
[INFO] TomEE :: Examples :: Serverless Apache TomEE WebProfile 10.1.6-SNAPSHOT SUCCESS [ 0.686 s]
[INFO] TomEE :: Examples :: Serverless Apache TomEE MicroProfile 10.1.6-SNAPSHOT SUCCESS [ 0.958 s]
[INFO] TomEE :: Examples :: Serverless Apache TomEE Plume 10.1.6-SNAPSHOT SUCCESS [ 0.776 s]
[INFO] TomEE :: Examples :: Serverless Apache TomEE Plus 10.1.6-SNAPSHOT SUCCESS [ 0.752 s]
[INFO] TomEE :: Examples :: Singleton startup ordering 10.1.6-SNAPSHOT SUCCESS [ 0.326 s]
[INFO] TomEE :: Examples :: Simple CDI Interceptor 10.1.6-SNAPSHOT SUCCESS [ 0.212 s]
[INFO] TomEE :: Examples :: Simple EAR 10.1.6-SNAPSHOT .... SUCCESS [ 0.024 s]
[INFO] TomEE :: Examples :: Simple EAR :: Business Model 10.1.6-SNAPSHOT SUCCESS [ 0.114 s]
[INFO] TomEE :: Examples :: Simple EAR :: Business Logic 10.1.6-SNAPSHOT SUCCESS [ 0.404 s]
[INFO] TomEE :: Examples :: Simple EAR :: Webapp 10.1.6-SNAPSHOT SUCCESS [ 0.846 s]
[INFO] TomEE :: Examples :: Simple EAR :: EAR Packaging 10.1.6-SNAPSHOT SUCCESS [ 0.136 s]
[INFO] TomEE :: Examples :: Simple EAR :: Functional Tests 10.1.6-SNAPSHOT SUCCESS [ 0.855 s]
[INFO] TomEE :: Examples :: Simple CMP2 Entity 10.1.6-SNAPSHOT SUCCESS [ 0.662 s]
[INFO] TomEE :: Examples :: Simple JMS 10.1.6-SNAPSHOT .... SUCCESS [ 1.074 s]
[INFO] TomEE :: Examples :: Simple JMS Context 10.1.6-SNAPSHOT SUCCESS [ 0.801 s]
[INFO] TomEE :: Examples :: Simple MDB With a CDI Injection 10.1.6-SNAPSHOT SUCCESS [ 0.490 s]
[INFO] TomEE :: Examples :: Simple MDB Example 10.1.6-SNAPSHOT SUCCESS [ 0.419 s]
[INFO] TomEE :: Examples :: Simple MDB Using Deployment Descriptor Example 10.1.6-SNAPSHOT SUCCESS [ 0.445 s]
[INFO] TomEE :: Examples :: Simple Remote tomcat-users.xml 10.1.6-SNAPSHOT SUCCESS [ 0.189 s]
[INFO] TomEE :: Examples :: Simple REST 10.1.6-SNAPSHOT ... SUCCESS [ 0.257 s]
[INFO] TomEE :: Examples :: Simple Singleton 10.1.6-SNAPSHOT SUCCESS [ 0.338 s]
[INFO] TomEE :: Examples :: Simple Stateful Pojo 10.1.6-SNAPSHOT SUCCESS [ 0.264 s]
[INFO] TomEE :: Examples :: Simple Stateful Pojo Callbacks 10.1.6-SNAPSHOT SUCCESS [ 0.362 s]
[INFO] TomEE :: Examples :: Simple Stateless Pojo 10.1.6-SNAPSHOT SUCCESS [ 0.203 s]
[INFO] TomEE :: Examples :: Simple Stateless Pojo Callbacks 10.1.6-SNAPSHOT SUCCESS [ 0.191 s]
[INFO] TomEE :: Examples :: Simple Stateless With Deployment Descriptor 10.1.6-SNAPSHOT SUCCESS [ 0.161 s]
[INFO] TomEE :: Examples :: Simple Webservice 10.1.6-SNAPSHOT SUCCESS [ 0.465 s]
[INFO] TomEE :: Examples :: Simple Webservice Without Interface 10.1.6-SNAPSHOT SUCCESS [ 0.402 s]
[INFO] TomEE :: Examples :: Async Servlet 10.1.6-SNAPSHOT . SUCCESS [ 0.280 s]
[INFO] TomEE :: Web Examples :: Struts 10.1.6-SNAPSHOT .... SUCCESS [ 0.745 s]
[INFO] TomEE :: Examples :: Telephone Stateful Pojo 10.1.6-SNAPSHOT SUCCESS [ 0.342 s]
[INFO] TomEE :: Examples :: TestCase Injection 10.1.6-SNAPSHOT SUCCESS [ 0.305 s]
[INFO] TomEE :: Examples :: Testing Security (Meta) 10.1.6-SNAPSHOT SUCCESS [ 0.395 s]
[INFO] TomEE :: Examples :: Testing Security 10.1.6-SNAPSHOT SUCCESS [ 0.395 s]
[INFO] TomEE :: Examples :: Testing Security 10.1.6-SNAPSHOT SUCCESS [ 0.416 s]
[INFO] TomEE :: Examples :: Testing Security Service Provider 10.1.6-SNAPSHOT SUCCESS [ 0.360 s]
[INFO] TomEE :: Examples :: Testing Security Script Service Provider 10.1.6-SNAPSHOT SUCCESS [ 0.663 s]
[INFO] TomEE :: Examples :: Testing Transactions 10.1.6-SNAPSHOT SUCCESS [ 0.288 s]
[INFO] TomEE :: Examples :: Testing Transactions BMT 10.1.6-SNAPSHOT SUCCESS [ 0.345 s]
[INFO] TomEE :: TomEE :: IBM MQ AMQ Portability Examples :: MDB Example 1.0 SUCCESS [ 0.527 s]
[INFO] TomEE :: Examples :: Transaction Rollback 10.1.6-SNAPSHOT SUCCESS [ 0.207 s]
[INFO] TomEE :: Examples :: Troubleshooting 10.1.6-SNAPSHOT SUCCESS [ 0.286 s]
[INFO] TomEE :: Examples :: Webservice Attachments 10.1.6-SNAPSHOT SUCCESS [ 0.461 s]
[INFO] TomEE :: Examples :: Webservice Inheritance 10.1.6-SNAPSHOT SUCCESS [ 0.554 s]
[INFO] TomEE :: Web Examples :: EJB WebService with Security 10.1.6-SNAPSHOT SUCCESS [ 0.493 s]
[INFO] TomEE :: Web Examples :: EJB WebService with SSL Client Certificate 10.1.6-SNAPSHOT SUCCESS [ 6.595 s]
[INFO] TomEE :: Web Examples :: EJB WebService with WS-Security 10.1.6-SNAPSHOT SUCCESS [ 6.800 s]
[INFO] TomEE :: Web Examples :: EJB WebService WS Security with resources.xml 10.1.6-SNAPSHOT SUCCESS [ 0.934 s]
[INFO] TomEE :: Examples :: Web Service Handlers 10.1.6-SNAPSHOT SUCCESS [ 0.686 s]
[INFO] TomEE :: Examples :: @WebService Holder 10.1.6-SNAPSHOT SUCCESS [ 0.630 s]
[INFO] TomEE :: Web Examples :: Moviefun 10.1.6-SNAPSHOT .. SUCCESS [ 1.027 s]
[INFO] TomEE :: Web Examples :: Moviefun Rest 10.1.6-SNAPSHOT SUCCESS [ 2.985 s]
[INFO] TomEE :: Examples :: Resources/JMX Example 10.1.6-SNAPSHOT SUCCESS [ 0.081 s]
[INFO] TomEE :: Examples :: Resources/JMX Example :: EJB Module 10.1.6-SNAPSHOT FAILURE [ 0.177 s]
[INFO] TomEE :: Examples :: Resources/JMX Example :: EAR Module 10.1.6-SNAPSHOT SKIPPED
[INFO] TomEE :: Examples :: WebSocket with tls and basic auth Example 10.1.6-SNAPSHOT SKIPPED
[INFO] TomEE :: Examples :: Concurrency utilities example 10.1.6-SNAPSHOT SKIPPED
[INFO] TomEE :: Examples :: Microprofile JSONB Configuration 10.1.6-SNAPSHOT SKIPPED
[INFO] TomEE :: Examples :: Microprofile JSONB Custom Serializer/Deserializer 10.1.6-SNAPSHOT SKIPPED
[INFO] TomEE :: Examples :: Azure deployment example 10.1.6-SNAPSHOT SKIPPED
[INFO] TomEE :: Examples :: XA Datasource configuration and usage 10.1.6-SNAPSHOT SKIPPED
[INFO] TomEE :: Examples :: Websocket JMS 10.1.6-SNAPSHOT . SKIPPED
[INFO] TomEE :: Web Examples :: Multi-Broker 10.1.6-SNAPSHOT SKIPPED
[INFO] TomEE :: Examples :: Jakarta Security tomcat-user.xml Identity Store 10.1.6-SNAPSHOT SKIPPED
[INFO] TomEE :: Examples :: Jakarta Security custom Identity Store 10.1.6-SNAPSHOT SKIPPED
[INFO] TomEE :: Examples :: Jakarta Security OpenID Connect 10.1.6-SNAPSHOT SKIPPED
[INFO] TomEE :: Examples 10.1.6-SNAPSHOT .................. SKIPPED
[INFO] TomEE :: Assembly :: All In One EJB Lite jar 10.1.6-SNAPSHOT SKIPPED
[INFO] TomEE :: Utils :: TomEE Webapps-based Deployer EJB 10.1.6-SNAPSHOT SKIPPED
[INFO] TomEE :: TCK 10.1.6-SNAPSHOT ....................... SKIPPED
[INFO] TomEE :: TCK :: Common 10.1.6-SNAPSHOT ............. SKIPPED
[INFO] TomEE :: TCK :: CDI Embedded 10.1.6-SNAPSHOT ....... SKIPPED
[INFO] TomEE :: TCK :: CDI TomEE 10.1.6-SNAPSHOT .......... SKIPPED
[INFO] TomEE :: TCK :: CDI TCK Signature Tests 10.1.6-SNAPSHOT SKIPPED
[INFO] TomEE :: TCK :: Bean Validation Embedded 10.1.6-SNAPSHOT SKIPPED
[INFO] TomEE :: TCK :: Bean Validation TomEE 10.1.6-SNAPSHOT SKIPPED
[INFO] TomEE :: TCK :: Bean Validation TCK Signature tests 10.1.6-SNAPSHOT SKIPPED
[INFO] TomEE :: TCK :: JSON-P Standalone 10.1.6-SNAPSHOT .. SKIPPED
[INFO] TomEE :: TCK :: JSON-P Signature Tests 10.1.6-SNAPSHOT SKIPPED
[INFO] TomEE :: TCK :: JSON-B Standalone 10.1.6-SNAPSHOT .. SKIPPED
[INFO] TomEE :: TCK :: JSON-B Signature Tests 10.1.6-SNAPSHOT SKIPPED
[INFO] TomEE :: TCK :: Concurrency Standalone 10.1.6-SNAPSHOT SKIPPED
[INFO] TomEE :: TCK :: Concurrency Signature Tests 10.1.6-SNAPSHOT SKIPPED
[INFO] TomEE :: TCK :: MicroProfile 10.1.6-SNAPSHOT ....... SKIPPED
[INFO] TomEE :: TCK :: MicroProfile Config TCK 10.1.6-SNAPSHOT SKIPPED
[INFO] TomEE :: TCK :: MicroProfile JWT TCK 10.1.6-SNAPSHOT SKIPPED
[INFO] TomEE :: TCK :: MicroProfile Health TCK 10.1.6-SNAPSHOT SKIPPED
[INFO] TomEE :: TCK :: MicroProfile Metrics TCK 10.1.6-SNAPSHOT SKIPPED
[INFO] TomEE :: TCK :: MicroProfile Rest Client TCK 10.1.6-SNAPSHOT SKIPPED
[INFO] TomEE :: TCK :: MicroProfile Open API TCK 10.1.6-SNAPSHOT SKIPPED
[INFO] TomEE :: TCK :: MicroProfile Fault Tolerance TCK 10.1.6-SNAPSHOT SKIPPED
[INFO] TomEE :: TCK :: MicroProfile Open Telemetry TCK 10.1.6-SNAPSHOT SKIPPED
[INFO] TomEE :: TCK :: JAX-RS TCK 10.1.6-SNAPSHOT ......... SKIPPED
[INFO] TomEE :: TCK :: JAX-RS TCK :: Tests 10.1.6-SNAPSHOT SKIPPED
[INFO] TomEE :: TCK :: JAX-RS TCK :: Tests Embedded 10.1.6-SNAPSHOT SKIPPED
[INFO] TomEE :: TCK :: JAX-RS TCK :: Signature Test 10.1.6-SNAPSHOT SKIPPED
[INFO] TomEE :: Arquillian Adaptors Parent :: Tests 10.1.6-SNAPSHOT SKIPPED
[INFO] TomEE :: Arquillian Adaptors Parent :: Tests :: Web Profile 10.1.6-SNAPSHOT SKIPPED
[INFO] TomEE :: Arquillian Adaptors Parent :: Tests :: JAXRS 10.1.6-SNAPSHOT SKIPPED
[INFO] TomEE :: Arquillian Adaptors Parent :: Tests :: JAXWS 10.1.6-SNAPSHOT SKIPPED
[INFO] TomEE :: Arquillian Adaptors Parent :: Tests :: JMS 10.1.6-SNAPSHOT SKIPPED
[INFO] TomEE :: Arquillian Adaptors Parent :: Tests :: Configuration Tests 10.1.6-SNAPSHOT SKIPPED
[INFO] TomEE :: Arquillian Adaptors Parent :: Sample :: Moviefun 10.1.6-SNAPSHOT SKIPPED
[INFO] TomEE :: Arquillian Adaptors Parent :: Arquillian TCK 10.1.6-SNAPSHOT SKIPPED
[INFO] TomEE :: Arquillian :: Functional Tests 10.1.6-SNAPSHOT SKIPPED
[INFO] TomEE :: Arquillian :: Functional Tests :: Spring CXF Test 10.1.6-SNAPSHOT SKIPPED
[INFO] TomEE :: Utils :: Provisionning 10.1.6-SNAPSHOT .... SKIPPED
[INFO] TomEE :: Utils :: Log4j2 10.1.6-SNAPSHOT ........... SKIPPED
[INFO] TomEE :: TomEE :: webaccess 10.1.6-SNAPSHOT ........ SKIPPED
[INFO] TomEE :: TomEE :: Overlay Runner 10.1.6-SNAPSHOT ... SKIPPED
[INFO] ------------------------------------------------------------------------
[INFO] BUILD FAILURE
[INFO] ------------------------------------------------------------------------
[INFO] Total time: 35:58 min
[INFO] Finished at: 2026-06-05T09:37:56Z
[INFO] ------------------------------------------------------------------------
[WARNING]
[WARNING] Plugin validation issues were detected in 13 plugin(s)
[WARNING]
[WARNING] * org.apache.maven.plugins:maven-jar-plugin:3.0.2
[WARNING] * org.apache.maven.plugins:maven-compiler-plugin:3.14.1
[WARNING] * org.apache.maven.plugins:maven-compiler-plugin:3.10.1
[WARNING] * org.scalatest:scalatest-maven-plugin:2.2.0
[WARNING] * org.apache.maven.plugins:maven-resources-plugin:3.3.0
[WARNING] * org.apache.openjpa:openjpa-maven-plugin:4.1.1
[WARNING] * org.apache.maven.plugins:maven-surefire-plugin:3.5.3
[WARNING] * org.apache.maven.plugins:maven-war-plugin:3.3.2
[WARNING] * org.apache.maven.plugins:maven-assembly-plugin:2.4.1
[WARNING] * com.googlecode.jslint4java:jslint4java-maven-plugin:2.0.5
[WARNING] * org.apache.tomee.patch:tomee-patch-plugin:0.10
[WARNING] * org.apache.felix:maven-bundle-plugin:6.0.2
[WARNING] * org.apache.maven.plugins:maven-install-plugin:3.0.0-M1
[WARNING]
[WARNING] For more or less details, use 'maven.plugin.validation' property with one of the values (case insensitive): [BRIEF, DEFAULT, VERBOSE]
[WARNING]
[ERROR] Failed to execute goal on project resources-jmx-ejb: Could not resolve dependencies for project org.superbiz:resources-jmx-ejb:ejb:10.1.6-SNAPSHOT: The following artifacts could not be resolved: org.apache.tomee:arquillian-tomee-remote:jar:10.1.5-SNAPSHOT (absent), org.apache.tomee:openejb-provisionning:jar:10.1.5-SNAPSHOT (absent), org.apache.tomee:ziplock:jar:10.1.5-SNAPSHOT (absent): org.apache.tomee:arquillian-tomee-remote:jar:10.1.5-SNAPSHOT was not found in https://repository.apache.org/snapshots during a previous attempt. This failure was cached in the local repository and resolution is not reattempted until the update interval of apache-m2-snapshot has elapsed or updates are forced -> [Help 1]
[ERROR]
[ERROR] To see the full stack trace of the errors, re-run Maven with the -e switch.
[ERROR] Re-run Maven using the -X switch to enable full debug logging.
[ERROR]
[ERROR] For more information about the errors and possible solutions, please read the following articles:
[ERROR] [Help 1] http://cwiki.apache.org/confluence/display/MAVEN/DependencyResolutionException
[ERROR]
[ERROR] After correcting the problems, you can resume the build with the command
[ERROR] mvn <args> -rf :resources-jmx-ejb
Build step 'Execute shell' marked build as failure
INFO: Processing JUnit
INFO: [JUnit] - No test report file(s) were found with the pattern '**/target/surefire-reports/TEST-*.xml' relative to '<https://ci-builds.apache.org/job/Tomee/job/tomee-10-build-full-tck/ws/'> for the testing framework 'JUnit'.
Did you enter a pattern relative to (and within) the workspace directory?
Did you generate the result report(s) for 'JUnit'?"
WARNING: All test reports are empty.
[Checks API] No suitable checks publisher found.
INFO: Setting the build status to SUCCESS
Build failed in Jenkins: TomEE » tomee-10-build-full-tck #75
Posted by Apache Jenkins Server <je...@builds.apache.org>.
See <https://ci-builds.apache.org/job/Tomee/job/tomee-10-build-full-tck/75/display/redirect?page=changes>
Changes:
[Markus Jung] [tomee-10.x]: Bump org.apache.sshd:sshd-core from 2.17.1 to 2.18.0
[Markus Jung] [tomee-10.x]: Bump org.apache.maven.plugins:maven-failsafe-plugin
[github] TOMEE-4617 - CXF 4.1.6
[Markus Jung] [tomee-10.x]: Bump org.projectlombok:lombok from 1.18.44 to 1.18.46
[Markus Jung] [tomee-10.x]: Bump org.jboss.arquillian:arquillian-bom
[Markus Jung] [tomee-10.x]: Bump version.hibernate.orm
[github] TOMEE-4618 - SAAJ 3.0.5
[Markus Jung] [tomee-10.x]: Bump actions/checkout from 6.0.2 to 6.0.3
[Markus Jung] [tomee-10.x]: Bump version.shrinkwrap.resolver.bom from 3.3.5 to 3.3.7
[Markus Jung] [tomee-10.x]: Bump com.nimbusds:nimbus-jose-jwt from 10.9 to 10.9.1
[Markus Jung] [tomee-10.x]: Bump org.apache:apache from 37 to 38
[Markus Jung] reduce dependabot noise for asm updates
[Markus Jung] [tomee-10.x]: Bump net.bytebuddy:byte-buddy from 1.18.9 to 1.18.10
[Markus Jung] [tomee-10.x]: Bump org.codehaus.gmavenplus:gmavenplus-plugin
------------------------------------------
[...truncated 1.16 MiB...]
[INFO] TomEE :: Connector Examples :: Connector in EAR :: Connector Impl 10.1.6-SNAPSHOT SUCCESS [ 0.735 s]
[INFO] TomEE :: Connector Examples :: Connector in EAR :: RAR Packaging 10.1.6-SNAPSHOT SUCCESS [ 2.169 s]
[INFO] TomEE :: Connector Examples :: Connector in EAR :: Sample WAR 10.1.6-SNAPSHOT SUCCESS [ 0.151 s]
[INFO] TomEE :: Connector Examples :: Connector in EAR :: EAR Packaging 10.1.6-SNAPSHOT SUCCESS [ 0.545 s]
[INFO] TomEE :: Connector Examples :: Connector in EAR :: Functional Tests 10.1.6-SNAPSHOT SUCCESS [ 1.218 s]
[INFO] TomEE :: Connector Examples :: Connector in WAR 10.1.6-SNAPSHOT SUCCESS [ 0.513 s]
[INFO] TomEE :: Examples :: Cucumber JVM 10.1.6-SNAPSHOT .. SUCCESS [ 2.830 s]
[INFO] TomEE :: Examples :: Expanded support for Env Entries 10.1.6-SNAPSHOT SUCCESS [ 0.260 s]
[INFO] TomEE :: Examples :: Datasource Ciphered Password 10.1.6-SNAPSHOT SUCCESS [ 0.169 s]
[INFO] TomEE :: Examples :: Datasource Definition 10.1.6-SNAPSHOT SUCCESS [ 0.495 s]
[INFO] TomEE :: Examples :: Datasource Versioning 10.1.6-SNAPSHOT SUCCESS [ 0.750 s]
[INFO] TomEE :: Examples :: Decorators 10.1.6-SNAPSHOT .... SUCCESS [ 0.276 s]
[INFO] TomEE :: Examples :: Dynamic DAO Implementation 10.1.6-SNAPSHOT SUCCESS [ 0.255 s]
[INFO] TomEE :: Examples :: Dynamic Datasource Routing 10.1.6-SNAPSHOT SUCCESS [ 0.387 s]
[INFO] TomEE :: Examples :: Dynamic Implementation 10.1.6-SNAPSHOT SUCCESS [ 0.727 s]
[INFO] TomEE :: Examples :: Dynamic MBean Proxy 10.1.6-SNAPSHOT SUCCESS [ 0.455 s]
[INFO] TomEE :: Examples :: Ear Testing 10.1.6-SNAPSHOT ... SUCCESS [ 0.025 s]
[INFO] TomEE :: Examples :: Ear Testing :: Business Model 10.1.6-SNAPSHOT SUCCESS [ 0.080 s]
[INFO] TomEE :: Examples :: Ear Testing :: Business Logic 10.1.6-SNAPSHOT SUCCESS [ 0.238 s]
[INFO] TomEE :: Web Examples :: EJB Examples War 10.1.6-SNAPSHOT SUCCESS [ 0.222 s]
[INFO] TomEE :: Web Examples :: EJB Remote Call 10.1.6-SNAPSHOT SUCCESS [ 0.282 s]
[INFO] TomEE :: Web Examples :: EJB Remote Call 10.1.6-SNAPSHOT SUCCESS [ 0.169 s]
[INFO] TomEE :: Web Examples :: EJB WebService 10.1.6-SNAPSHOT SUCCESS [ 0.080 s]
[INFO] TomEE :: Arquillian Adaptors Parent :: OpenEJB Container 10.1.6-SNAPSHOT SUCCESS [ 2.299 s]
[INFO] TomEE :: Examples :: Groovy CDI 10.1.6-SNAPSHOT .... SUCCESS [ 2.030 s]
[INFO] TomEE :: Examples :: Groovy JPA 10.1.6-SNAPSHOT .... SUCCESS [ 1.583 s]
[INFO] TomEE :: Examples :: Hello World - Weblogic 10.1.6-SNAPSHOT SUCCESS [ 0.687 s]
[INFO] TomEE :: Examples :: @Resource jakarta.jms.ConnectionFactory 10.1.6-SNAPSHOT SUCCESS [ 0.506 s]
[INFO] TomEE :: Examples :: @Resource DataSource Injection 10.1.6-SNAPSHOT SUCCESS [ 0.240 s]
[INFO] TomEE :: Examples :: @EJB Injection 10.1.6-SNAPSHOT SUCCESS [ 0.282 s]
[INFO] TomEE :: Examples :: @PersistenceContext EntityManager Injection 10.1.6-SNAPSHOT SUCCESS [ 0.359 s]
[INFO] TomEE :: Examples :: @Resource env-entry Injection 10.1.6-SNAPSHOT SUCCESS [ 0.471 s]
[INFO] TomEE :: Examples :: Interceptors 10.1.6-SNAPSHOT .. SUCCESS [ 0.645 s]
[INFO] TomEE :: Examples :: JakartaMail API 10.1.6-SNAPSHOT SUCCESS [ 0.593 s]
[INFO] TomEE :: Examples :: Jakarta Mail API with Velocity 10.1.6-SNAPSHOT SUCCESS [ 1.562 s]
[INFO] TomEE :: Web Examples :: Java Modules (Simple REST resource) 10.1.6-SNAPSHOT SUCCESS [ 5.308 s]
[INFO] TomEE :: Examples :: JAXRS Filter 10.1.6-SNAPSHOT .. SUCCESS [ 0.687 s]
[INFO] TomEE :: Examples :: JAXRS JSON Provider with Jettison 10.1.6-SNAPSHOT SUCCESS [ 3.252 s]
[INFO] TomEE :: Examples :: JPA with EclipseLink 10.1.6-SNAPSHOT SUCCESS [ 1.272 s]
[INFO] TomEE :: Utils :: Core Hibernate 10.1.6-SNAPSHOT ... SUCCESS [ 2.323 s]
[INFO] TomEE :: Examples :: JPA with Hibernate 10.1.6-SNAPSHOT SUCCESS [ 1.035 s]
[INFO] TomEE :: Examples :: JPA with Hibernate and arquillian 10.1.6-SNAPSHOT SUCCESS [ 0.296 s]
[INFO] TomEE :: Examples :: JPA @Enumerated 10.1.6-SNAPSHOT SUCCESS [ 0.235 s]
[INFO] TomEE :: Web Examples :: JSF - CDI and EJB 10.1.6-SNAPSHOT SUCCESS [ 0.122 s]
[INFO] TomEE :: Examples :: JUnit 5 :: Application Composer 10.1.6-SNAPSHOT SUCCESS [ 0.825 s]
[INFO] TomEE :: Examples :: JUnit 5 :: Multiple TomEE with Arquillian 10.1.6-SNAPSHOT SUCCESS [ 0.336 s]
[INFO] TomEE :: Examples :: JUnit 5 :: Simple Websockets with Arquillian 10.1.6-SNAPSHOT SUCCESS [ 0.828 s]
[INFO] TomEE :: Examples :: @EJB Lookup 10.1.6-SNAPSHOT ... SUCCESS [ 0.666 s]
[INFO] TomEE :: Examples :: EJB Lookup with descriptor 10.1.6-SNAPSHOT SUCCESS [ 1.058 s]
[INFO] TomEE :: Examples :: Movies Complete (Meta) 10.1.6-SNAPSHOT SUCCESS [ 0.793 s]
[INFO] TomEE :: Examples :: Movies Complete 10.1.6-SNAPSHOT SUCCESS [ 0.514 s]
[INFO] TomEE :: Examples :: MicroProfile Config 10.1.6-SNAPSHOT SUCCESS [ 0.498 s]
[INFO] TomEE :: Examples :: MicroProfile Config Source Database 10.1.6-SNAPSHOT SUCCESS [ 1.929 s]
[INFO] TomEE :: Examples :: Microprofile Fault Tolerance :: Fallback 10.1.6-SNAPSHOT SUCCESS [ 1.392 s]
[INFO] TomEE :: Examples :: Microprofile Fault Tolerance :: Retry 10.1.6-SNAPSHOT SUCCESS [ 1.117 s]
[INFO] TomEE :: Examples :: Microprofile Fault Tolerance :: Timeout 10.1.6-SNAPSHOT SUCCESS [ 0.354 s]
[INFO] TomEE :: Examples :: MicroProfile JWT Bean Validation 10.1.6-SNAPSHOT SUCCESS [ 4.246 s]
[INFO] TomEE :: Examples :: MicroProfile JWT Bean Validation, Strongly-typed Annotations 10.1.6-SNAPSHOT SUCCESS [ 1.005 s]
[INFO] TomEE :: Examples :: Microprofile Metrics Counted 10.1.6-SNAPSHOT SUCCESS [ 0.465 s]
[INFO] TomEE :: Examples :: Microprofile Metrics Histogram 10.1.6-SNAPSHOT SUCCESS [ 0.312 s]
[INFO] TomEE :: Examples :: Microprofile Metrics Timed 10.1.6-SNAPSHOT SUCCESS [ 0.263 s]
[INFO] TomEE :: Examples :: MicroProfile Metrics Gauge 10.1.6-SNAPSHOT SUCCESS [ 0.359 s]
[INFO] TomEE :: Examples :: MicroProfile Metrics Metered 10.1.6-SNAPSHOT SUCCESS [ 0.172 s]
[INFO] TomEE :: Examples :: MP REST JWT JWK 10.1.6-SNAPSHOT SUCCESS [ 0.892 s]
[INFO] TomEE :: Examples :: MP REST JWT PRINCIPAL 10.1.6-SNAPSHOT SUCCESS [ 0.440 s]
[INFO] TomEE :: Examples :: MP REST JWT Public Key 10.1.6-SNAPSHOT SUCCESS [ 0.451 s]
[INFO] TomEE :: Examples :: Microprofile REST Client 10.1.6-SNAPSHOT SUCCESS [ 0.376 s]
[INFO] TomEE :: Examples :: Custom HealthCheck 10.1.6-SNAPSHOT SUCCESS [ 0.254 s]
[INFO] TomEE :: Examples :: Microprofile OpenAPI Reader 10.1.6-SNAPSHOT SUCCESS [ 0.749 s]
[INFO] TomEE :: Examples :: MTOM 10.1.6-SNAPSHOT .......... SUCCESS [ 1.218 s]
[INFO] TomEE :: Examples :: Multiple JPA providers 10.1.6-SNAPSHOT SUCCESS [ 0.926 s]
[INFO] TomEE :: Examples :: Multiple Arquillian Adapters 10.1.6-SNAPSHOT SUCCESS [ 0.937 s]
[INFO] TomEE :: Examples :: Multiple TomEE with Arquillian 10.1.6-SNAPSHOT SUCCESS [ 0.146 s]
[INFO] TomEE :: Examples :: Persistence Fragment 10.1.6-SNAPSHOT SUCCESS [ 0.212 s]
[INFO] TomEE :: Web Examples :: Pojo WS 10.1.6-SNAPSHOT ... SUCCESS [ 0.077 s]
[INFO] TomEE :: Examples :: Quartz 10.1.6-SNAPSHOT ........ SUCCESS [ 0.033 s]
[INFO] TomEE :: Examples :: Quartz :: Quartz Resource Adapter 10.1.6-SNAPSHOT SUCCESS [ 0.065 s]
[INFO] TomEE :: Examples :: Quartz :: Quartz Beans 10.1.6-SNAPSHOT SUCCESS [ 0.963 s]
[INFO] TomEE :: Examples :: DataSource Realm 10.1.6-SNAPSHOT SUCCESS [ 0.189 s]
[INFO] TomEE :: Examples :: Reloadable Persistence Unit Properties 10.1.6-SNAPSHOT SUCCESS [ 0.525 s]
[INFO] TomEE :: Web Examples :: Resource Declared In A Webapp 10.1.6-SNAPSHOT SUCCESS [ 0.516 s]
[INFO] TomEE :: Examples :: REST, Mockito and Application Composer 10.1.6-SNAPSHOT SUCCESS [ 0.582 s]
[INFO] TomEE :: Examples :: REST and Application Composer 10.1.6-SNAPSHOT SUCCESS [ 0.322 s]
[INFO] TomEE :: Examples :: REST CDI 10.1.6-SNAPSHOT ...... SUCCESS [ 0.301 s]
[INFO] TomEE :: Examples :: JAXRS and JAAS 10.1.6-SNAPSHOT SUCCESS [ 0.220 s]
[INFO] TomEE :: Examples :: REST and EJB 10.1.6-SNAPSHOT .. SUCCESS [ 0.852 s]
[INFO] TomEE :: Web Examples :: REST Example 10.1.6-SNAPSHOT SUCCESS [ 1.881 s]
[INFO] TomEE :: Web Examples :: REST Example With Application 10.1.6-SNAPSHOT SUCCESS [ 0.960 s]
[INFO] TomEE :: Examples :: REST XML JSON 10.1.6-SNAPSHOT . SUCCESS [ 0.379 s]
[INFO] TomEE :: Examples :: Basic Scala 10.1.6-SNAPSHOT ... SUCCESS [01:13 min]
[INFO] TomEE :: Examples :: ScheduleExpression 10.1.6-SNAPSHOT SUCCESS [ 1.599 s]
[INFO] TomEE :: Examples :: @Schedule Events 10.1.6-SNAPSHOT SUCCESS [ 1.615 s]
[INFO] TomEE :: Examples :: @Schedule Methods (Meta) 10.1.6-SNAPSHOT SUCCESS [ 1.303 s]
[INFO] TomEE :: Examples :: @Schedule Methods 10.1.6-SNAPSHOT SUCCESS [ 0.799 s]
[INFO] TomEE :: Examples :: Server Events 10.1.6-SNAPSHOT . SUCCESS [ 1.803 s]
[INFO] TomEE :: Examples :: Serverless Builder 10.1.6-SNAPSHOT SUCCESS [ 2.079 s]
[INFO] TomEE :: Examples :: Serverless Apache TomEE WebProfile 10.1.6-SNAPSHOT SUCCESS [ 1.840 s]
[INFO] TomEE :: Examples :: Serverless Apache TomEE MicroProfile 10.1.6-SNAPSHOT SUCCESS [ 1.132 s]
[INFO] TomEE :: Examples :: Serverless Apache TomEE Plume 10.1.6-SNAPSHOT SUCCESS [ 1.922 s]
[INFO] TomEE :: Examples :: Serverless Apache TomEE Plus 10.1.6-SNAPSHOT SUCCESS [ 7.816 s]
[INFO] TomEE :: Examples :: Singleton startup ordering 10.1.6-SNAPSHOT SUCCESS [ 2.640 s]
[INFO] TomEE :: Examples :: Simple CDI Interceptor 10.1.6-SNAPSHOT SUCCESS [ 0.491 s]
[INFO] TomEE :: Examples :: Simple EAR 10.1.6-SNAPSHOT .... SUCCESS [ 0.071 s]
[INFO] TomEE :: Examples :: Simple EAR :: Business Model 10.1.6-SNAPSHOT SUCCESS [ 0.284 s]
[INFO] TomEE :: Examples :: Simple EAR :: Business Logic 10.1.6-SNAPSHOT SUCCESS [ 0.453 s]
[INFO] TomEE :: Examples :: Simple EAR :: Webapp 10.1.6-SNAPSHOT SUCCESS [ 3.659 s]
[INFO] TomEE :: Examples :: Simple EAR :: EAR Packaging 10.1.6-SNAPSHOT SUCCESS [ 0.162 s]
[INFO] TomEE :: Examples :: Simple EAR :: Functional Tests 10.1.6-SNAPSHOT SUCCESS [ 1.725 s]
[INFO] TomEE :: Examples :: Simple CMP2 Entity 10.1.6-SNAPSHOT SUCCESS [ 1.194 s]
[INFO] TomEE :: Examples :: Simple JMS 10.1.6-SNAPSHOT .... SUCCESS [ 3.814 s]
[INFO] TomEE :: Examples :: Simple JMS Context 10.1.6-SNAPSHOT SUCCESS [ 1.134 s]
[INFO] TomEE :: Examples :: Simple MDB With a CDI Injection 10.1.6-SNAPSHOT SUCCESS [ 1.008 s]
[INFO] TomEE :: Examples :: Simple MDB Example 10.1.6-SNAPSHOT SUCCESS [ 0.603 s]
[INFO] TomEE :: Examples :: Simple MDB Using Deployment Descriptor Example 10.1.6-SNAPSHOT SUCCESS [ 0.482 s]
[INFO] TomEE :: Examples :: Simple Remote tomcat-users.xml 10.1.6-SNAPSHOT SUCCESS [ 0.262 s]
[INFO] TomEE :: Examples :: Simple REST 10.1.6-SNAPSHOT ... SUCCESS [ 0.313 s]
[INFO] TomEE :: Examples :: Simple Singleton 10.1.6-SNAPSHOT SUCCESS [ 0.463 s]
[INFO] TomEE :: Examples :: Simple Stateful Pojo 10.1.6-SNAPSHOT SUCCESS [ 0.436 s]
[INFO] TomEE :: Examples :: Simple Stateful Pojo Callbacks 10.1.6-SNAPSHOT SUCCESS [ 0.411 s]
[INFO] TomEE :: Examples :: Simple Stateless Pojo 10.1.6-SNAPSHOT SUCCESS [ 0.434 s]
[INFO] TomEE :: Examples :: Simple Stateless Pojo Callbacks 10.1.6-SNAPSHOT SUCCESS [ 0.558 s]
[INFO] TomEE :: Examples :: Simple Stateless With Deployment Descriptor 10.1.6-SNAPSHOT SUCCESS [ 0.535 s]
[INFO] TomEE :: Examples :: Simple Webservice 10.1.6-SNAPSHOT SUCCESS [ 0.650 s]
[INFO] TomEE :: Examples :: Simple Webservice Without Interface 10.1.6-SNAPSHOT SUCCESS [ 0.492 s]
[INFO] TomEE :: Examples :: Async Servlet 10.1.6-SNAPSHOT . SUCCESS [ 0.353 s]
[INFO] TomEE :: Web Examples :: Struts 10.1.6-SNAPSHOT .... SUCCESS [ 1.333 s]
[INFO] TomEE :: Examples :: Telephone Stateful Pojo 10.1.6-SNAPSHOT SUCCESS [ 0.292 s]
[INFO] TomEE :: Examples :: TestCase Injection 10.1.6-SNAPSHOT SUCCESS [ 0.403 s]
[INFO] TomEE :: Examples :: Testing Security (Meta) 10.1.6-SNAPSHOT SUCCESS [ 0.544 s]
[INFO] TomEE :: Examples :: Testing Security 10.1.6-SNAPSHOT SUCCESS [ 0.188 s]
[INFO] TomEE :: Examples :: Testing Security 10.1.6-SNAPSHOT SUCCESS [ 0.579 s]
[INFO] TomEE :: Examples :: Testing Security Service Provider 10.1.6-SNAPSHOT SUCCESS [ 0.313 s]
[INFO] TomEE :: Examples :: Testing Security Script Service Provider 10.1.6-SNAPSHOT SUCCESS [ 0.312 s]
[INFO] TomEE :: Examples :: Testing Transactions 10.1.6-SNAPSHOT SUCCESS [ 0.197 s]
[INFO] TomEE :: Examples :: Testing Transactions BMT 10.1.6-SNAPSHOT SUCCESS [ 0.238 s]
[INFO] TomEE :: TomEE :: IBM MQ AMQ Portability Examples :: MDB Example 1.0 SUCCESS [ 0.580 s]
[INFO] TomEE :: Examples :: Transaction Rollback 10.1.6-SNAPSHOT SUCCESS [ 0.276 s]
[INFO] TomEE :: Examples :: Troubleshooting 10.1.6-SNAPSHOT SUCCESS [ 0.310 s]
[INFO] TomEE :: Examples :: Webservice Attachments 10.1.6-SNAPSHOT SUCCESS [ 0.404 s]
[INFO] TomEE :: Examples :: Webservice Inheritance 10.1.6-SNAPSHOT SUCCESS [ 0.493 s]
[INFO] TomEE :: Web Examples :: EJB WebService with Security 10.1.6-SNAPSHOT SUCCESS [ 0.469 s]
[INFO] TomEE :: Web Examples :: EJB WebService with SSL Client Certificate 10.1.6-SNAPSHOT SUCCESS [ 7.457 s]
[INFO] TomEE :: Web Examples :: EJB WebService with WS-Security 10.1.6-SNAPSHOT SUCCESS [ 6.079 s]
[INFO] TomEE :: Web Examples :: EJB WebService WS Security with resources.xml 10.1.6-SNAPSHOT SUCCESS [ 0.813 s]
[INFO] TomEE :: Examples :: Web Service Handlers 10.1.6-SNAPSHOT SUCCESS [ 0.476 s]
[INFO] TomEE :: Examples :: @WebService Holder 10.1.6-SNAPSHOT SUCCESS [ 0.542 s]
[INFO] TomEE :: Web Examples :: Moviefun 10.1.6-SNAPSHOT .. SUCCESS [ 1.248 s]
[INFO] TomEE :: Web Examples :: Moviefun Rest 10.1.6-SNAPSHOT SUCCESS [ 5.577 s]
[INFO] TomEE :: Examples :: Resources/JMX Example 10.1.6-SNAPSHOT SUCCESS [ 0.204 s]
[INFO] TomEE :: Examples :: Resources/JMX Example :: EJB Module 10.1.6-SNAPSHOT FAILURE [ 2.710 s]
[INFO] TomEE :: Examples :: Resources/JMX Example :: EAR Module 10.1.6-SNAPSHOT SKIPPED
[INFO] TomEE :: Examples :: WebSocket with tls and basic auth Example 10.1.6-SNAPSHOT SKIPPED
[INFO] TomEE :: Examples :: Concurrency utilities example 10.1.6-SNAPSHOT SKIPPED
[INFO] TomEE :: Examples :: Microprofile JSONB Configuration 10.1.6-SNAPSHOT SKIPPED
[INFO] TomEE :: Examples :: Microprofile JSONB Custom Serializer/Deserializer 10.1.6-SNAPSHOT SKIPPED
[INFO] TomEE :: Examples :: Azure deployment example 10.1.6-SNAPSHOT SKIPPED
[INFO] TomEE :: Examples :: XA Datasource configuration and usage 10.1.6-SNAPSHOT SKIPPED
[INFO] TomEE :: Examples :: Websocket JMS 10.1.6-SNAPSHOT . SKIPPED
[INFO] TomEE :: Web Examples :: Multi-Broker 10.1.6-SNAPSHOT SKIPPED
[INFO] TomEE :: Examples :: Jakarta Security tomcat-user.xml Identity Store 10.1.6-SNAPSHOT SKIPPED
[INFO] TomEE :: Examples :: Jakarta Security custom Identity Store 10.1.6-SNAPSHOT SKIPPED
[INFO] TomEE :: Examples :: Jakarta Security OpenID Connect 10.1.6-SNAPSHOT SKIPPED
[INFO] TomEE :: Examples 10.1.6-SNAPSHOT .................. SKIPPED
[INFO] TomEE :: Assembly :: All In One EJB Lite jar 10.1.6-SNAPSHOT SKIPPED
[INFO] TomEE :: Utils :: TomEE Webapps-based Deployer EJB 10.1.6-SNAPSHOT SKIPPED
[INFO] TomEE :: TCK 10.1.6-SNAPSHOT ....................... SKIPPED
[INFO] TomEE :: TCK :: Common 10.1.6-SNAPSHOT ............. SKIPPED
[INFO] TomEE :: TCK :: CDI Embedded 10.1.6-SNAPSHOT ....... SKIPPED
[INFO] TomEE :: TCK :: CDI TomEE 10.1.6-SNAPSHOT .......... SKIPPED
[INFO] TomEE :: TCK :: CDI TCK Signature Tests 10.1.6-SNAPSHOT SKIPPED
[INFO] TomEE :: TCK :: Bean Validation Embedded 10.1.6-SNAPSHOT SKIPPED
[INFO] TomEE :: TCK :: Bean Validation TomEE 10.1.6-SNAPSHOT SKIPPED
[INFO] TomEE :: TCK :: Bean Validation TCK Signature tests 10.1.6-SNAPSHOT SKIPPED
[INFO] TomEE :: TCK :: JSON-P Standalone 10.1.6-SNAPSHOT .. SKIPPED
[INFO] TomEE :: TCK :: JSON-P Signature Tests 10.1.6-SNAPSHOT SKIPPED
[INFO] TomEE :: TCK :: JSON-B Standalone 10.1.6-SNAPSHOT .. SKIPPED
[INFO] TomEE :: TCK :: JSON-B Signature Tests 10.1.6-SNAPSHOT SKIPPED
[INFO] TomEE :: TCK :: Concurrency Standalone 10.1.6-SNAPSHOT SKIPPED
[INFO] TomEE :: TCK :: Concurrency Signature Tests 10.1.6-SNAPSHOT SKIPPED
[INFO] TomEE :: TCK :: MicroProfile 10.1.6-SNAPSHOT ....... SKIPPED
[INFO] TomEE :: TCK :: MicroProfile Config TCK 10.1.6-SNAPSHOT SKIPPED
[INFO] TomEE :: TCK :: MicroProfile JWT TCK 10.1.6-SNAPSHOT SKIPPED
[INFO] TomEE :: TCK :: MicroProfile Health TCK 10.1.6-SNAPSHOT SKIPPED
[INFO] TomEE :: TCK :: MicroProfile Metrics TCK 10.1.6-SNAPSHOT SKIPPED
[INFO] TomEE :: TCK :: MicroProfile Rest Client TCK 10.1.6-SNAPSHOT SKIPPED
[INFO] TomEE :: TCK :: MicroProfile Open API TCK 10.1.6-SNAPSHOT SKIPPED
[INFO] TomEE :: TCK :: MicroProfile Fault Tolerance TCK 10.1.6-SNAPSHOT SKIPPED
[INFO] TomEE :: TCK :: MicroProfile Open Telemetry TCK 10.1.6-SNAPSHOT SKIPPED
[INFO] TomEE :: TCK :: JAX-RS TCK 10.1.6-SNAPSHOT ......... SKIPPED
[INFO] TomEE :: TCK :: JAX-RS TCK :: Tests 10.1.6-SNAPSHOT SKIPPED
[INFO] TomEE :: TCK :: JAX-RS TCK :: Tests Embedded 10.1.6-SNAPSHOT SKIPPED
[INFO] TomEE :: TCK :: JAX-RS TCK :: Signature Test 10.1.6-SNAPSHOT SKIPPED
[INFO] TomEE :: Arquillian Adaptors Parent :: Tests 10.1.6-SNAPSHOT SKIPPED
[INFO] TomEE :: Arquillian Adaptors Parent :: Tests :: Web Profile 10.1.6-SNAPSHOT SKIPPED
[INFO] TomEE :: Arquillian Adaptors Parent :: Tests :: JAXRS 10.1.6-SNAPSHOT SKIPPED
[INFO] TomEE :: Arquillian Adaptors Parent :: Tests :: JAXWS 10.1.6-SNAPSHOT SKIPPED
[INFO] TomEE :: Arquillian Adaptors Parent :: Tests :: JMS 10.1.6-SNAPSHOT SKIPPED
[INFO] TomEE :: Arquillian Adaptors Parent :: Tests :: Configuration Tests 10.1.6-SNAPSHOT SKIPPED
[INFO] TomEE :: Arquillian Adaptors Parent :: Sample :: Moviefun 10.1.6-SNAPSHOT SKIPPED
[INFO] TomEE :: Arquillian Adaptors Parent :: Arquillian TCK 10.1.6-SNAPSHOT SKIPPED
[INFO] TomEE :: Arquillian :: Functional Tests 10.1.6-SNAPSHOT SKIPPED
[INFO] TomEE :: Arquillian :: Functional Tests :: Spring CXF Test 10.1.6-SNAPSHOT SKIPPED
[INFO] TomEE :: Utils :: Provisionning 10.1.6-SNAPSHOT .... SKIPPED
[INFO] TomEE :: Utils :: Log4j2 10.1.6-SNAPSHOT ........... SKIPPED
[INFO] TomEE :: TomEE :: webaccess 10.1.6-SNAPSHOT ........ SKIPPED
[INFO] TomEE :: TomEE :: Overlay Runner 10.1.6-SNAPSHOT ... SKIPPED
[INFO] ------------------------------------------------------------------------
[INFO] BUILD FAILURE
[INFO] ------------------------------------------------------------------------
[INFO] Total time: 50:32 min
[INFO] Finished at: 2026-06-05T09:01:00Z
[INFO] ------------------------------------------------------------------------
[WARNING]
[WARNING] Plugin validation issues were detected in 13 plugin(s)
[WARNING]
[WARNING] * org.apache.maven.plugins:maven-jar-plugin:3.0.2
[WARNING] * org.apache.maven.plugins:maven-compiler-plugin:3.14.1
[WARNING] * org.apache.maven.plugins:maven-compiler-plugin:3.10.1
[WARNING] * org.scalatest:scalatest-maven-plugin:2.2.0
[WARNING] * org.apache.maven.plugins:maven-resources-plugin:3.3.0
[WARNING] * org.apache.openjpa:openjpa-maven-plugin:4.1.1
[WARNING] * org.apache.maven.plugins:maven-surefire-plugin:3.5.3
[WARNING] * org.apache.maven.plugins:maven-war-plugin:3.3.2
[WARNING] * org.apache.maven.plugins:maven-assembly-plugin:2.4.1
[WARNING] * com.googlecode.jslint4java:jslint4java-maven-plugin:2.0.5
[WARNING] * org.apache.tomee.patch:tomee-patch-plugin:0.10
[WARNING] * org.apache.felix:maven-bundle-plugin:6.0.2
[WARNING] * org.apache.maven.plugins:maven-install-plugin:3.0.0-M1
[WARNING]
[WARNING] For more or less details, use 'maven.plugin.validation' property with one of the values (case insensitive): [BRIEF, DEFAULT, VERBOSE]
[WARNING]
[ERROR] Failed to execute goal on project resources-jmx-ejb: Could not resolve dependencies for project org.superbiz:resources-jmx-ejb:ejb:10.1.6-SNAPSHOT: The following artifacts could not be resolved: org.apache.tomee:arquillian-tomee-remote:jar:10.1.5-SNAPSHOT (absent), org.apache.tomee:openejb-provisionning:jar:10.1.5-SNAPSHOT (absent), org.apache.tomee:ziplock:jar:10.1.5-SNAPSHOT (absent): Could not find artifact org.apache.tomee:arquillian-tomee-remote:jar:10.1.5-SNAPSHOT in apache-m2-snapshot (https://repository.apache.org/snapshots) -> [Help 1]
[ERROR]
[ERROR] To see the full stack trace of the errors, re-run Maven with the -e switch.
[ERROR] Re-run Maven using the -X switch to enable full debug logging.
[ERROR]
[ERROR] For more information about the errors and possible solutions, please read the following articles:
[ERROR] [Help 1] http://cwiki.apache.org/confluence/display/MAVEN/DependencyResolutionException
[ERROR]
[ERROR] After correcting the problems, you can resume the build with the command
[ERROR] mvn <args> -rf :resources-jmx-ejb
Build step 'Execute shell' marked build as failure
INFO: Processing JUnit
INFO: [JUnit] - No test report file(s) were found with the pattern '**/target/surefire-reports/TEST-*.xml' relative to '<https://ci-builds.apache.org/job/Tomee/job/tomee-10-build-full-tck/ws/'> for the testing framework 'JUnit'.
Did you enter a pattern relative to (and within) the workspace directory?
Did you generate the result report(s) for 'JUnit'?"
WARNING: All test reports are empty.
[Checks API] No suitable checks publisher found.
INFO: Setting the build status to SUCCESS
Build failed in Jenkins: TomEE » tomee-10-build-full-tck #74
Posted by Apache Jenkins Server <je...@builds.apache.org>.
See <https://ci-builds.apache.org/job/Tomee/job/tomee-10-build-full-tck/74/display/redirect?page=changes>
Changes:
[Markus Jung] [tomee-10.x]: Bump org.jboss.shrinkwrap.resolver:shrinkwrap-resolver-bom
[Markus Jung] [tomee-10.x]: Bump org.apache.maven.plugins:maven-dependency-plugin
[Markus Jung] [tomee-10.x]: Bump info.cukes:cucumber-core from 1.2.5 to 1.2.6
[Markus Jung] [tomee-10.x]: Bump net.bytebuddy:byte-buddy from 1.18.4 to 1.18.9
[Markus Jung] TOMEE-4615 - Mojarra 4.0.18
[Markus Jung] [tomee-10.x]: Bump version.slf4j from 2.0.17 to 2.0.18
[Markus Jung] [tomee-10.x]: Bump org.slf4j:slf4j-simple from 2.0.17 to 2.0.18
------------------------------------------
[...truncated 1.19 MiB...]
[INFO] TomEE :: Connector Examples :: Connector in EAR :: Connector Impl 10.1.6-SNAPSHOT SUCCESS [ 0.271 s]
[INFO] TomEE :: Connector Examples :: Connector in EAR :: RAR Packaging 10.1.6-SNAPSHOT SUCCESS [ 0.442 s]
[INFO] TomEE :: Connector Examples :: Connector in EAR :: Sample WAR 10.1.6-SNAPSHOT SUCCESS [ 0.161 s]
[INFO] TomEE :: Connector Examples :: Connector in EAR :: EAR Packaging 10.1.6-SNAPSHOT SUCCESS [ 0.330 s]
[INFO] TomEE :: Connector Examples :: Connector in EAR :: Functional Tests 10.1.6-SNAPSHOT SUCCESS [ 0.855 s]
[INFO] TomEE :: Connector Examples :: Connector in WAR 10.1.6-SNAPSHOT SUCCESS [ 0.584 s]
[INFO] TomEE :: Examples :: Cucumber JVM 10.1.6-SNAPSHOT .. SUCCESS [ 2.182 s]
[INFO] TomEE :: Examples :: Expanded support for Env Entries 10.1.6-SNAPSHOT SUCCESS [ 0.284 s]
[INFO] TomEE :: Examples :: Datasource Ciphered Password 10.1.6-SNAPSHOT SUCCESS [ 0.223 s]
[INFO] TomEE :: Examples :: Datasource Definition 10.1.6-SNAPSHOT SUCCESS [ 0.344 s]
[INFO] TomEE :: Examples :: Datasource Versioning 10.1.6-SNAPSHOT SUCCESS [ 0.750 s]
[INFO] TomEE :: Examples :: Decorators 10.1.6-SNAPSHOT .... SUCCESS [ 0.261 s]
[INFO] TomEE :: Examples :: Dynamic DAO Implementation 10.1.6-SNAPSHOT SUCCESS [ 0.271 s]
[INFO] TomEE :: Examples :: Dynamic Datasource Routing 10.1.6-SNAPSHOT SUCCESS [ 0.385 s]
[INFO] TomEE :: Examples :: Dynamic Implementation 10.1.6-SNAPSHOT SUCCESS [ 0.221 s]
[INFO] TomEE :: Examples :: Dynamic MBean Proxy 10.1.6-SNAPSHOT SUCCESS [ 0.259 s]
[INFO] TomEE :: Examples :: Ear Testing 10.1.6-SNAPSHOT ... SUCCESS [ 0.015 s]
[INFO] TomEE :: Examples :: Ear Testing :: Business Model 10.1.6-SNAPSHOT SUCCESS [ 0.081 s]
[INFO] TomEE :: Examples :: Ear Testing :: Business Logic 10.1.6-SNAPSHOT SUCCESS [ 0.181 s]
[INFO] TomEE :: Web Examples :: EJB Examples War 10.1.6-SNAPSHOT SUCCESS [ 0.205 s]
[INFO] TomEE :: Web Examples :: EJB Remote Call 10.1.6-SNAPSHOT SUCCESS [ 0.185 s]
[INFO] TomEE :: Web Examples :: EJB Remote Call 10.1.6-SNAPSHOT SUCCESS [ 0.171 s]
[INFO] TomEE :: Web Examples :: EJB WebService 10.1.6-SNAPSHOT SUCCESS [ 0.080 s]
[INFO] TomEE :: Arquillian Adaptors Parent :: OpenEJB Container 10.1.6-SNAPSHOT SUCCESS [ 4.244 s]
[INFO] TomEE :: Examples :: Groovy CDI 10.1.6-SNAPSHOT .... SUCCESS [ 1.230 s]
[INFO] TomEE :: Examples :: Groovy JPA 10.1.6-SNAPSHOT .... SUCCESS [ 0.922 s]
[INFO] TomEE :: Examples :: Hello World - Weblogic 10.1.6-SNAPSHOT SUCCESS [ 0.231 s]
[INFO] TomEE :: Examples :: @Resource jakarta.jms.ConnectionFactory 10.1.6-SNAPSHOT SUCCESS [ 0.480 s]
[INFO] TomEE :: Examples :: @Resource DataSource Injection 10.1.6-SNAPSHOT SUCCESS [ 0.263 s]
[INFO] TomEE :: Examples :: @EJB Injection 10.1.6-SNAPSHOT SUCCESS [ 0.183 s]
[INFO] TomEE :: Examples :: @PersistenceContext EntityManager Injection 10.1.6-SNAPSHOT SUCCESS [ 0.159 s]
[INFO] TomEE :: Examples :: @Resource env-entry Injection 10.1.6-SNAPSHOT SUCCESS [ 0.205 s]
[INFO] TomEE :: Examples :: Interceptors 10.1.6-SNAPSHOT .. SUCCESS [ 0.303 s]
[INFO] TomEE :: Examples :: JakartaMail API 10.1.6-SNAPSHOT SUCCESS [ 0.565 s]
[INFO] TomEE :: Examples :: Jakarta Mail API with Velocity 10.1.6-SNAPSHOT SUCCESS [ 1.154 s]
[INFO] TomEE :: Web Examples :: Java Modules (Simple REST resource) 10.1.6-SNAPSHOT SUCCESS [ 1.108 s]
[INFO] TomEE :: Examples :: JAXRS Filter 10.1.6-SNAPSHOT .. SUCCESS [ 0.557 s]
[INFO] TomEE :: Examples :: JAXRS JSON Provider with Jettison 10.1.6-SNAPSHOT SUCCESS [ 0.876 s]
[INFO] TomEE :: Examples :: JPA with EclipseLink 10.1.6-SNAPSHOT SUCCESS [ 0.420 s]
[INFO] TomEE :: Utils :: Core Hibernate 10.1.6-SNAPSHOT ... SUCCESS [ 0.978 s]
[INFO] TomEE :: Examples :: JPA with Hibernate 10.1.6-SNAPSHOT SUCCESS [ 0.731 s]
[INFO] TomEE :: Examples :: JPA with Hibernate and arquillian 10.1.6-SNAPSHOT SUCCESS [ 0.292 s]
[INFO] TomEE :: Examples :: JPA @Enumerated 10.1.6-SNAPSHOT SUCCESS [ 0.205 s]
[INFO] TomEE :: Web Examples :: JSF - CDI and EJB 10.1.6-SNAPSHOT SUCCESS [ 0.091 s]
[INFO] TomEE :: Examples :: JUnit 5 :: Application Composer 10.1.6-SNAPSHOT SUCCESS [ 0.272 s]
[INFO] TomEE :: Examples :: JUnit 5 :: Multiple TomEE with Arquillian 10.1.6-SNAPSHOT SUCCESS [ 0.154 s]
[INFO] TomEE :: Examples :: JUnit 5 :: Simple Websockets with Arquillian 10.1.6-SNAPSHOT SUCCESS [ 0.646 s]
[INFO] TomEE :: Examples :: @EJB Lookup 10.1.6-SNAPSHOT ... SUCCESS [ 0.248 s]
[INFO] TomEE :: Examples :: EJB Lookup with descriptor 10.1.6-SNAPSHOT SUCCESS [ 0.181 s]
[INFO] TomEE :: Examples :: Movies Complete (Meta) 10.1.6-SNAPSHOT SUCCESS [ 0.202 s]
[INFO] TomEE :: Examples :: Movies Complete 10.1.6-SNAPSHOT SUCCESS [ 0.225 s]
[INFO] TomEE :: Examples :: MicroProfile Config 10.1.6-SNAPSHOT SUCCESS [ 0.260 s]
[INFO] TomEE :: Examples :: MicroProfile Config Source Database 10.1.6-SNAPSHOT SUCCESS [ 0.485 s]
[INFO] TomEE :: Examples :: Microprofile Fault Tolerance :: Fallback 10.1.6-SNAPSHOT SUCCESS [ 0.214 s]
[INFO] TomEE :: Examples :: Microprofile Fault Tolerance :: Retry 10.1.6-SNAPSHOT SUCCESS [ 0.440 s]
[INFO] TomEE :: Examples :: Microprofile Fault Tolerance :: Timeout 10.1.6-SNAPSHOT SUCCESS [ 0.237 s]
[INFO] TomEE :: Examples :: MicroProfile JWT Bean Validation 10.1.6-SNAPSHOT SUCCESS [ 0.773 s]
[INFO] TomEE :: Examples :: MicroProfile JWT Bean Validation, Strongly-typed Annotations 10.1.6-SNAPSHOT SUCCESS [ 0.886 s]
[INFO] TomEE :: Examples :: Microprofile Metrics Counted 10.1.6-SNAPSHOT SUCCESS [ 0.491 s]
[INFO] TomEE :: Examples :: Microprofile Metrics Histogram 10.1.6-SNAPSHOT SUCCESS [ 1.056 s]
[INFO] TomEE :: Examples :: Microprofile Metrics Timed 10.1.6-SNAPSHOT SUCCESS [ 0.369 s]
[INFO] TomEE :: Examples :: MicroProfile Metrics Gauge 10.1.6-SNAPSHOT SUCCESS [ 0.284 s]
[INFO] TomEE :: Examples :: MicroProfile Metrics Metered 10.1.6-SNAPSHOT SUCCESS [ 0.094 s]
[INFO] TomEE :: Examples :: MP REST JWT JWK 10.1.6-SNAPSHOT SUCCESS [ 0.423 s]
[INFO] TomEE :: Examples :: MP REST JWT PRINCIPAL 10.1.6-SNAPSHOT SUCCESS [ 0.302 s]
[INFO] TomEE :: Examples :: MP REST JWT Public Key 10.1.6-SNAPSHOT SUCCESS [ 0.362 s]
[INFO] TomEE :: Examples :: Microprofile REST Client 10.1.6-SNAPSHOT SUCCESS [ 0.273 s]
[INFO] TomEE :: Examples :: Custom HealthCheck 10.1.6-SNAPSHOT SUCCESS [ 0.245 s]
[INFO] TomEE :: Examples :: Microprofile OpenAPI Reader 10.1.6-SNAPSHOT SUCCESS [ 0.586 s]
[INFO] TomEE :: Examples :: MTOM 10.1.6-SNAPSHOT .......... SUCCESS [ 0.689 s]
[INFO] TomEE :: Examples :: Multiple JPA providers 10.1.6-SNAPSHOT SUCCESS [ 0.455 s]
[INFO] TomEE :: Examples :: Multiple Arquillian Adapters 10.1.6-SNAPSHOT SUCCESS [ 0.411 s]
[INFO] TomEE :: Examples :: Multiple TomEE with Arquillian 10.1.6-SNAPSHOT SUCCESS [ 0.156 s]
[INFO] TomEE :: Examples :: Persistence Fragment 10.1.6-SNAPSHOT SUCCESS [ 0.192 s]
[INFO] TomEE :: Web Examples :: Pojo WS 10.1.6-SNAPSHOT ... SUCCESS [ 0.082 s]
[INFO] TomEE :: Examples :: Quartz 10.1.6-SNAPSHOT ........ SUCCESS [ 0.004 s]
[INFO] TomEE :: Examples :: Quartz :: Quartz Resource Adapter 10.1.6-SNAPSHOT SUCCESS [ 0.104 s]
[INFO] TomEE :: Examples :: Quartz :: Quartz Beans 10.1.6-SNAPSHOT SUCCESS [ 0.729 s]
[INFO] TomEE :: Examples :: DataSource Realm 10.1.6-SNAPSHOT SUCCESS [ 0.026 s]
[INFO] TomEE :: Examples :: Reloadable Persistence Unit Properties 10.1.6-SNAPSHOT SUCCESS [ 0.202 s]
[INFO] TomEE :: Web Examples :: Resource Declared In A Webapp 10.1.6-SNAPSHOT SUCCESS [ 0.114 s]
[INFO] TomEE :: Examples :: REST, Mockito and Application Composer 10.1.6-SNAPSHOT SUCCESS [ 0.261 s]
[INFO] TomEE :: Examples :: REST and Application Composer 10.1.6-SNAPSHOT SUCCESS [ 0.210 s]
[INFO] TomEE :: Examples :: REST CDI 10.1.6-SNAPSHOT ...... SUCCESS [ 0.219 s]
[INFO] TomEE :: Examples :: JAXRS and JAAS 10.1.6-SNAPSHOT SUCCESS [ 0.089 s]
[INFO] TomEE :: Examples :: REST and EJB 10.1.6-SNAPSHOT .. SUCCESS [ 0.254 s]
[INFO] TomEE :: Web Examples :: REST Example 10.1.6-SNAPSHOT SUCCESS [ 1.651 s]
[INFO] TomEE :: Web Examples :: REST Example With Application 10.1.6-SNAPSHOT SUCCESS [ 0.833 s]
[INFO] TomEE :: Examples :: REST XML JSON 10.1.6-SNAPSHOT . SUCCESS [ 0.387 s]
[INFO] TomEE :: Examples :: Basic Scala 10.1.6-SNAPSHOT ... SUCCESS [ 11.426 s]
[INFO] TomEE :: Examples :: ScheduleExpression 10.1.6-SNAPSHOT SUCCESS [ 0.796 s]
[INFO] TomEE :: Examples :: @Schedule Events 10.1.6-SNAPSHOT SUCCESS [ 0.352 s]
[INFO] TomEE :: Examples :: @Schedule Methods (Meta) 10.1.6-SNAPSHOT SUCCESS [ 0.233 s]
[INFO] TomEE :: Examples :: @Schedule Methods 10.1.6-SNAPSHOT SUCCESS [ 0.201 s]
[INFO] TomEE :: Examples :: Server Events 10.1.6-SNAPSHOT . SUCCESS [ 0.323 s]
[INFO] TomEE :: Examples :: Serverless Builder 10.1.6-SNAPSHOT SUCCESS [ 0.529 s]
[INFO] TomEE :: Examples :: Serverless Apache TomEE WebProfile 10.1.6-SNAPSHOT SUCCESS [ 0.570 s]
[INFO] TomEE :: Examples :: Serverless Apache TomEE MicroProfile 10.1.6-SNAPSHOT SUCCESS [ 0.700 s]
[INFO] TomEE :: Examples :: Serverless Apache TomEE Plume 10.1.6-SNAPSHOT SUCCESS [ 0.778 s]
[INFO] TomEE :: Examples :: Serverless Apache TomEE Plus 10.1.6-SNAPSHOT SUCCESS [ 0.692 s]
[INFO] TomEE :: Examples :: Singleton startup ordering 10.1.6-SNAPSHOT SUCCESS [ 0.318 s]
[INFO] TomEE :: Examples :: Simple CDI Interceptor 10.1.6-SNAPSHOT SUCCESS [ 0.210 s]
[INFO] TomEE :: Examples :: Simple EAR 10.1.6-SNAPSHOT .... SUCCESS [ 0.004 s]
[INFO] TomEE :: Examples :: Simple EAR :: Business Model 10.1.6-SNAPSHOT SUCCESS [ 0.186 s]
[INFO] TomEE :: Examples :: Simple EAR :: Business Logic 10.1.6-SNAPSHOT SUCCESS [ 0.200 s]
[INFO] TomEE :: Examples :: Simple EAR :: Webapp 10.1.6-SNAPSHOT SUCCESS [ 0.543 s]
[INFO] TomEE :: Examples :: Simple EAR :: EAR Packaging 10.1.6-SNAPSHOT SUCCESS [ 0.043 s]
[INFO] TomEE :: Examples :: Simple EAR :: Functional Tests 10.1.6-SNAPSHOT SUCCESS [ 0.768 s]
[INFO] TomEE :: Examples :: Simple CMP2 Entity 10.1.6-SNAPSHOT SUCCESS [ 0.244 s]
[INFO] TomEE :: Examples :: Simple JMS 10.1.6-SNAPSHOT .... SUCCESS [ 0.936 s]
[INFO] TomEE :: Examples :: Simple JMS Context 10.1.6-SNAPSHOT SUCCESS [ 0.818 s]
[INFO] TomEE :: Examples :: Simple MDB With a CDI Injection 10.1.6-SNAPSHOT SUCCESS [ 0.442 s]
[INFO] TomEE :: Examples :: Simple MDB Example 10.1.6-SNAPSHOT SUCCESS [ 0.453 s]
[INFO] TomEE :: Examples :: Simple MDB Using Deployment Descriptor Example 10.1.6-SNAPSHOT SUCCESS [ 0.453 s]
[INFO] TomEE :: Examples :: Simple Remote tomcat-users.xml 10.1.6-SNAPSHOT SUCCESS [ 0.213 s]
[INFO] TomEE :: Examples :: Simple REST 10.1.6-SNAPSHOT ... SUCCESS [ 0.229 s]
[INFO] TomEE :: Examples :: Simple Singleton 10.1.6-SNAPSHOT SUCCESS [ 0.214 s]
[INFO] TomEE :: Examples :: Simple Stateful Pojo 10.1.6-SNAPSHOT SUCCESS [ 0.189 s]
[INFO] TomEE :: Examples :: Simple Stateful Pojo Callbacks 10.1.6-SNAPSHOT SUCCESS [ 0.359 s]
[INFO] TomEE :: Examples :: Simple Stateless Pojo 10.1.6-SNAPSHOT SUCCESS [ 0.347 s]
[INFO] TomEE :: Examples :: Simple Stateless Pojo Callbacks 10.1.6-SNAPSHOT SUCCESS [ 0.240 s]
[INFO] TomEE :: Examples :: Simple Stateless With Deployment Descriptor 10.1.6-SNAPSHOT SUCCESS [ 0.278 s]
[INFO] TomEE :: Examples :: Simple Webservice 10.1.6-SNAPSHOT SUCCESS [ 0.521 s]
[INFO] TomEE :: Examples :: Simple Webservice Without Interface 10.1.6-SNAPSHOT SUCCESS [ 0.478 s]
[INFO] TomEE :: Examples :: Async Servlet 10.1.6-SNAPSHOT . SUCCESS [ 0.316 s]
[INFO] TomEE :: Web Examples :: Struts 10.1.6-SNAPSHOT .... SUCCESS [ 0.842 s]
[INFO] TomEE :: Examples :: Telephone Stateful Pojo 10.1.6-SNAPSHOT SUCCESS [ 0.229 s]
[INFO] TomEE :: Examples :: TestCase Injection 10.1.6-SNAPSHOT SUCCESS [ 0.239 s]
[INFO] TomEE :: Examples :: Testing Security (Meta) 10.1.6-SNAPSHOT SUCCESS [ 0.237 s]
[INFO] TomEE :: Examples :: Testing Security 10.1.6-SNAPSHOT SUCCESS [ 0.242 s]
[INFO] TomEE :: Examples :: Testing Security 10.1.6-SNAPSHOT SUCCESS [ 0.229 s]
[INFO] TomEE :: Examples :: Testing Security Service Provider 10.1.6-SNAPSHOT SUCCESS [ 0.277 s]
[INFO] TomEE :: Examples :: Testing Security Script Service Provider 10.1.6-SNAPSHOT SUCCESS [ 0.278 s]
[INFO] TomEE :: Examples :: Testing Transactions 10.1.6-SNAPSHOT SUCCESS [ 0.214 s]
[INFO] TomEE :: Examples :: Testing Transactions BMT 10.1.6-SNAPSHOT SUCCESS [ 0.218 s]
[INFO] TomEE :: TomEE :: IBM MQ AMQ Portability Examples :: MDB Example 1.0 SUCCESS [ 0.368 s]
[INFO] TomEE :: Examples :: Transaction Rollback 10.1.6-SNAPSHOT SUCCESS [ 0.245 s]
[INFO] TomEE :: Examples :: Troubleshooting 10.1.6-SNAPSHOT SUCCESS [ 0.314 s]
[INFO] TomEE :: Examples :: Webservice Attachments 10.1.6-SNAPSHOT SUCCESS [ 0.370 s]
[INFO] TomEE :: Examples :: Webservice Inheritance 10.1.6-SNAPSHOT SUCCESS [ 0.714 s]
[INFO] TomEE :: Web Examples :: EJB WebService with Security 10.1.6-SNAPSHOT SUCCESS [ 0.449 s]
[INFO] TomEE :: Web Examples :: EJB WebService with SSL Client Certificate 10.1.6-SNAPSHOT SUCCESS [ 4.561 s]
[INFO] TomEE :: Web Examples :: EJB WebService with WS-Security 10.1.6-SNAPSHOT SUCCESS [ 4.890 s]
[INFO] TomEE :: Web Examples :: EJB WebService WS Security with resources.xml 10.1.6-SNAPSHOT SUCCESS [ 0.731 s]
[INFO] TomEE :: Examples :: Web Service Handlers 10.1.6-SNAPSHOT SUCCESS [ 0.470 s]
[INFO] TomEE :: Examples :: @WebService Holder 10.1.6-SNAPSHOT SUCCESS [ 0.450 s]
[INFO] TomEE :: Web Examples :: Moviefun 10.1.6-SNAPSHOT .. SUCCESS [ 0.603 s]
[INFO] TomEE :: Web Examples :: Moviefun Rest 10.1.6-SNAPSHOT SUCCESS [ 2.082 s]
[INFO] TomEE :: Examples :: Resources/JMX Example 10.1.6-SNAPSHOT SUCCESS [ 0.060 s]
[INFO] TomEE :: Examples :: Resources/JMX Example :: EJB Module 10.1.6-SNAPSHOT FAILURE [ 2.305 s]
[INFO] TomEE :: Examples :: Resources/JMX Example :: EAR Module 10.1.6-SNAPSHOT SKIPPED
[INFO] TomEE :: Examples :: WebSocket with tls and basic auth Example 10.1.6-SNAPSHOT SKIPPED
[INFO] TomEE :: Examples :: Concurrency utilities example 10.1.6-SNAPSHOT SKIPPED
[INFO] TomEE :: Examples :: Microprofile JSONB Configuration 10.1.6-SNAPSHOT SKIPPED
[INFO] TomEE :: Examples :: Microprofile JSONB Custom Serializer/Deserializer 10.1.6-SNAPSHOT SKIPPED
[INFO] TomEE :: Examples :: Azure deployment example 10.1.6-SNAPSHOT SKIPPED
[INFO] TomEE :: Examples :: XA Datasource configuration and usage 10.1.6-SNAPSHOT SKIPPED
[INFO] TomEE :: Examples :: Websocket JMS 10.1.6-SNAPSHOT . SKIPPED
[INFO] TomEE :: Web Examples :: Multi-Broker 10.1.6-SNAPSHOT SKIPPED
[INFO] TomEE :: Examples :: Jakarta Security tomcat-user.xml Identity Store 10.1.6-SNAPSHOT SKIPPED
[INFO] TomEE :: Examples :: Jakarta Security custom Identity Store 10.1.6-SNAPSHOT SKIPPED
[INFO] TomEE :: Examples :: Jakarta Security OpenID Connect 10.1.6-SNAPSHOT SKIPPED
[INFO] TomEE :: Examples 10.1.6-SNAPSHOT .................. SKIPPED
[INFO] TomEE :: Assembly :: All In One EJB Lite jar 10.1.6-SNAPSHOT SKIPPED
[INFO] TomEE :: Utils :: TomEE Webapps-based Deployer EJB 10.1.6-SNAPSHOT SKIPPED
[INFO] TomEE :: TCK 10.1.6-SNAPSHOT ....................... SKIPPED
[INFO] TomEE :: TCK :: Common 10.1.6-SNAPSHOT ............. SKIPPED
[INFO] TomEE :: TCK :: CDI Embedded 10.1.6-SNAPSHOT ....... SKIPPED
[INFO] TomEE :: TCK :: CDI TomEE 10.1.6-SNAPSHOT .......... SKIPPED
[INFO] TomEE :: TCK :: CDI TCK Signature Tests 10.1.6-SNAPSHOT SKIPPED
[INFO] TomEE :: TCK :: Bean Validation Embedded 10.1.6-SNAPSHOT SKIPPED
[INFO] TomEE :: TCK :: Bean Validation TomEE 10.1.6-SNAPSHOT SKIPPED
[INFO] TomEE :: TCK :: Bean Validation TCK Signature tests 10.1.6-SNAPSHOT SKIPPED
[INFO] TomEE :: TCK :: JSON-P Standalone 10.1.6-SNAPSHOT .. SKIPPED
[INFO] TomEE :: TCK :: JSON-P Signature Tests 10.1.6-SNAPSHOT SKIPPED
[INFO] TomEE :: TCK :: JSON-B Standalone 10.1.6-SNAPSHOT .. SKIPPED
[INFO] TomEE :: TCK :: JSON-B Signature Tests 10.1.6-SNAPSHOT SKIPPED
[INFO] TomEE :: TCK :: Concurrency Standalone 10.1.6-SNAPSHOT SKIPPED
[INFO] TomEE :: TCK :: Concurrency Signature Tests 10.1.6-SNAPSHOT SKIPPED
[INFO] TomEE :: TCK :: MicroProfile 10.1.6-SNAPSHOT ....... SKIPPED
[INFO] TomEE :: TCK :: MicroProfile Config TCK 10.1.6-SNAPSHOT SKIPPED
[INFO] TomEE :: TCK :: MicroProfile JWT TCK 10.1.6-SNAPSHOT SKIPPED
[INFO] TomEE :: TCK :: MicroProfile Health TCK 10.1.6-SNAPSHOT SKIPPED
[INFO] TomEE :: TCK :: MicroProfile Metrics TCK 10.1.6-SNAPSHOT SKIPPED
[INFO] TomEE :: TCK :: MicroProfile Rest Client TCK 10.1.6-SNAPSHOT SKIPPED
[INFO] TomEE :: TCK :: MicroProfile Open API TCK 10.1.6-SNAPSHOT SKIPPED
[INFO] TomEE :: TCK :: MicroProfile Fault Tolerance TCK 10.1.6-SNAPSHOT SKIPPED
[INFO] TomEE :: TCK :: MicroProfile Open Telemetry TCK 10.1.6-SNAPSHOT SKIPPED
[INFO] TomEE :: TCK :: JAX-RS TCK 10.1.6-SNAPSHOT ......... SKIPPED
[INFO] TomEE :: TCK :: JAX-RS TCK :: Tests 10.1.6-SNAPSHOT SKIPPED
[INFO] TomEE :: TCK :: JAX-RS TCK :: Tests Embedded 10.1.6-SNAPSHOT SKIPPED
[INFO] TomEE :: TCK :: JAX-RS TCK :: Signature Test 10.1.6-SNAPSHOT SKIPPED
[INFO] TomEE :: Arquillian Adaptors Parent :: Tests 10.1.6-SNAPSHOT SKIPPED
[INFO] TomEE :: Arquillian Adaptors Parent :: Tests :: Web Profile 10.1.6-SNAPSHOT SKIPPED
[INFO] TomEE :: Arquillian Adaptors Parent :: Tests :: JAXRS 10.1.6-SNAPSHOT SKIPPED
[INFO] TomEE :: Arquillian Adaptors Parent :: Tests :: JAXWS 10.1.6-SNAPSHOT SKIPPED
[INFO] TomEE :: Arquillian Adaptors Parent :: Tests :: JMS 10.1.6-SNAPSHOT SKIPPED
[INFO] TomEE :: Arquillian Adaptors Parent :: Tests :: Configuration Tests 10.1.6-SNAPSHOT SKIPPED
[INFO] TomEE :: Arquillian Adaptors Parent :: Sample :: Moviefun 10.1.6-SNAPSHOT SKIPPED
[INFO] TomEE :: Arquillian Adaptors Parent :: Arquillian TCK 10.1.6-SNAPSHOT SKIPPED
[INFO] TomEE :: Arquillian :: Functional Tests 10.1.6-SNAPSHOT SKIPPED
[INFO] TomEE :: Arquillian :: Functional Tests :: Spring CXF Test 10.1.6-SNAPSHOT SKIPPED
[INFO] TomEE :: Utils :: Provisionning 10.1.6-SNAPSHOT .... SKIPPED
[INFO] TomEE :: Utils :: Log4j2 10.1.6-SNAPSHOT ........... SKIPPED
[INFO] TomEE :: TomEE :: webaccess 10.1.6-SNAPSHOT ........ SKIPPED
[INFO] TomEE :: TomEE :: Overlay Runner 10.1.6-SNAPSHOT ... SKIPPED
[INFO] ------------------------------------------------------------------------
[INFO] BUILD FAILURE
[INFO] ------------------------------------------------------------------------
[INFO] Total time: 09:35 min
[INFO] Finished at: 2026-06-02T13:52:42Z
[INFO] ------------------------------------------------------------------------
[WARNING]
[WARNING] Plugin validation issues were detected in 13 plugin(s)
[WARNING]
[WARNING] * org.apache.maven.plugins:maven-jar-plugin:3.0.2
[WARNING] * org.apache.maven.plugins:maven-compiler-plugin:3.14.1
[WARNING] * org.apache.maven.plugins:maven-compiler-plugin:3.10.1
[WARNING] * org.scalatest:scalatest-maven-plugin:2.2.0
[WARNING] * org.apache.maven.plugins:maven-resources-plugin:3.3.0
[WARNING] * org.apache.openjpa:openjpa-maven-plugin:4.1.1
[WARNING] * org.apache.maven.plugins:maven-surefire-plugin:3.5.3
[WARNING] * org.apache.maven.plugins:maven-war-plugin:3.3.2
[WARNING] * org.apache.maven.plugins:maven-assembly-plugin:2.4.1
[WARNING] * com.googlecode.jslint4java:jslint4java-maven-plugin:2.0.5
[WARNING] * org.apache.tomee.patch:tomee-patch-plugin:0.10
[WARNING] * org.apache.felix:maven-bundle-plugin:6.0.2
[WARNING] * org.apache.maven.plugins:maven-install-plugin:3.0.0-M1
[WARNING]
[WARNING] For more or less details, use 'maven.plugin.validation' property with one of the values (case insensitive): [BRIEF, DEFAULT, VERBOSE]
[WARNING]
[ERROR] Failed to execute goal on project resources-jmx-ejb: Could not resolve dependencies for project org.superbiz:resources-jmx-ejb:ejb:10.1.6-SNAPSHOT: The following artifacts could not be resolved: org.apache.tomee:arquillian-tomee-remote:jar:10.1.5-SNAPSHOT (absent), org.apache.tomee:openejb-provisionning:jar:10.1.5-SNAPSHOT (absent), org.apache.tomee:ziplock:jar:10.1.5-SNAPSHOT (absent): Could not find artifact org.apache.tomee:arquillian-tomee-remote:jar:10.1.5-SNAPSHOT in apache-m2-snapshot (https://repository.apache.org/snapshots) -> [Help 1]
[ERROR]
[ERROR] To see the full stack trace of the errors, re-run Maven with the -e switch.
[ERROR] Re-run Maven using the -X switch to enable full debug logging.
[ERROR]
[ERROR] For more information about the errors and possible solutions, please read the following articles:
[ERROR] [Help 1] http://cwiki.apache.org/confluence/display/MAVEN/DependencyResolutionException
[ERROR]
[ERROR] After correcting the problems, you can resume the build with the command
[ERROR] mvn <args> -rf :resources-jmx-ejb
Build step 'Execute shell' marked build as failure
INFO: Processing JUnit
INFO: [JUnit] - No test report file(s) were found with the pattern '**/target/surefire-reports/TEST-*.xml' relative to '<https://ci-builds.apache.org/job/Tomee/job/tomee-10-build-full-tck/ws/'> for the testing framework 'JUnit'.
Did you enter a pattern relative to (and within) the workspace directory?
Did you generate the result report(s) for 'JUnit'?"
WARNING: All test reports are empty.
[Checks API] No suitable checks publisher found.
INFO: Setting the build status to SUCCESS