You are viewing a plain text version of this content. The canonical link for it is here.
Posted to dev@kafka.apache.org by Apache Jenkins Server <je...@builds.apache.org> on 2023/10/30 23:01:25 UTC

Build failed in Jenkins: Kafka » Kafka Branch Builder » 3.6 #103

See <https://ci-builds.apache.org/job/Kafka/job/kafka/job/3.6/103/display/redirect>

Changes:


------------------------------------------
[...truncated 288482 lines...]

Gradle Test Run :streams:test > Gradle Test Executor 88 > DefaultTaskExecutorTest > shouldUnassignTaskWhenRequired() STARTED

Gradle Test Run :streams:test > Gradle Test Executor 88 > DefaultTaskExecutorTest > shouldUnassignTaskWhenRequired() PASSED

Gradle Test Run :streams:test > Gradle Test Executor 88 > DefaultTaskExecutorTest > shouldProcessTasks() STARTED

Gradle Test Run :streams:test > Gradle Test Executor 88 > DefaultTaskExecutorTest > shouldProcessTasks() PASSED

Gradle Test Run :streams:test > Gradle Test Executor 88 > DefaultTaskExecutorTest > shouldPunctuateStreamTime() STARTED

Gradle Test Run :streams:test > Gradle Test Executor 88 > DefaultTaskExecutorTest > shouldPunctuateStreamTime() PASSED

Gradle Test Run :streams:test > Gradle Test Executor 88 > DefaultTaskExecutorTest > shouldShutdownTaskExecutor() STARTED

Gradle Test Run :streams:test > Gradle Test Executor 88 > DefaultTaskExecutorTest > shouldShutdownTaskExecutor() PASSED

Gradle Test Run :streams:test > Gradle Test Executor 88 > DefaultTaskExecutorTest > shouldRespectPunctuationDisabledByTaskExecutionMetadata() STARTED

Gradle Test Run :streams:test > Gradle Test Executor 88 > DefaultTaskExecutorTest > shouldRespectPunctuationDisabledByTaskExecutionMetadata() PASSED

Gradle Test Run :streams:test > Gradle Test Executor 88 > DefaultTaskExecutorTest > shouldPunctuateSystemTime() STARTED

Gradle Test Run :streams:test > Gradle Test Executor 88 > DefaultTaskExecutorTest > shouldPunctuateSystemTime() PASSED

Gradle Test Run :streams:test > Gradle Test Executor 88 > DefaultTaskExecutorTest > shouldUnassignTaskWhenNotProgressing() STARTED

Gradle Test Run :streams:test > Gradle Test Executor 88 > DefaultTaskExecutorTest > shouldUnassignTaskWhenNotProgressing() PASSED

Gradle Test Run :streams:test > Gradle Test Executor 88 > DefaultTaskExecutorTest > shouldRespectProcessingDisabledByTaskExecutionMetadata() STARTED

Exception: java.lang.AssertionError thrown from the UncaughtExceptionHandler in thread "TaskExecutor"

Gradle Test Run :streams:test > Gradle Test Executor 88 > DefaultTaskExecutorTest > shouldRespectProcessingDisabledByTaskExecutionMetadata() PASSED

Gradle Test Run :streams:test > Gradle Test Executor 88 > StateQueryResultTest > More than one query result throws IllegalArgumentException STARTED

Gradle Test Run :streams:test > Gradle Test Executor 88 > StateQueryResultTest > More than one query result throws IllegalArgumentException PASSED

Gradle Test Run :streams:test > Gradle Test Executor 88 > StateQueryResultTest > Zero query results shouldn't error STARTED

Gradle Test Run :streams:test > Gradle Test Executor 88 > StateQueryResultTest > Zero query results shouldn't error PASSED

Gradle Test Run :streams:test > Gradle Test Executor 88 > StateQueryResultTest > Valid query results still works STARTED

Gradle Test Run :streams:test > Gradle Test Executor 88 > StateQueryResultTest > Valid query results still works PASSED

Gradle Test Run :streams:test > Gradle Test Executor 88 > RocksDBBlockCacheMetricsTest > shouldRecordCorrectBlockCacheUsage(RocksDBStore, StateStoreContext) > [1] org.apache.kafka.streams.state.internals.RocksDBStore@1d283046, org.apache.kafka.test.MockInternalProcessorContext@5d43178b STARTED

Gradle Test Run :streams:test > Gradle Test Executor 88 > RocksDBBlockCacheMetricsTest > shouldRecordCorrectBlockCacheUsage(RocksDBStore, StateStoreContext) > [1] org.apache.kafka.streams.state.internals.RocksDBStore@1d283046, org.apache.kafka.test.MockInternalProcessorContext@5d43178b PASSED

Gradle Test Run :streams:test > Gradle Test Executor 88 > RocksDBBlockCacheMetricsTest > shouldRecordCorrectBlockCacheUsage(RocksDBStore, StateStoreContext) > [2] org.apache.kafka.streams.state.internals.RocksDBTimestampedStore@580b36df, org.apache.kafka.test.MockInternalProcessorContext@17097f50 STARTED

Gradle Test Run :streams:test > Gradle Test Executor 88 > RocksDBBlockCacheMetricsTest > shouldRecordCorrectBlockCacheUsage(RocksDBStore, StateStoreContext) > [2] org.apache.kafka.streams.state.internals.RocksDBTimestampedStore@580b36df, org.apache.kafka.test.MockInternalProcessorContext@17097f50 PASSED

Gradle Test Run :streams:test > Gradle Test Executor 88 > RocksDBBlockCacheMetricsTest > shouldRecordCorrectBlockCachePinnedUsage(RocksDBStore, StateStoreContext) > [1] org.apache.kafka.streams.state.internals.RocksDBStore@71bde139, org.apache.kafka.test.MockInternalProcessorContext@29c85409 STARTED

Gradle Test Run :streams:test > Gradle Test Executor 88 > RocksDBBlockCacheMetricsTest > shouldRecordCorrectBlockCachePinnedUsage(RocksDBStore, StateStoreContext) > [1] org.apache.kafka.streams.state.internals.RocksDBStore@71bde139, org.apache.kafka.test.MockInternalProcessorContext@29c85409 PASSED

Gradle Test Run :streams:test > Gradle Test Executor 88 > RocksDBBlockCacheMetricsTest > shouldRecordCorrectBlockCachePinnedUsage(RocksDBStore, StateStoreContext) > [2] org.apache.kafka.streams.state.internals.RocksDBTimestampedStore@3b8be54b, org.apache.kafka.test.MockInternalProcessorContext@194c751b STARTED

Gradle Test Run :streams:test > Gradle Test Executor 88 > RocksDBBlockCacheMetricsTest > shouldRecordCorrectBlockCachePinnedUsage(RocksDBStore, StateStoreContext) > [2] org.apache.kafka.streams.state.internals.RocksDBTimestampedStore@3b8be54b, org.apache.kafka.test.MockInternalProcessorContext@194c751b PASSED

Gradle Test Run :streams:test > Gradle Test Executor 88 > RocksDBBlockCacheMetricsTest > shouldRecordCorrectBlockCacheCapacity(RocksDBStore, StateStoreContext) > [1] org.apache.kafka.streams.state.internals.RocksDBStore@251a6d24, org.apache.kafka.test.MockInternalProcessorContext@75a5eb76 STARTED

Gradle Test Run :streams:test > Gradle Test Executor 88 > RocksDBBlockCacheMetricsTest > shouldRecordCorrectBlockCacheCapacity(RocksDBStore, StateStoreContext) > [1] org.apache.kafka.streams.state.internals.RocksDBStore@251a6d24, org.apache.kafka.test.MockInternalProcessorContext@75a5eb76 PASSED

Gradle Test Run :streams:test > Gradle Test Executor 88 > RocksDBBlockCacheMetricsTest > shouldRecordCorrectBlockCacheCapacity(RocksDBStore, StateStoreContext) > [2] org.apache.kafka.streams.state.internals.RocksDBTimestampedStore@5484edb0, org.apache.kafka.test.MockInternalProcessorContext@6b1edc05 STARTED

Gradle Test Run :streams:test > Gradle Test Executor 88 > RocksDBBlockCacheMetricsTest > shouldRecordCorrectBlockCacheCapacity(RocksDBStore, StateStoreContext) > [2] org.apache.kafka.streams.state.internals.RocksDBTimestampedStore@5484edb0, org.apache.kafka.test.MockInternalProcessorContext@6b1edc05 PASSED

Gradle Test Run :streams:test > Gradle Test Executor 88 > RocksDBMetricsRecorderTest > shouldThrowIfDbToAddWasAlreadyAddedForOtherSegment() STARTED

Gradle Test Run :streams:test > Gradle Test Executor 88 > RocksDBMetricsRecorderTest > shouldThrowIfDbToAddWasAlreadyAddedForOtherSegment() PASSED

Gradle Test Run :streams:test > Gradle Test Executor 88 > RocksDBMetricsRecorderTest > shouldAddItselfToRecordingTriggerWhenFirstValueProvidersAreAddedAfterLastValueProvidersWereRemoved() STARTED

Gradle Test Run :streams:test > Gradle Test Executor 88 > RocksDBMetricsRecorderTest > shouldAddItselfToRecordingTriggerWhenFirstValueProvidersAreAddedAfterLastValueProvidersWereRemoved() PASSED

Gradle Test Run :streams:test > Gradle Test Executor 88 > RocksDBMetricsRecorderTest > shouldThrowIfValueProvidersToRemoveNotFound() STARTED

Gradle Test Run :streams:test > Gradle Test Executor 88 > RocksDBMetricsRecorderTest > shouldThrowIfValueProvidersToRemoveNotFound() PASSED

Gradle Test Run :streams:test > Gradle Test Executor 88 > RocksDBMetricsRecorderTest > shouldThrowIfCacheToAddIsSameAsOnlyOneOfMultipleCaches() STARTED

Gradle Test Run :streams:test > Gradle Test Executor 88 > RocksDBMetricsRecorderTest > shouldThrowIfCacheToAddIsSameAsOnlyOneOfMultipleCaches() PASSED

Gradle Test Run :streams:test > Gradle Test Executor 88 > RocksDBMetricsRecorderTest > shouldNotSetStatsLevelToExceptDetailedTimersWhenValueProvidersWithoutStatisticsAreAdded() STARTED

Gradle Test Run :streams:test > Gradle Test Executor 88 > RocksDBMetricsRecorderTest > shouldNotSetStatsLevelToExceptDetailedTimersWhenValueProvidersWithoutStatisticsAreAdded() PASSED

Gradle Test Run :streams:test > Gradle Test Executor 88 > RocksDBMetricsRecorderTest > shouldNotRemoveItselfFromRecordingTriggerWhenAtLeastOneValueProviderIsPresent() STARTED

Gradle Test Run :streams:test > Gradle Test Executor 88 > RocksDBMetricsRecorderTest > shouldNotRemoveItselfFromRecordingTriggerWhenAtLeastOneValueProviderIsPresent() PASSED

Gradle Test Run :streams:test > Gradle Test Executor 88 > RocksDBMetricsRecorderTest > shouldRemoveItselfFromRecordingTriggerWhenAllValueProvidersAreRemoved() STARTED

Gradle Test Run :streams:test > Gradle Test Executor 88 > RocksDBMetricsRecorderTest > shouldRemoveItselfFromRecordingTriggerWhenAllValueProvidersAreRemoved() PASSED

Gradle Test Run :streams:test > Gradle Test Executor 88 > RocksDBMetricsRecorderTest > shouldAddItselfToRecordingTriggerWhenFirstValueProvidersAreAddedToNewlyCreatedRecorder() STARTED

Gradle Test Run :streams:test > Gradle Test Executor 88 > RocksDBMetricsRecorderTest > shouldAddItselfToRecordingTriggerWhenFirstValueProvidersAreAddedToNewlyCreatedRecorder() PASSED

Gradle Test Run :streams:test > Gradle Test Executor 88 > RocksDBMetricsRecorderTest > shouldThrowIfValueProvidersForASegmentHasBeenAlreadyAdded() STARTED

Gradle Test Run :streams:test > Gradle Test Executor 88 > RocksDBMetricsRecorderTest > shouldThrowIfValueProvidersForASegmentHasBeenAlreadyAdded() PASSED

Gradle Test Run :streams:test > Gradle Test Executor 88 > RocksDBMetricsRecorderTest > shouldCorrectlyHandleHitRatioRecordingsWithZeroHitsAndMisses() STARTED

Gradle Test Run :streams:test > Gradle Test Executor 88 > RocksDBMetricsRecorderTest > shouldCorrectlyHandleHitRatioRecordingsWithZeroHitsAndMisses() PASSED

Gradle Test Run :streams:test > Gradle Test Executor 88 > RocksDBMetricsRecorderTest > shouldThrowIfCacheToAddIsNotNullButExistingCacheIsNull() STARTED

Gradle Test Run :streams:test > Gradle Test Executor 88 > RocksDBMetricsRecorderTest > shouldThrowIfCacheToAddIsNotNullButExistingCacheIsNull() PASSED

Gradle Test Run :streams:test > Gradle Test Executor 88 > RocksDBMetricsRecorderTest > shouldThrowIfCacheToAddIsNullButExistingCacheIsNotNull() STARTED

Gradle Test Run :streams:test > Gradle Test Executor 88 > RocksDBMetricsRecorderTest > shouldThrowIfCacheToAddIsNullButExistingCacheIsNotNull() PASSED

Gradle Test Run :streams:test > Gradle Test Executor 88 > RocksDBMetricsRecorderTest > shouldThrowIfStatisticsToAddIsNotNullButExistingStatisticsAreNull() STARTED

Gradle Test Run :streams:test > Gradle Test Executor 88 > RocksDBMetricsRecorderTest > shouldThrowIfStatisticsToAddIsNotNullButExistingStatisticsAreNull() PASSED

Gradle Test Run :streams:test > Gradle Test Executor 88 > RocksDBMetricsRecorderTest > shouldThrowIfCacheToAddIsNotSameAsAllExistingCaches() STARTED

Gradle Test Run :streams:test > Gradle Test Executor 88 > RocksDBMetricsRecorderTest > shouldThrowIfCacheToAddIsNotSameAsAllExistingCaches() PASSED

Gradle Test Run :streams:test > Gradle Test Executor 88 > RocksDBMetricsRecorderTest > shouldNotRecordStatisticsBasedMetricsIfStatisticsIsNull() STARTED

Gradle Test Run :streams:test > Gradle Test Executor 88 > RocksDBMetricsRecorderTest > shouldNotRecordStatisticsBasedMetricsIfStatisticsIsNull() PASSED

Gradle Test Run :streams:test > Gradle Test Executor 88 > RocksDBMetricsRecorderTest > shouldSetStatsLevelToExceptDetailedTimersWhenValueProvidersWithStatisticsAreAdded() STARTED

Gradle Test Run :streams:test > Gradle Test Executor 88 > RocksDBMetricsRecorderTest > shouldSetStatsLevelToExceptDetailedTimersWhenValueProvidersWithStatisticsAreAdded() PASSED

Gradle Test Run :streams:test > Gradle Test Executor 88 > RocksDBMetricsRecorderTest > shouldRecordStatisticsBasedMetrics() STARTED

Gradle Test Run :streams:test > Gradle Test Executor 88 > RocksDBMetricsRecorderTest > shouldRecordStatisticsBasedMetrics() PASSED

Gradle Test Run :streams:test > Gradle Test Executor 88 > RocksDBMetricsRecorderTest > shouldThrowIfMetricRecorderIsReInitialisedWithDifferentStreamsMetrics() STARTED

Gradle Test Run :streams:test > Gradle Test Executor 88 > RocksDBMetricsRecorderTest > shouldThrowIfMetricRecorderIsReInitialisedWithDifferentStreamsMetrics() PASSED

Gradle Test Run :streams:test > Gradle Test Executor 88 > RocksDBMetricsRecorderTest > shouldInitMetricsRecorder() STARTED

Gradle Test Run :streams:test > Gradle Test Executor 88 > RocksDBMetricsRecorderTest > shouldInitMetricsRecorder() PASSED

Gradle Test Run :streams:test > Gradle Test Executor 88 > RocksDBMetricsRecorderTest > shouldThrowIfMetricRecorderIsReInitialisedWithDifferentTask() STARTED

Gradle Test Run :streams:test > Gradle Test Executor 88 > RocksDBMetricsRecorderTest > shouldThrowIfMetricRecorderIsReInitialisedWithDifferentTask() PASSED

Gradle Test Run :streams:test > Gradle Test Executor 88 > RocksDBMetricsRecorderTest > shouldCorrectlyHandleAvgRecordingsWithZeroSumAndCount() STARTED

Gradle Test Run :streams:test > Gradle Test Executor 88 > RocksDBMetricsRecorderTest > shouldCorrectlyHandleAvgRecordingsWithZeroSumAndCount() PASSED

Gradle Test Run :streams:test > Gradle Test Executor 88 > RocksDBMetricsRecorderTest > shouldThrowIfStatisticsToAddIsNullButExistingStatisticsAreNotNull() STARTED

Gradle Test Run :streams:test > Gradle Test Executor 88 > RocksDBMetricsRecorderTest > shouldThrowIfStatisticsToAddIsNullButExistingStatisticsAreNotNull() PASSED

Gradle Test Run :streams:test > Gradle Test Executor 88 > RocksDBMetricsRecorderTest > shouldNotAddItselfToRecordingTriggerWhenNotEmpty() STARTED

Gradle Test Run :streams:test > Gradle Test Executor 88 > RocksDBMetricsRecorderTest > shouldNotAddItselfToRecordingTriggerWhenNotEmpty() PASSED

FAILURE: Build completed with 3 failures.

1: Task failed with an exception.
-----------
* What went wrong:
Execution failed for task ':streams:upgrade-system-tests-0100:test'.
> Process 'Gradle Test Executor 41' finished with non-zero exit value 1
  This problem might be caused by incorrect test process configuration.
  For more on test execution, please refer to https://docs.gradle.org/8.2.1/userguide/java_testing.html#sec:test_execution in the Gradle documentation.

* Try:
> Run with --stacktrace option to get the stack trace.
> Run with --info or --debug option to get more log output.
> Get more help at https://help.gradle.org.
==============================================================================

2: Task failed with an exception.
-----------
* What went wrong:
Execution failed for task ':streams:streams-scala:test'.
> Process 'Gradle Test Executor 80' finished with non-zero exit value 1
  This problem might be caused by incorrect test process configuration.
  For more on test execution, please refer to https://docs.gradle.org/8.2.1/userguide/java_testing.html#sec:test_execution in the Gradle documentation.

* Try:
> Run with --stacktrace option to get the stack trace.
> Run with --info or --debug option to get more log output.
> Get more help at https://help.gradle.org.
==============================================================================

3: Task failed with an exception.
-----------
* What went wrong:
Execution failed for task ':core:test'.
> Process 'Gradle Test Executor 91' finished with non-zero exit value 1
  This problem might be caused by incorrect test process configuration.
  For more on test execution, please refer to https://docs.gradle.org/8.2.1/userguide/java_testing.html#sec:test_execution in the Gradle documentation.

* Try:
> Run with --stacktrace option to get the stack trace.
> Run with --info or --debug option to get more log output.
> Get more help at https://help.gradle.org.
==============================================================================

Deprecated Gradle features were used in this build, making it incompatible with Gradle 9.0.

You can use '--warning-mode all' to show the individual deprecation warnings and determine if they come from your own scripts or plugins.

For more on this, please refer to https://docs.gradle.org/8.2.1/userguide/command_line_interface.html#sec:command_line_warnings in the Gradle documentation.

BUILD FAILED in 2h 17m 27s
302 actionable tasks: 111 executed, 191 up-to-date

Publishing build scan...
https://ge.apache.org/s/k4vf4rb3tsv2i


See the profiling report at: file:///home/jenkins/jenkins-agent/workspace/Kafka_kafka_3.6/build/reports/profile/profile-2023-10-30-20-44-04.html
A fine-grained performance profile is available: use the --scan option.
[Pipeline] }
[Pipeline] // withEnv
[Pipeline] }
[Pipeline] // withEnv
[Pipeline] }
[Pipeline] // withEnv
[Pipeline] }
[Pipeline] // node
[Pipeline] }
[Pipeline] // timestamps
[Pipeline] }
[Pipeline] // timeout
[Pipeline] }
[Pipeline] // stage
[Pipeline] }
Failed in branch JDK 8 and Scala 2.12
[Pipeline] // parallel
[Pipeline] }
[Pipeline] // stage
[Pipeline] stage
[Pipeline] { (Declarative: Post Actions)
[Pipeline] script
[Pipeline] {
[Pipeline] node
Running on builds37 in /home/jenkins/jenkins-agent/workspace/Kafka_kafka_3.6
[Pipeline] {
[Pipeline] step

Jenkins build is unstable: Kafka » Kafka Branch Builder » 3.6 #108

Posted by Apache Jenkins Server <je...@builds.apache.org>.
See <https://ci-builds.apache.org/job/Kafka/job/kafka/job/3.6/108/display/redirect>


Build failed in Jenkins: Kafka » Kafka Branch Builder » 3.6 #107

Posted by Apache Jenkins Server <je...@builds.apache.org>.
See <https://ci-builds.apache.org/job/Kafka/job/kafka/job/3.6/107/display/redirect>

Changes:


------------------------------------------
[...truncated 410761 lines...]
Gradle Test Run :core:test > Gradle Test Executor 91 > KafkaZkClientTest > testGetAllTopicsInClusterTriggersWatch() STARTED

Gradle Test Run :core:test > Gradle Test Executor 91 > KafkaZkClientTest > testGetAllTopicsInClusterTriggersWatch() PASSED

Gradle Test Run :core:test > Gradle Test Executor 91 > KafkaZkClientTest > testDeleteTopicZNode() STARTED

Gradle Test Run :core:test > Gradle Test Executor 91 > KafkaZkClientTest > testDeleteTopicZNode() PASSED

Gradle Test Run :core:test > Gradle Test Executor 91 > KafkaZkClientTest > testDeletePath() STARTED

Gradle Test Run :core:test > Gradle Test Executor 91 > KafkaZkClientTest > testDeletePath() PASSED

Gradle Test Run :core:test > Gradle Test Executor 91 > KafkaZkClientTest > testGetBrokerMethods() STARTED

Gradle Test Run :core:test > Gradle Test Executor 91 > KafkaZkClientTest > testGetBrokerMethods() PASSED

Gradle Test Run :core:test > Gradle Test Executor 91 > KafkaZkClientTest > testCreateTokenChangeNotification() STARTED

Gradle Test Run :core:test > Gradle Test Executor 91 > KafkaZkClientTest > testCreateTokenChangeNotification() PASSED

Gradle Test Run :core:test > Gradle Test Executor 91 > KafkaZkClientTest > testGetTopicsAndPartitions() STARTED

Gradle Test Run :core:test > Gradle Test Executor 91 > KafkaZkClientTest > testGetTopicsAndPartitions() PASSED

Gradle Test Run :core:test > Gradle Test Executor 91 > KafkaZkClientTest > testChroot(boolean) > [1] createChrootIfNecessary=true STARTED

Gradle Test Run :core:test > Gradle Test Executor 91 > KafkaZkClientTest > testChroot(boolean) > [1] createChrootIfNecessary=true PASSED

Gradle Test Run :core:test > Gradle Test Executor 91 > KafkaZkClientTest > testChroot(boolean) > [2] createChrootIfNecessary=false STARTED

Gradle Test Run :core:test > Gradle Test Executor 91 > KafkaZkClientTest > testChroot(boolean) > [2] createChrootIfNecessary=false PASSED

Gradle Test Run :core:test > Gradle Test Executor 91 > KafkaZkClientTest > testRegisterBrokerInfo() STARTED

Gradle Test Run :core:test > Gradle Test Executor 91 > KafkaZkClientTest > testRegisterBrokerInfo() PASSED

Gradle Test Run :core:test > Gradle Test Executor 91 > KafkaZkClientTest > testRetryRegisterBrokerInfo() STARTED

Gradle Test Run :core:test > Gradle Test Executor 91 > KafkaZkClientTest > testRetryRegisterBrokerInfo() PASSED

Gradle Test Run :core:test > Gradle Test Executor 91 > KafkaZkClientTest > testConsumerOffsetPath() STARTED

Gradle Test Run :core:test > Gradle Test Executor 91 > KafkaZkClientTest > testConsumerOffsetPath() PASSED

Gradle Test Run :core:test > Gradle Test Executor 91 > KafkaZkClientTest > testDeleteRecursiveWithControllerEpochVersionCheck() STARTED

Gradle Test Run :core:test > Gradle Test Executor 91 > KafkaZkClientTest > testDeleteRecursiveWithControllerEpochVersionCheck() PASSED

Gradle Test Run :core:test > Gradle Test Executor 91 > KafkaZkClientTest > testTopicAssignments() STARTED

Gradle Test Run :core:test > Gradle Test Executor 91 > KafkaZkClientTest > testTopicAssignments() PASSED

Gradle Test Run :core:test > Gradle Test Executor 91 > KafkaZkClientTest > testControllerManagementMethods() STARTED

Gradle Test Run :core:test > Gradle Test Executor 91 > KafkaZkClientTest > testControllerManagementMethods() PASSED

Gradle Test Run :core:test > Gradle Test Executor 91 > KafkaZkClientTest > testTopicAssignmentMethods() STARTED

Gradle Test Run :core:test > Gradle Test Executor 91 > KafkaZkClientTest > testTopicAssignmentMethods() PASSED

Gradle Test Run :core:test > Gradle Test Executor 91 > KafkaZkClientTest > testConnectionViaNettyClient() STARTED

Gradle Test Run :core:test > Gradle Test Executor 91 > KafkaZkClientTest > testConnectionViaNettyClient() PASSED

Gradle Test Run :core:test > Gradle Test Executor 91 > KafkaZkClientTest > testPropagateIsrChanges() STARTED

Gradle Test Run :core:test > Gradle Test Executor 91 > KafkaZkClientTest > testPropagateIsrChanges() PASSED

Gradle Test Run :core:test > Gradle Test Executor 91 > KafkaZkClientTest > testControllerEpochMethods() STARTED

Gradle Test Run :core:test > Gradle Test Executor 91 > KafkaZkClientTest > testControllerEpochMethods() PASSED

Gradle Test Run :core:test > Gradle Test Executor 91 > KafkaZkClientTest > testDeleteRecursive() STARTED

Gradle Test Run :core:test > Gradle Test Executor 91 > KafkaZkClientTest > testDeleteRecursive() PASSED

Gradle Test Run :core:test > Gradle Test Executor 91 > KafkaZkClientTest > testGetTopicPartitionStates() STARTED

Gradle Test Run :core:test > Gradle Test Executor 91 > KafkaZkClientTest > testGetTopicPartitionStates() PASSED

Gradle Test Run :core:test > Gradle Test Executor 91 > KafkaZkClientTest > testCreateConfigChangeNotification() STARTED

Gradle Test Run :core:test > Gradle Test Executor 91 > KafkaZkClientTest > testCreateConfigChangeNotification() PASSED

Gradle Test Run :core:test > Gradle Test Executor 91 > KafkaZkClientTest > testDelegationTokenMethods() STARTED

Gradle Test Run :core:test > Gradle Test Executor 91 > KafkaZkClientTest > testDelegationTokenMethods() PASSED

Gradle Test Run :core:test > Gradle Test Executor 91 > ReassignPartitionsZNodeTest > testDecodeInvalidJson() STARTED

Gradle Test Run :core:test > Gradle Test Executor 91 > ReassignPartitionsZNodeTest > testDecodeInvalidJson() PASSED

Gradle Test Run :core:test > Gradle Test Executor 91 > ReassignPartitionsZNodeTest > testEncode() STARTED

Gradle Test Run :core:test > Gradle Test Executor 91 > ReassignPartitionsZNodeTest > testEncode() PASSED

Gradle Test Run :core:test > Gradle Test Executor 91 > ReassignPartitionsZNodeTest > testDecodeValidJson() STARTED

Gradle Test Run :core:test > Gradle Test Executor 91 > ReassignPartitionsZNodeTest > testDecodeValidJson() PASSED

Gradle Test Run :core:test > Gradle Test Executor 91 > ZkMigrationIntegrationTest > testDualWriteScram(ClusterInstance) > [1] Type=ZK, Name=testDualWriteScram, MetadataVersion=3.5-IV2, Security=PLAINTEXT STARTED

Gradle Test Run :core:test > Gradle Test Executor 91 > ZkMigrationIntegrationTest > testDualWriteScram(ClusterInstance) > [1] Type=ZK, Name=testDualWriteScram, MetadataVersion=3.5-IV2, Security=PLAINTEXT PASSED

Gradle Test Run :core:test > Gradle Test Executor 91 > ZkMigrationIntegrationTest > testNewAndChangedTopicsInDualWrite(ClusterInstance) > [1] Type=ZK, Name=testNewAndChangedTopicsInDualWrite, MetadataVersion=3.4-IV0, Security=PLAINTEXT STARTED

Gradle Test Run :core:test > Gradle Test Executor 91 > ZkMigrationIntegrationTest > testNewAndChangedTopicsInDualWrite(ClusterInstance) > [1] Type=ZK, Name=testNewAndChangedTopicsInDualWrite, MetadataVersion=3.4-IV0, Security=PLAINTEXT PASSED

Gradle Test Run :core:test > Gradle Test Executor 91 > ZkMigrationIntegrationTest > testDualWriteQuotaAndScram(ClusterInstance) > [1] Type=ZK, Name=testDualWriteQuotaAndScram, MetadataVersion=3.5-IV2, Security=PLAINTEXT STARTED

Gradle Test Run :core:test > Gradle Test Executor 91 > ZkMigrationIntegrationTest > testDualWriteQuotaAndScram(ClusterInstance) > [1] Type=ZK, Name=testDualWriteQuotaAndScram, MetadataVersion=3.5-IV2, Security=PLAINTEXT PASSED

Gradle Test Run :core:test > Gradle Test Executor 91 > ZkMigrationIntegrationTest > testMigrate(ClusterInstance) > [1] Type=ZK, Name=testMigrate, MetadataVersion=3.4-IV0, Security=PLAINTEXT STARTED

Gradle Test Run :core:test > Gradle Test Executor 91 > ZkMigrationIntegrationTest > testMigrate(ClusterInstance) > [1] Type=ZK, Name=testMigrate, MetadataVersion=3.4-IV0, Security=PLAINTEXT PASSED

Gradle Test Run :core:test > Gradle Test Executor 91 > ZkMigrationIntegrationTest > testMigrateAcls(ClusterInstance) > [1] Type=ZK, Name=testMigrateAcls, MetadataVersion=3.4-IV0, Security=PLAINTEXT STARTED

Gradle Test Run :core:test > Gradle Test Executor 91 > ZkMigrationIntegrationTest > testMigrateAcls(ClusterInstance) > [1] Type=ZK, Name=testMigrateAcls, MetadataVersion=3.4-IV0, Security=PLAINTEXT PASSED

Gradle Test Run :core:test > Gradle Test Executor 91 > ZkMigrationIntegrationTest > testStartZkBrokerWithAuthorizer(ClusterInstance) > [1] Type=ZK, Name=testStartZkBrokerWithAuthorizer, MetadataVersion=3.4-IV0, Security=PLAINTEXT STARTED

Gradle Test Run :core:test > Gradle Test Executor 91 > ZkMigrationIntegrationTest > testStartZkBrokerWithAuthorizer(ClusterInstance) > [1] Type=ZK, Name=testStartZkBrokerWithAuthorizer, MetadataVersion=3.4-IV0, Security=PLAINTEXT PASSED

Gradle Test Run :core:test > Gradle Test Executor 91 > ZkMigrationIntegrationTest > testDualWrite(ClusterInstance) > [1] Type=ZK, MetadataVersion=3.4-IV0, Security=PLAINTEXT STARTED

Gradle Test Run :core:test > Gradle Test Executor 91 > ZkMigrationIntegrationTest > testDualWrite(ClusterInstance) > [1] Type=ZK, MetadataVersion=3.4-IV0, Security=PLAINTEXT PASSED

Gradle Test Run :core:test > Gradle Test Executor 91 > ZkMigrationIntegrationTest > testDualWrite(ClusterInstance) > [2] Type=ZK, MetadataVersion=3.5-IV2, Security=PLAINTEXT STARTED

Gradle Test Run :core:test > Gradle Test Executor 91 > ZkMigrationIntegrationTest > testDualWrite(ClusterInstance) > [2] Type=ZK, MetadataVersion=3.5-IV2, Security=PLAINTEXT PASSED

Gradle Test Run :core:test > Gradle Test Executor 91 > ZkMigrationIntegrationTest > testDualWrite(ClusterInstance) > [3] Type=ZK, MetadataVersion=3.6-IV2, Security=PLAINTEXT STARTED

Gradle Test Run :core:test > Gradle Test Executor 91 > ZkMigrationIntegrationTest > testDualWrite(ClusterInstance) > [3] Type=ZK, MetadataVersion=3.6-IV2, Security=PLAINTEXT PASSED

Gradle Test Run :core:test > Gradle Test Executor 91 > ZkConfigMigrationClientTest > testScram() STARTED

Gradle Test Run :core:test > Gradle Test Executor 91 > ZkConfigMigrationClientTest > testScram() PASSED

Gradle Test Run :core:test > Gradle Test Executor 91 > ZkConfigMigrationClientTest > testMigrationBrokerConfigs() STARTED

Gradle Test Run :core:test > Gradle Test Executor 91 > ZkConfigMigrationClientTest > testMigrationBrokerConfigs() PASSED

Gradle Test Run :core:test > Gradle Test Executor 91 > ZkConfigMigrationClientTest > testMigrateClientQuotas() STARTED

Gradle Test Run :core:test > Gradle Test Executor 91 > ZkConfigMigrationClientTest > testMigrateClientQuotas() PASSED

Gradle Test Run :core:test > Gradle Test Executor 91 > ZkConfigMigrationClientTest > testWriteNewTopicConfigs() STARTED

Gradle Test Run :core:test > Gradle Test Executor 91 > ZkConfigMigrationClientTest > testWriteNewTopicConfigs() PASSED

Gradle Test Run :core:test > Gradle Test Executor 91 > ZkConfigMigrationClientTest > testDelegationTokens() STARTED

Gradle Test Run :core:test > Gradle Test Executor 91 > ZkConfigMigrationClientTest > testDelegationTokens() PASSED

Gradle Test Run :core:test > Gradle Test Executor 91 > ZkConfigMigrationClientTest > testWriteNewClientQuotas() STARTED

Gradle Test Run :core:test > Gradle Test Executor 91 > ZkConfigMigrationClientTest > testWriteNewClientQuotas() PASSED

Gradle Test Run :core:test > Gradle Test Executor 91 > ZkConfigMigrationClientTest > testWriteExistingTopicConfigs() STARTED

Gradle Test Run :core:test > Gradle Test Executor 91 > ZkConfigMigrationClientTest > testWriteExistingTopicConfigs() PASSED

Gradle Test Run :core:test > Gradle Test Executor 91 > ZkConfigMigrationClientTest > testWriteExistingClientQuotas() STARTED

Gradle Test Run :core:test > Gradle Test Executor 91 > ZkConfigMigrationClientTest > testWriteExistingClientQuotas() PASSED

Gradle Test Run :core:test > Gradle Test Executor 91 > ZkConfigMigrationClientTest > testScramAndQuotaChangesInSnapshot() STARTED

Gradle Test Run :core:test > Gradle Test Executor 91 > ZkConfigMigrationClientTest > testScramAndQuotaChangesInSnapshot() PASSED

Gradle Test Run :core:test > Gradle Test Executor 91 > AddPartitionsToTxnManagerTest > testAddTxnData() STARTED

Gradle Test Run :core:test > Gradle Test Executor 91 > AddPartitionsToTxnManagerTest > testAddTxnData() PASSED

Gradle Test Run :core:test > Gradle Test Executor 91 > AddPartitionsToTxnManagerTest > testGenerateRequests() STARTED

Gradle Test Run :core:test > Gradle Test Executor 91 > AddPartitionsToTxnManagerTest > testGenerateRequests() PASSED

Gradle Test Run :core:test > Gradle Test Executor 91 > AddPartitionsToTxnManagerTest > testAddPartitionsToTxnManagerMetrics() STARTED

Gradle Test Run :core:test > Gradle Test Executor 91 > AddPartitionsToTxnManagerTest > testAddPartitionsToTxnManagerMetrics() PASSED

Gradle Test Run :core:test > Gradle Test Executor 91 > AddPartitionsToTxnManagerTest > testAddPartitionsToTxnHandlerErrorHandling() STARTED

Gradle Test Run :core:test > Gradle Test Executor 91 > AddPartitionsToTxnManagerTest > testAddPartitionsToTxnHandlerErrorHandling() PASSED

Gradle Test Run :core:test > Gradle Test Executor 95 > FetchFromFollowerIntegrationTest > testRackAwareRangeAssignor() STARTED

Gradle Test Run :core:test > Gradle Test Executor 95 > FetchFromFollowerIntegrationTest > testRackAwareRangeAssignor() PASSED

Gradle Test Run :core:test > Gradle Test Executor 95 > ProducerIdExpirationTest > testTransactionAfterTransactionIdExpiresButProducerIdRemains(String) > testTransactionAfterTransactionIdExpiresButProducerIdRemains(String).quorum=zk STARTED

Gradle Test Run :core:test > Gradle Test Executor 95 > ProducerIdExpirationTest > testTransactionAfterTransactionIdExpiresButProducerIdRemains(String) > testTransactionAfterTransactionIdExpiresButProducerIdRemains(String).quorum=zk PASSED

Gradle Test Run :core:test > Gradle Test Executor 95 > ProducerIdExpirationTest > testTransactionAfterTransactionIdExpiresButProducerIdRemains(String) > testTransactionAfterTransactionIdExpiresButProducerIdRemains(String).quorum=kraft STARTED

Gradle Test Run :core:test > Gradle Test Executor 95 > ProducerIdExpirationTest > testTransactionAfterTransactionIdExpiresButProducerIdRemains(String) > testTransactionAfterTransactionIdExpiresButProducerIdRemains(String).quorum=kraft PASSED

5113 tests completed, 2 failed, 9 skipped
There were failing tests. See the report at: file:///home/jenkins/jenkins-agent/workspace/Kafka_kafka_3.6/core/build/reports/tests/test/index.html

Deprecated Gradle features were used in this build, making it incompatible with Gradle 9.0.

You can use '--warning-mode all' to show the individual deprecation warnings and determine if they come from your own scripts or plugins.

For more on this, please refer to https://docs.gradle.org/8.2.1/userguide/command_line_interface.html#sec:command_line_warnings in the Gradle documentation.

BUILD SUCCESSFUL in 2h 25m 12s
302 actionable tasks: 111 executed, 191 up-to-date

Publishing build scan...
https://ge.apache.org/s/mkpkj5nsve3sw


See the profiling report at: file:///home/jenkins/jenkins-agent/workspace/Kafka_kafka_3.6/build/reports/profile/profile-2023-11-09-11-12-43.html
A fine-grained performance profile is available: use the --scan option.
[Pipeline] junit
Recording test results
[Checks API] No suitable checks publisher found.
[Pipeline] echo
Skipping Kafka Streams archetype test for Java 20
[Pipeline] }
[Pipeline] // withEnv
[Pipeline] }
[Pipeline] // withEnv
[Pipeline] }
[Pipeline] // withEnv
[Pipeline] }
[Pipeline] // node
[Pipeline] }
[Pipeline] // timestamps
[Pipeline] }
[Pipeline] // timeout
[Pipeline] }
[Pipeline] // stage
[Pipeline] }
[Pipeline] // parallel
[Pipeline] }
[Pipeline] // stage
[Pipeline] stage
[Pipeline] { (Declarative: Post Actions)
[Pipeline] script
[Pipeline] {
[Pipeline] node
Running on builds30 in /home/jenkins/jenkins-agent/workspace/Kafka_kafka_3.6
[Pipeline] {
[Pipeline] step

Jenkins build is unstable: Kafka » Kafka Branch Builder » 3.6 #106

Posted by Apache Jenkins Server <je...@builds.apache.org>.
See <https://ci-builds.apache.org/job/Kafka/job/kafka/job/3.6/106/display/redirect>


Build failed in Jenkins: Kafka » Kafka Branch Builder » 3.6 #105

Posted by Apache Jenkins Server <je...@builds.apache.org>.
See <https://ci-builds.apache.org/job/Kafka/job/kafka/job/3.6/105/display/redirect>

Changes:


------------------------------------------
[...truncated 411519 lines...]
> Task :clients:generateMetadataFileForMavenJavaPublication
> Task :connect:api:compileTestJava UP-TO-DATE
> Task :connect:api:testClasses UP-TO-DATE
> Task :connect:json:copyDependantLibs UP-TO-DATE
> Task :connect:json:jar UP-TO-DATE
> Task :connect:json:generateMetadataFileForMavenJavaPublication
> Task :connect:api:testJar
> Task :connect:api:testSrcJar
> Task :storage:api:compileTestJava
> Task :storage:api:testClasses
> Task :connect:json:publishMavenJavaPublicationToMavenLocal
> Task :connect:json:publishToMavenLocal
> Task :connect:api:publishMavenJavaPublicationToMavenLocal
> Task :connect:api:publishToMavenLocal
> Task :server-common:compileTestJava
> Task :server-common:testClasses
> Task :raft:compileTestJava
> Task :raft:testClasses
> Task :group-coordinator:compileTestJava
> Task :group-coordinator:testClasses

> Task :clients:javadoc
/home/jenkins/jenkins-agent/workspace/Kafka_kafka_3.6/clients/src/main/java/org/apache/kafka/common/config/ConfigDef.java:81: warning - Tag @link:illegal character: "60" in "#define(String, Type, Importance, String, String, int, Width, String, List<String>)"
/home/jenkins/jenkins-agent/workspace/Kafka_kafka_3.6/clients/src/main/java/org/apache/kafka/common/config/ConfigDef.java:81: warning - Tag @link:illegal character: "62" in "#define(String, Type, Importance, String, String, int, Width, String, List<String>)"
/home/jenkins/jenkins-agent/workspace/Kafka_kafka_3.6/clients/src/main/java/org/apache/kafka/common/config/ConfigDef.java:81: warning - Tag @link: can't find define(String, Type, Importance, String, String, int, Width, String, List<String>) in org.apache.kafka.common.config.ConfigDef
/home/jenkins/jenkins-agent/workspace/Kafka_kafka_3.6/clients/src/main/java/org/apache/kafka/clients/admin/ScramMechanism.java:32: warning - Tag @see: missing final '>': "<a href="https://cwiki.apache.org/confluence/display/KAFKA/KIP-554%3A+Add+Broker-side+SCRAM+Config+API">KIP-554: Add Broker-side SCRAM Config API</a>

 This code is duplicated in org.apache.kafka.common.security.scram.internals.ScramMechanism.
 The type field in both files must match and must not change. The type field
 is used both for passing ScramCredentialUpsertion and for the internal
 UserScramCredentialRecord. Do not change the type field."

> Task :metadata:compileTestJava
> Task :metadata:testClasses

> Task :clients:javadoc
/home/jenkins/jenkins-agent/workspace/Kafka_kafka_3.6/clients/src/main/java/org/apache/kafka/common/security/oauthbearer/secured/package-info.java:21: warning - Tag @link: reference not found: org.apache.kafka.common.security.oauthbearer
5 warnings

> Task :clients:javadocJar
> Task :clients:srcJar
> Task :clients:testJar
> Task :clients:testSrcJar
> Task :clients:publishMavenJavaPublicationToMavenLocal
> Task :clients:publishToMavenLocal
> Task :core:classes
> Task :core:compileTestJava NO-SOURCE
> Task :core:compileTestScala
> Task :core:testClasses
> Task :streams:compileTestJava
> Task :streams:testClasses
> Task :streams:testJar
> Task :streams:testSrcJar
> Task :streams:publishMavenJavaPublicationToMavenLocal
> Task :streams:publishToMavenLocal

Deprecated Gradle features were used in this build, making it incompatible with Gradle 9.0.

You can use '--warning-mode all' to show the individual deprecation warnings and determine if they come from your own scripts or plugins.

For more on this, please refer to https://docs.gradle.org/8.2.1/userguide/command_line_interface.html#sec:command_line_warnings in the Gradle documentation.

BUILD SUCCESSFUL in 13m 34s
94 actionable tasks: 41 executed, 53 up-to-date

Publishing build scan...
https://ge.apache.org/s/rgl73gsn3agys

[Pipeline] sh
+ grep ^version= gradle.properties
+ cut -d= -f 2
[Pipeline] dir
Running in /home/jenkins/jenkins-agent/workspace/Kafka_kafka_3.6/streams/quickstart
[Pipeline] {
[Pipeline] sh
+ mvn clean install -Dgpg.skip
[INFO] Scanning for projects...
[INFO] ------------------------------------------------------------------------
[INFO] Reactor Build Order:
[INFO] 
[INFO] Kafka Streams :: Quickstart                                        [pom]
[INFO] streams-quickstart-java                                [maven-archetype]
[INFO] 
[INFO] ----------------< org.apache.kafka:streams-quickstart >-----------------
[INFO] Building Kafka Streams :: Quickstart 3.6.1-SNAPSHOT                [1/2]
[INFO]   from pom.xml
[INFO] --------------------------------[ pom ]---------------------------------
[INFO] 
[INFO] --- clean:3.0.0:clean (default-clean) @ streams-quickstart ---
[INFO] 
[INFO] --- remote-resources:1.5:process (process-resource-bundles) @ streams-quickstart ---
[INFO] 
[INFO] --- site:3.5.1:attach-descriptor (attach-descriptor) @ streams-quickstart ---
[INFO] 
[INFO] --- gpg:1.6:sign (sign-artifacts) @ streams-quickstart ---
[INFO] 
[INFO] --- install:2.5.2:install (default-install) @ streams-quickstart ---
[INFO] Installing /home/jenkins/jenkins-agent/workspace/Kafka_kafka_3.6/streams/quickstart/pom.xml to /home/jenkins/.m2/repository/org/apache/kafka/streams-quickstart/3.6.1-SNAPSHOT/streams-quickstart-3.6.1-SNAPSHOT.pom
[INFO] 
[INFO] --------------< org.apache.kafka:streams-quickstart-java >--------------
[INFO] Building streams-quickstart-java 3.6.1-SNAPSHOT                    [2/2]
[INFO]   from java/pom.xml
[INFO] --------------------------[ maven-archetype ]---------------------------
[INFO] 
[INFO] --- clean:3.0.0:clean (default-clean) @ streams-quickstart-java ---
[INFO] 
[INFO] --- remote-resources:1.5:process (process-resource-bundles) @ streams-quickstart-java ---
[INFO] 
[INFO] --- resources:2.7:resources (default-resources) @ streams-quickstart-java ---
[INFO] Using 'UTF-8' encoding to copy filtered resources.
[INFO] Copying 6 resources
[INFO] Copying 3 resources
[INFO] 
[INFO] --- resources:2.7:testResources (default-testResources) @ streams-quickstart-java ---
[INFO] Using 'UTF-8' encoding to copy filtered resources.
[INFO] Copying 2 resources
[INFO] Copying 3 resources
[INFO] 
[INFO] --- archetype:2.2:jar (default-jar) @ streams-quickstart-java ---
[INFO] Building archetype jar: /home/jenkins/jenkins-agent/workspace/Kafka_kafka_3.6/streams/quickstart/java/target/streams-quickstart-java-3.6.1-SNAPSHOT
[INFO] 
[INFO] --- site:3.5.1:attach-descriptor (attach-descriptor) @ streams-quickstart-java ---
[INFO] 
[INFO] --- archetype:2.2:integration-test (default-integration-test) @ streams-quickstart-java ---
[WARNING]  Parameter 'skip' (user property 'archetype.test.skip') is read-only, must not be used in configuration
[INFO] 
[INFO] --- gpg:1.6:sign (sign-artifacts) @ streams-quickstart-java ---
[INFO] 
[INFO] --- install:2.5.2:install (default-install) @ streams-quickstart-java ---
[INFO] Installing /home/jenkins/jenkins-agent/workspace/Kafka_kafka_3.6/streams/quickstart/java/target/streams-quickstart-java-3.6.1-SNAPSHOT.jar to /home/jenkins/.m2/repository/org/apache/kafka/streams-quickstart-java/3.6.1-SNAPSHOT/streams-quickstart-java-3.6.1-SNAPSHOT.jar
[INFO] Installing /home/jenkins/jenkins-agent/workspace/Kafka_kafka_3.6/streams/quickstart/java/pom.xml to /home/jenkins/.m2/repository/org/apache/kafka/streams-quickstart-java/3.6.1-SNAPSHOT/streams-quickstart-java-3.6.1-SNAPSHOT.pom
[INFO] 
[INFO] --- archetype:2.2:update-local-catalog (default-update-local-catalog) @ streams-quickstart-java ---
[INFO] ------------------------------------------------------------------------
[INFO] Reactor Summary for Kafka Streams :: Quickstart 3.6.1-SNAPSHOT:
[INFO] 
[INFO] Kafka Streams :: Quickstart ........................ SUCCESS [ 11.252 s]
[INFO] streams-quickstart-java ............................ SUCCESS [  4.860 s]
[INFO] ------------------------------------------------------------------------
[INFO] BUILD SUCCESS
[INFO] ------------------------------------------------------------------------
[INFO] Total time:  16.853 s
[INFO] Finished at: 2023-11-06T20:11:37Z
[INFO] ------------------------------------------------------------------------
[Pipeline] dir
Running in /home/jenkins/jenkins-agent/workspace/Kafka_kafka_3.6/streams/quickstart/test-streams-archetype
[Pipeline] {
[Pipeline] sh
+ echo Y
+ mvn archetype:generate -DarchetypeCatalog=local -DarchetypeGroupId=org.apache.kafka -DarchetypeArtifactId=streams-quickstart-java -DarchetypeVersion=3.6.1-SNAPSHOT -DgroupId=streams.examples -DartifactId=streams.examples -Dversion=0.1 -Dpackage=myapps
[INFO] Scanning for projects...
[INFO] 
[INFO] ------------------< org.apache.maven:standalone-pom >-------------------
[INFO] Building Maven Stub Project (No POM) 1
[INFO] --------------------------------[ pom ]---------------------------------
[INFO] 
[INFO] >>> archetype:3.2.1:generate (default-cli) > generate-sources @ standalone-pom >>>
[INFO] 
[INFO] <<< archetype:3.2.1:generate (default-cli) < generate-sources @ standalone-pom <<<
[INFO] 
[INFO] 
[INFO] --- archetype:3.2.1:generate (default-cli) @ standalone-pom ---
[INFO] Generating project in Interactive mode
[WARNING] Archetype not found in any catalog. Falling back to central repository.
[WARNING] Add a repository with id 'archetype' in your settings.xml if archetype's repository is elsewhere.
[INFO] Using property: groupId = streams.examples
[INFO] Using property: artifactId = streams.examples
[INFO] Using property: version = 0.1
[INFO] Using property: package = myapps
Confirm properties configuration:
groupId: streams.examples
artifactId: streams.examples
version: 0.1
package: myapps
 Y: : [INFO] ----------------------------------------------------------------------------
[INFO] Using following parameters for creating project from Archetype: streams-quickstart-java:3.6.1-SNAPSHOT
[INFO] ----------------------------------------------------------------------------
[INFO] Parameter: groupId, Value: streams.examples
[INFO] Parameter: artifactId, Value: streams.examples
[INFO] Parameter: version, Value: 0.1
[INFO] Parameter: package, Value: myapps
[INFO] Parameter: packageInPathFormat, Value: myapps
[INFO] Parameter: package, Value: myapps
[INFO] Parameter: version, Value: 0.1
[INFO] Parameter: groupId, Value: streams.examples
[INFO] Parameter: artifactId, Value: streams.examples
[INFO] Project created from Archetype in dir: /home/jenkins/jenkins-agent/workspace/Kafka_kafka_3.6/streams/quickstart/test-streams-archetype/streams.examples
[INFO] ------------------------------------------------------------------------
[INFO] BUILD SUCCESS
[INFO] ------------------------------------------------------------------------
[INFO] Total time:  6.845 s
[INFO] Finished at: 2023-11-06T20:11:49Z
[INFO] ------------------------------------------------------------------------
[Pipeline] dir
Running in /home/jenkins/jenkins-agent/workspace/Kafka_kafka_3.6/streams/quickstart/test-streams-archetype/streams.examples
[Pipeline] {
[Pipeline] sh
+ mvn compile
[INFO] Scanning for projects...
[INFO] 
[INFO] -----------------< streams.examples:streams.examples >------------------
[INFO] Building Kafka Streams Quickstart :: Java 0.1
[INFO]   from pom.xml
[INFO] --------------------------------[ jar ]---------------------------------
[INFO] 
[INFO] --- resources:3.3.1:resources (default-resources) @ streams.examples ---
[INFO] Copying 1 resource from src/main/resources to target/classes
[INFO] 
[INFO] --- compiler:3.1:compile (default-compile) @ streams.examples ---
[INFO] Changes detected - recompiling the module!
[INFO] Compiling 3 source files to /home/jenkins/jenkins-agent/workspace/Kafka_kafka_3.6/streams/quickstart/test-streams-archetype/streams.examples/target/classes
[INFO] ------------------------------------------------------------------------
[INFO] BUILD SUCCESS
[INFO] ------------------------------------------------------------------------
[INFO] Total time:  9.193 s
[INFO] Finished at: 2023-11-06T20:12:04Z
[INFO] ------------------------------------------------------------------------
[Pipeline] }
[Pipeline] // dir
[Pipeline] }
[Pipeline] // dir
[Pipeline] }
[Pipeline] // dir
[Pipeline] }
[Pipeline] // withEnv
[Pipeline] }
[Pipeline] // withEnv
[Pipeline] }
[Pipeline] // withEnv
[Pipeline] }
[Pipeline] // node
[Pipeline] }
[Pipeline] // timestamps
[Pipeline] }
[Pipeline] // timeout
[Pipeline] }
[Pipeline] // stage
[Pipeline] }
[Pipeline] // parallel
[Pipeline] }
[Pipeline] // stage
[Pipeline] stage
[Pipeline] { (Declarative: Post Actions)
[Pipeline] script
[Pipeline] {
[Pipeline] node
Running on builds37 in /home/jenkins/jenkins-agent/workspace/Kafka_kafka_3.6
[Pipeline] {
[Pipeline] step

Build failed in Jenkins: Kafka » Kafka Branch Builder » 3.6 #104

Posted by Apache Jenkins Server <je...@builds.apache.org>.
See <https://ci-builds.apache.org/job/Kafka/job/kafka/job/3.6/104/display/redirect>

Changes:


------------------------------------------
[...truncated 302605 lines...]
Gradle Test Run :connect:runtime:test > Gradle Test Executor 44 > org.apache.kafka.connect.storage.OffsetUtilsTest > testValidateFormatMapWithNonPrimitiveKeys STARTED

Gradle Test Run :connect:runtime:test > Gradle Test Executor 44 > org.apache.kafka.connect.storage.OffsetUtilsTest > testValidateFormatMapWithNonPrimitiveKeys PASSED

Gradle Test Run :connect:runtime:test > Gradle Test Executor 44 > org.apache.kafka.connect.storage.OffsetUtilsTest > testProcessPartitionKeyListWithOneElement STARTED

Gradle Test Run :connect:runtime:test > Gradle Test Executor 44 > org.apache.kafka.connect.storage.OffsetUtilsTest > testProcessPartitionKeyListWithOneElement PASSED

Gradle Test Run :connect:runtime:test > Gradle Test Executor 44 > org.apache.kafka.connect.storage.OffsetUtilsTest > testValidateFormatNotMap STARTED

Gradle Test Run :connect:runtime:test > Gradle Test Executor 44 > org.apache.kafka.connect.storage.OffsetUtilsTest > testValidateFormatNotMap PASSED

Gradle Test Run :connect:runtime:test > Gradle Test Executor 44 > org.apache.kafka.connect.storage.OffsetUtilsTest > testProcessPartitionKeyValidList STARTED

Gradle Test Run :connect:runtime:test > Gradle Test Executor 44 > org.apache.kafka.connect.storage.OffsetUtilsTest > testProcessPartitionKeyValidList PASSED

Gradle Test Run :connect:runtime:test > Gradle Test Executor 44 > org.apache.kafka.connect.util.ConvertingFutureCallbackTest > shouldNotConvertBeforeGetOnFailedCompletion STARTED

Gradle Test Run :connect:runtime:test > Gradle Test Executor 44 > org.apache.kafka.connect.util.ConvertingFutureCallbackTest > shouldNotConvertBeforeGetOnFailedCompletion PASSED

Gradle Test Run :connect:runtime:test > Gradle Test Executor 44 > org.apache.kafka.connect.util.ConvertingFutureCallbackTest > shouldBlockUntilCancellation STARTED

Gradle Test Run :connect:runtime:test > Gradle Test Executor 44 > org.apache.kafka.connect.util.ConvertingFutureCallbackTest > shouldBlockUntilCancellation PASSED

Gradle Test Run :connect:runtime:test > Gradle Test Executor 44 > org.apache.kafka.connect.util.ConvertingFutureCallbackTest > shouldConvertOnlyOnceBeforeGetOnSuccessfulCompletion STARTED

Gradle Test Run :connect:runtime:test > Gradle Test Executor 44 > org.apache.kafka.connect.util.ConvertingFutureCallbackTest > shouldConvertOnlyOnceBeforeGetOnSuccessfulCompletion PASSED

Gradle Test Run :connect:runtime:test > Gradle Test Executor 44 > org.apache.kafka.connect.util.ConvertingFutureCallbackTest > shouldBlockUntilSuccessfulCompletion STARTED

Gradle Test Run :connect:runtime:test > Gradle Test Executor 44 > org.apache.kafka.connect.util.ConvertingFutureCallbackTest > shouldBlockUntilSuccessfulCompletion PASSED

Gradle Test Run :connect:runtime:test > Gradle Test Executor 44 > org.apache.kafka.connect.util.ConvertingFutureCallbackTest > shouldConvertBeforeGetOnSuccessfulCompletion STARTED

Gradle Test Run :connect:runtime:test > Gradle Test Executor 44 > org.apache.kafka.connect.util.ConvertingFutureCallbackTest > shouldConvertBeforeGetOnSuccessfulCompletion PASSED

Gradle Test Run :connect:runtime:test > Gradle Test Executor 44 > org.apache.kafka.connect.util.ConvertingFutureCallbackTest > shouldNotCancelIfMayNotCancelWhileRunning STARTED

Gradle Test Run :connect:runtime:test > Gradle Test Executor 44 > org.apache.kafka.connect.util.ConvertingFutureCallbackTest > shouldNotCancelIfMayNotCancelWhileRunning PASSED

Gradle Test Run :connect:runtime:test > Gradle Test Executor 44 > org.apache.kafka.connect.util.ConvertingFutureCallbackTest > shouldCancelBeforeGetIfMayCancelWhileRunning STARTED

Gradle Test Run :connect:runtime:test > Gradle Test Executor 44 > org.apache.kafka.connect.util.ConvertingFutureCallbackTest > shouldCancelBeforeGetIfMayCancelWhileRunning PASSED

Gradle Test Run :connect:runtime:test > Gradle Test Executor 44 > org.apache.kafka.connect.util.ConvertingFutureCallbackTest > shouldRecordOnlyFirstErrorBeforeGetOnFailedCompletion STARTED

Gradle Test Run :connect:runtime:test > Gradle Test Executor 44 > org.apache.kafka.connect.util.ConvertingFutureCallbackTest > shouldRecordOnlyFirstErrorBeforeGetOnFailedCompletion PASSED

Gradle Test Run :connect:runtime:test > Gradle Test Executor 44 > org.apache.kafka.connect.util.ConvertingFutureCallbackTest > shouldBlockUntilFailedCompletion STARTED

Gradle Test Run :connect:runtime:test > Gradle Test Executor 44 > org.apache.kafka.connect.util.ConvertingFutureCallbackTest > shouldBlockUntilFailedCompletion PASSED

Gradle Test Run :connect:runtime:test > Gradle Test Executor 44 > org.apache.kafka.connect.util.LoggingContextTest > shouldCreateConnectorLoggingContext STARTED

Gradle Test Run :connect:runtime:test > Gradle Test Executor 44 > org.apache.kafka.connect.util.LoggingContextTest > shouldCreateConnectorLoggingContext PASSED

Gradle Test Run :connect:runtime:test > Gradle Test Executor 44 > org.apache.kafka.connect.util.LoggingContextTest > shouldCreateTaskLoggingContext STARTED

Gradle Test Run :connect:runtime:test > Gradle Test Executor 44 > org.apache.kafka.connect.util.LoggingContextTest > shouldCreateTaskLoggingContext PASSED

Gradle Test Run :connect:runtime:test > Gradle Test Executor 44 > org.apache.kafka.connect.util.LoggingContextTest > shouldNotAllowNullConnectorNameForConnectorContext STARTED

Gradle Test Run :connect:runtime:test > Gradle Test Executor 44 > org.apache.kafka.connect.util.LoggingContextTest > shouldNotAllowNullConnectorNameForConnectorContext PASSED

Gradle Test Run :connect:runtime:test > Gradle Test Executor 44 > org.apache.kafka.connect.util.LoggingContextTest > shouldAllowNestedLoggingContexts STARTED

Gradle Test Run :connect:runtime:test > Gradle Test Executor 44 > org.apache.kafka.connect.util.LoggingContextTest > shouldAllowNestedLoggingContexts PASSED

Gradle Test Run :connect:runtime:test > Gradle Test Executor 44 > org.apache.kafka.connect.util.LoggingContextTest > shouldNotAllowNullTaskIdForTaskContext STARTED

Gradle Test Run :connect:runtime:test > Gradle Test Executor 44 > org.apache.kafka.connect.util.LoggingContextTest > shouldNotAllowNullTaskIdForTaskContext PASSED

Gradle Test Run :connect:runtime:test > Gradle Test Executor 44 > org.apache.kafka.connect.util.LoggingContextTest > shouldCreateAndCloseLoggingContextEvenWithNullContextMap STARTED

Gradle Test Run :connect:runtime:test > Gradle Test Executor 44 > org.apache.kafka.connect.util.LoggingContextTest > shouldCreateAndCloseLoggingContextEvenWithNullContextMap PASSED

Gradle Test Run :connect:runtime:test > Gradle Test Executor 44 > org.apache.kafka.connect.util.LoggingContextTest > shouldNotAllowNullTaskIdForOffsetContext STARTED

Gradle Test Run :connect:runtime:test > Gradle Test Executor 44 > org.apache.kafka.connect.util.LoggingContextTest > shouldNotAllowNullTaskIdForOffsetContext PASSED

Gradle Test Run :connect:runtime:test > Gradle Test Executor 44 > org.apache.kafka.connect.util.LoggingContextTest > shouldCreateOffsetsLoggingContext STARTED

Gradle Test Run :connect:runtime:test > Gradle Test Executor 44 > org.apache.kafka.connect.util.LoggingContextTest > shouldCreateOffsetsLoggingContext PASSED

Gradle Test Run :connect:runtime:test > Gradle Test Executor 44 > org.apache.kafka.connect.util.SharedTopicAdminTest > shouldCloseWithDurationAfterTopicAdminUsed STARTED

Gradle Test Run :connect:runtime:test > Gradle Test Executor 44 > org.apache.kafka.connect.util.SharedTopicAdminTest > shouldCloseWithDurationAfterTopicAdminUsed PASSED

Gradle Test Run :connect:runtime:test > Gradle Test Executor 44 > org.apache.kafka.connect.util.SharedTopicAdminTest > shouldCloseWithoutBeingUsed STARTED

Gradle Test Run :connect:runtime:test > Gradle Test Executor 44 > org.apache.kafka.connect.util.SharedTopicAdminTest > shouldCloseWithoutBeingUsed PASSED

Gradle Test Run :connect:runtime:test > Gradle Test Executor 44 > org.apache.kafka.connect.util.SharedTopicAdminTest > shouldCloseAfterTopicAdminUsed STARTED

Gradle Test Run :connect:runtime:test > Gradle Test Executor 44 > org.apache.kafka.connect.util.SharedTopicAdminTest > shouldCloseAfterTopicAdminUsed PASSED

Gradle Test Run :connect:runtime:test > Gradle Test Executor 44 > org.apache.kafka.connect.util.SharedTopicAdminTest > shouldFailToGetTopicAdminAfterClose STARTED

Gradle Test Run :connect:runtime:test > Gradle Test Executor 44 > org.apache.kafka.connect.util.SharedTopicAdminTest > shouldFailToGetTopicAdminAfterClose PASSED

Gradle Test Run :connect:runtime:test > Gradle Test Executor 44 > org.apache.kafka.connect.util.SharedTopicAdminTest > shouldCloseAfterTopicAdminUsedMultipleTimes STARTED

Gradle Test Run :connect:runtime:test > Gradle Test Executor 44 > org.apache.kafka.connect.util.SharedTopicAdminTest > shouldCloseAfterTopicAdminUsedMultipleTimes PASSED

Gradle Test Run :connect:runtime:test > Gradle Test Executor 44 > org.apache.kafka.connect.util.TableTest > basicOperations STARTED

Gradle Test Run :connect:runtime:test > Gradle Test Executor 44 > org.apache.kafka.connect.util.TableTest > basicOperations PASSED

Gradle Test Run :connect:runtime:test > Gradle Test Executor 44 > org.apache.kafka.connect.util.TopicCreationTest > topicCreationWithOneGroup STARTED

Gradle Test Run :connect:runtime:test > Gradle Test Executor 44 > org.apache.kafka.connect.util.TopicCreationTest > topicCreationWithOneGroup PASSED

Gradle Test Run :connect:runtime:test > Gradle Test Executor 44 > org.apache.kafka.connect.util.TopicCreationTest > topicCreationWithOneGroupAndCombinedRegex STARTED

Gradle Test Run :connect:runtime:test > Gradle Test Executor 44 > org.apache.kafka.connect.util.TopicCreationTest > topicCreationWithOneGroupAndCombinedRegex PASSED

Gradle Test Run :connect:runtime:test > Gradle Test Executor 44 > org.apache.kafka.connect.util.TopicCreationTest > testTopicCreationWithSingleTransformation STARTED

Gradle Test Run :connect:runtime:test > Gradle Test Executor 44 > org.apache.kafka.connect.util.TopicCreationTest > testTopicCreationWithSingleTransformation PASSED

Gradle Test Run :connect:runtime:test > Gradle Test Executor 44 > org.apache.kafka.connect.util.TopicCreationTest > topicCreationWithDefaultGroupAndCustomProps STARTED

Gradle Test Run :connect:runtime:test > Gradle Test Executor 44 > org.apache.kafka.connect.util.TopicCreationTest > topicCreationWithDefaultGroupAndCustomProps PASSED

Gradle Test Run :connect:runtime:test > Gradle Test Executor 44 > org.apache.kafka.connect.util.TopicCreationTest > topicCreationWithTwoGroupsAndTwoTransformations STARTED

Gradle Test Run :connect:runtime:test > Gradle Test Executor 44 > org.apache.kafka.connect.util.TopicCreationTest > topicCreationWithTwoGroupsAndTwoTransformations PASSED

Gradle Test Run :connect:runtime:test > Gradle Test Executor 44 > org.apache.kafka.connect.util.TopicCreationTest > testTopicCreationWhenTopicCreationIsEnabled STARTED

Gradle Test Run :connect:runtime:test > Gradle Test Executor 44 > org.apache.kafka.connect.util.TopicCreationTest > testTopicCreationWhenTopicCreationIsEnabled PASSED

Gradle Test Run :connect:runtime:test > Gradle Test Executor 44 > org.apache.kafka.connect.util.TopicCreationTest > withDefaultTopicCreation STARTED

Gradle Test Run :connect:runtime:test > Gradle Test Executor 44 > org.apache.kafka.connect.util.TopicCreationTest > withDefaultTopicCreation PASSED

Gradle Test Run :connect:runtime:test > Gradle Test Executor 44 > org.apache.kafka.connect.util.TopicCreationTest > testTopicCreationWhenTopicCreationIsDisabled STARTED

Gradle Test Run :connect:runtime:test > Gradle Test Executor 44 > org.apache.kafka.connect.util.TopicCreationTest > testTopicCreationWhenTopicCreationIsDisabled PASSED

Gradle Test Run :connect:runtime:test > Gradle Test Executor 44 > org.apache.kafka.connect.util.TopicCreationTest > topicCreationWithTwoGroups STARTED

Gradle Test Run :connect:runtime:test > Gradle Test Executor 44 > org.apache.kafka.connect.util.TopicCreationTest > topicCreationWithTwoGroups PASSED

Gradle Test Run :connect:runtime:test > Gradle Test Executor 44 > org.apache.kafka.connect.util.TopicCreationTest > testEmptyTopicCreation STARTED

Gradle Test Run :connect:runtime:test > Gradle Test Executor 44 > org.apache.kafka.connect.util.TopicCreationTest > testEmptyTopicCreation PASSED

Gradle Test Run :connect:runtime:test > Gradle Test Executor 98 > org.apache.kafka.connect.integration.BlockingConnectorTest > testWorkerRestartWithBlockInConnectorStart STARTED

Gradle Test Run :connect:runtime:test > Gradle Test Executor 99 > org.apache.kafka.connect.integration.OffsetsApiIntegrationTest > testResetSourceConnectorOffsetsCustomOffsetsTopic STARTED

Gradle Test Run :connect:runtime:test > Gradle Test Executor 99 > org.apache.kafka.connect.integration.OffsetsApiIntegrationTest > testResetSourceConnectorOffsetsCustomOffsetsTopic PASSED

Gradle Test Run :connect:runtime:test > Gradle Test Executor 98 > org.apache.kafka.connect.integration.BlockingConnectorTest > testWorkerRestartWithBlockInConnectorStart PASSED

Gradle Test Run :connect:runtime:test > Gradle Test Executor 98 > org.apache.kafka.connect.integration.RestForwardingIntegrationTest > testRestForwardSslDualListener STARTED

Gradle Test Run :connect:runtime:test > Gradle Test Executor 98 > org.apache.kafka.connect.integration.RestForwardingIntegrationTest > testRestForwardSslDualListener PASSED

1326 tests completed, 3 failed, 1 skipped
There were failing tests. See the report at: file:///home/jenkins/jenkins-agent/712657a4/workspace/Kafka_kafka_3.6/connect/runtime/build/reports/tests/test/index.html

FAILURE: Build completed with 3 failures.

1: Task failed with an exception.
-----------
* What went wrong:
Execution failed for task ':core:test'.
> Process 'Gradle Test Executor 14' finished with non-zero exit value 137
  This problem might be caused by incorrect test process configuration.
  For more on test execution, please refer to https://docs.gradle.org/8.2.1/userguide/java_testing.html#sec:test_execution in the Gradle documentation.

* Try:
> Run with --stacktrace option to get the stack trace.
> Run with --info or --debug option to get more log output.
> Get more help at https://help.gradle.org.
==============================================================================

2: Task failed with an exception.
-----------
* What went wrong:
Execution failed for task ':connect:mirror:test'.
> Process 'Gradle Test Executor 39' finished with non-zero exit value 137
  This problem might be caused by incorrect test process configuration.
  For more on test execution, please refer to https://docs.gradle.org/8.2.1/userguide/java_testing.html#sec:test_execution in the Gradle documentation.

* Try:
> Run with --stacktrace option to get the stack trace.
> Run with --info or --debug option to get more log output.
> Get more help at https://help.gradle.org.
==============================================================================

3: Task failed with an exception.
-----------
* What went wrong:
Execution failed for task ':streams:test'.
> Process 'Gradle Test Executor 26' finished with non-zero exit value 137
  This problem might be caused by incorrect test process configuration.
  For more on test execution, please refer to https://docs.gradle.org/8.2.1/userguide/java_testing.html#sec:test_execution in the Gradle documentation.

* Try:
> Run with --stacktrace option to get the stack trace.
> Run with --info or --debug option to get more log output.
> Get more help at https://help.gradle.org.
==============================================================================

Deprecated Gradle features were used in this build, making it incompatible with Gradle 9.0.

You can use '--warning-mode all' to show the individual deprecation warnings and determine if they come from your own scripts or plugins.

For more on this, please refer to https://docs.gradle.org/8.2.1/userguide/command_line_interface.html#sec:command_line_warnings in the Gradle documentation.

BUILD FAILED in 3h 35m 32s
302 actionable tasks: 111 executed, 191 up-to-date

Publishing build scan...
https://ge.apache.org/s/4v4nrlwmuk4jg


See the profiling report at: file:///home/jenkins/jenkins-agent/712657a4/workspace/Kafka_kafka_3.6/build/reports/profile/profile-2023-11-06-07-16-37.html
A fine-grained performance profile is available: use the --scan option.
[Pipeline] }
[Pipeline] // withEnv
[Pipeline] }
[Pipeline] // withEnv
[Pipeline] }
[Pipeline] // withEnv
[Pipeline] }
[Pipeline] // node
[Pipeline] }
[Pipeline] // timestamps
[Pipeline] }
[Pipeline] // timeout
[Pipeline] }
[Pipeline] // stage
[Pipeline] }
Failed in branch JDK 11 and Scala 2.13
[Pipeline] // parallel
[Pipeline] }
[Pipeline] // stage
[Pipeline] stage
[Pipeline] { (Declarative: Post Actions)
[Pipeline] script
[Pipeline] {
[Pipeline] node
Running on builds30 in /home/jenkins/jenkins-agent/workspace/Kafka_kafka_3.6
[Pipeline] {
[Pipeline] step