You are viewing a plain text version of this content. The canonical link for it is here.
Posted to issues@flink.apache.org by "Xintong Song (Jira)" <ji...@apache.org> on 2021/09/15 06:00:18 UTC

[jira] [Created] (FLINK-24288) YARNITCase.testPerJobWithArchive fails on azure

Xintong Song created FLINK-24288:
------------------------------------

             Summary: YARNITCase.testPerJobWithArchive fails on azure
                 Key: FLINK-24288
                 URL: https://issues.apache.org/jira/browse/FLINK-24288
             Project: Flink
          Issue Type: Bug
          Components: Deployment / YARN
    Affects Versions: 1.13.2
            Reporter: Xintong Song
             Fix For: 1.13.3


https://dev.azure.com/apache-flink/apache-flink/_build/results?buildId=24110&view=logs&j=5cae8624-c7eb-5c51-92d3-4d2dacedd221&t=420bd9ec-164e-562e-8947-0dacde3cec91&l=28978

{code}
Sep 15 03:56:13 [ERROR] Tests run: 5, Failures: 1, Errors: 0, Skipped: 0, Time elapsed: 152.597 s <<< FAILURE! - in org.apache.flink.yarn.YARNITCase
Sep 15 03:56:13 [ERROR] testPerJobWithArchive(org.apache.flink.yarn.YARNITCase)  Time elapsed: 25.161 s  <<< FAILURE!
Sep 15 03:56:13 java.lang.AssertionError: The lib directory should be uploaded to staging directory.
Sep 15 03:56:13 	at org.junit.Assert.fail(Assert.java:88)
Sep 15 03:56:13 	at org.junit.Assert.assertTrue(Assert.java:41)
Sep 15 03:56:13 	at org.apache.flink.yarn.YARNITCase.checkStagingDirectory(YARNITCase.java:209)
Sep 15 03:56:13 	at org.apache.flink.yarn.YARNITCase.deployPerJob(YARNITCase.java:184)
Sep 15 03:56:13 	at org.apache.flink.yarn.YARNITCase.lambda$testPerJobWithArchive$4(YARNITCase.java:133)
Sep 15 03:56:13 	at org.apache.flink.yarn.YarnTestBase.runTest(YarnTestBase.java:288)
Sep 15 03:56:13 	at org.apache.flink.yarn.YARNITCase.testPerJobWithArchive(YARNITCase.java:133)
{code}



--
This message was sent by Atlassian Jira
(v8.3.4#803005)