You are viewing a plain text version of this content. The canonical link for it is here.
Posted to builds@cassandra.apache.org by Apache Jenkins Server <je...@builds.apache.org> on 2021/11/16 21:00:40 UTC

Build complete: Cassandra-trunk #852 [UNSTABLE] f61d817cb5fc4c63d610cab83c5824361c008013

-------------------------------------------------------------------------------
Build Cassandra-trunk #852 Still Unstable
URL: https://ci-cassandra.apache.org/job/Cassandra-trunk/852/
-------------------------------------------------------------------------------
Changes:
[Ekaterina Dimitrova] Remove unused configuration parameters from cassandra.yaml


-------------------------------------------------------------------------------
Failed Tests:
18 tests failed.
FAILED:  dtest-upgrade.upgrade_tests.bootstrap_upgrade_test.TestBootstrapUpgrade.test_bootstrap_with_reset_bootstrap_state
FAILED:  dtest-upgrade.upgrade_tests.upgrade_through_versions_test.TestProtoV4Upgrade_AllVersions_EndsAt_Trunk_HEAD.test_rolling_upgrade_with_internode_ssl
FAILED:  org.apache.cassandra.distributed.upgrade.CompactStorageUpgradeTest.compactStorageUpgradeTest
FAILED:  org.apache.cassandra.distributed.test.SecondaryIndexTest.test_only_coordinator_chooses_index_for_query
FAILED:  org.apache.cassandra.db.compaction.CompactionsBytemanTest.testCompactingCFCounting
FAILED:  org.apache.cassandra.cql3.ViewFilteringTest.testRestrictedRegularColumnTimestampUpdates[3]
FAILED:  org.apache.cassandra.cql3.KeywordTest.test[keyword INTERNALS isReserved false]
FAILED:  dtest-upgrade.upgrade_tests.cql_tests.TestCQLNodes3RF3_Upgrade_indev_4_0_x_To_indev_trunk.test_timeuuid
FAILED:  dtest-upgrade.upgrade_tests.upgrade_through_versions_test.TestProtoV3Upgrade_AllVersions_EndsAt_3_11_X.test_rolling_upgrade
FAILED:  dtest-upgrade.upgrade_tests.upgrade_through_versions_test.TestProtoV3Upgrade_AllVersions_EndsAt_3_11_X.test_rolling_upgrade_with_internode_ssl
FAILED:  dtest-upgrade.upgrade_tests.upgrade_through_versions_test.TestProtoV3Upgrade_AllVersions_RandomPartitioner_EndsAt_3_11_X_HEAD.test_rolling_upgrade
FAILED:  dtest-upgrade.upgrade_tests.upgrade_through_versions_test.TestProtoV3Upgrade_AllVersions_RandomPartitioner_EndsAt_3_11_X_HEAD.test_rolling_upgrade_with_internode_ssl
FAILED:  dtest-upgrade.upgrade_tests.cql_tests.TestCQLNodes2RF1_Upgrade_current_4_0_x_To_indev_trunk.test_timeuuid
FAILED:  dtest-upgrade.upgrade_tests.cql_tests.cls.test_timeuuid
FAILED:  dtest-upgrade.upgrade_tests.cql_tests.TestCQLNodes2RF1_Upgrade_indev_4_0_x_To_indev_trunk.test_timeuuid
FAILED:  dtest-upgrade.upgrade_tests.cql_tests.TestCQLNodes3RF3_Upgrade_current_4_0_x_To_indev_trunk.test_timeuuid
FAILED:  dtest-upgrade.upgrade_tests.drop_compact_storage_upgrade_test.TestDropCompactStorage.test_drop_compact_storage_mixed_cluster
FAILED:  org.apache.cassandra.distributed.upgrade.CompactStorageUpgradeTest.compactStorageHiddenColumnTest

-------------------------------------------------------------------------------
For complete test report and logs see https://nightlies.apache.org/cassandra/Cassandra-trunk/852/