You are viewing a plain text version of this content. The canonical link for it is here.
Posted to notifications@jclouds.apache.org by je...@cloudbees.com on 2016/02/10 13:44:21 UTC

Build failed in Jenkins: jclouds-guava-guice-compat » 17.0,4.0,OpenJDK 7 (latest) #103

See <https://jclouds.ci.cloudbees.com/job/jclouds-guava-guice-compat/GUAVA_VERSION=17.0,GUICE_VERSION=4.0,jdk=OpenJDK%207%20(latest)/103/changes>

Changes:

[Ignasi Barrera] JCLOUDS-1072: Add support for environment-specific run lists to Role

------------------------------------------
[...truncated 31083 lines...]
Starting test testDelimiterList(org.jclouds.filesystem.integration.FilesystemContainerIntegrationTest)
[TestNG] Test testDelimiterList(org.jclouds.filesystem.integration.FilesystemContainerIntegrationTest) succeeded: 14ms
Test suite progress: tests succeeded: 62, failed: 0, skipped: 5.
Starting test testListContainerGetBlobSize(org.jclouds.filesystem.integration.FilesystemContainerIntegrationTest)
[TestNG] Test testListContainerGetBlobSize(org.jclouds.filesystem.integration.FilesystemContainerIntegrationTest) succeeded: 4ms
Test suite progress: tests succeeded: 63, failed: 0, skipped: 5.
Starting test testListContainerWithZeroMaxResults(org.jclouds.filesystem.integration.FilesystemContainerIntegrationTest)
[TestNG] Test testListContainerWithZeroMaxResults(org.jclouds.filesystem.integration.FilesystemContainerIntegrationTest) succeeded: 3ms
Test suite progress: tests succeeded: 64, failed: 0, skipped: 5.
Starting test testListMarkerAfterLastKey(org.jclouds.filesystem.integration.FilesystemContainerIntegrationTest)
[TestNG] Test testListMarkerAfterLastKey(org.jclouds.filesystem.integration.FilesystemContainerIntegrationTest) succeeded: 4ms
Test suite progress: tests succeeded: 65, failed: 0, skipped: 5.
Starting test containerExists(org.jclouds.filesystem.integration.FilesystemContainerIntegrationTest)
[TestNG] Test containerExists(org.jclouds.filesystem.integration.FilesystemContainerIntegrationTest) succeeded: 1ms
Test suite progress: tests succeeded: 66, failed: 0, skipped: 5.
Starting test deleteContainerIfEmptyWithContents(org.jclouds.filesystem.integration.FilesystemContainerIntegrationTest)
*** allocated new container jenkins-blobstore6894928023734922969...
[TestNG] Test deleteContainerIfEmptyWithContents(org.jclouds.filesystem.integration.FilesystemContainerIntegrationTest) failed.
Test suite progress: tests succeeded: 66, failed: 1, skipped: 5.
Starting test deleteContainerIfEmptyWithoutContents(org.jclouds.filesystem.integration.FilesystemContainerIntegrationTest)
*** allocated new container jenkins-blobstore244994603958661149...
[TestNG] Test deleteContainerIfEmptyWithoutContents(org.jclouds.filesystem.integration.FilesystemContainerIntegrationTest) succeeded: 3ms
Test suite progress: tests succeeded: 67, failed: 1, skipped: 5.
Starting test deleteContainerWithContents(org.jclouds.filesystem.integration.FilesystemContainerIntegrationTest)
*** allocated new container jenkins-blobstore9037338871289281418...
[TestNG] Test deleteContainerWithContents(org.jclouds.filesystem.integration.FilesystemContainerIntegrationTest) succeeded: 3ms
Test suite progress: tests succeeded: 68, failed: 1, skipped: 5.
Starting test deleteContainerWithoutContents(org.jclouds.filesystem.integration.FilesystemContainerIntegrationTest)
*** allocated new container jenkins-blobstore6468646684407873643...
[TestNG] Test deleteContainerWithoutContents(org.jclouds.filesystem.integration.FilesystemContainerIntegrationTest) succeeded: 2ms
Test suite progress: tests succeeded: 69, failed: 1, skipped: 5.
Starting test testDirectory(org.jclouds.filesystem.integration.FilesystemContainerIntegrationTest)
[TestNG] Test testDirectory(org.jclouds.filesystem.integration.FilesystemContainerIntegrationTest) skipped.
Test suite progress: tests succeeded: 69, failed: 1, skipped: 6.
Starting test testListContainer(org.jclouds.filesystem.integration.FilesystemContainerIntegrationTest)
[TestNG] Test testListContainer(org.jclouds.filesystem.integration.FilesystemContainerIntegrationTest) succeeded: 19ms
Test suite progress: tests succeeded: 70, failed: 1, skipped: 6.
Starting test testListContainerMarker(org.jclouds.filesystem.integration.FilesystemContainerIntegrationTest)
[TestNG] Test testListContainerMarker(org.jclouds.filesystem.integration.FilesystemContainerIntegrationTest) succeeded: 41ms
Test suite progress: tests succeeded: 71, failed: 1, skipped: 6.
Starting test testListContainerMaxResults(org.jclouds.filesystem.integration.FilesystemContainerIntegrationTest)
[TestNG] Test testListContainerMaxResults(org.jclouds.filesystem.integration.FilesystemContainerIntegrationTest) succeeded: 58ms
Test suite progress: tests succeeded: 72, failed: 1, skipped: 6.
Starting test testListContainerPrefix(org.jclouds.filesystem.integration.FilesystemContainerIntegrationTest)
[TestNG] Test testListContainerPrefix(org.jclouds.filesystem.integration.FilesystemContainerIntegrationTest) succeeded: 29ms
Test suite progress: tests succeeded: 73, failed: 1, skipped: 6.
Starting test testListRootUsesDelimiter(org.jclouds.filesystem.integration.FilesystemContainerIntegrationTest)
[TestNG] Test testListRootUsesDelimiter(org.jclouds.filesystem.integration.FilesystemContainerIntegrationTest) succeeded: 30ms
Test suite progress: tests succeeded: 74, failed: 1, skipped: 6.
Starting test testNotWithDetails(org.jclouds.filesystem.integration.FilesystemContainerIntegrationTest)
[TestNG] Test testNotWithDetails(org.jclouds.filesystem.integration.FilesystemContainerIntegrationTest) succeeded: 4ms
Test suite progress: tests succeeded: 75, failed: 1, skipped: 6.
Starting test testPutTwiceIsOkAndDoesntOverwrite(org.jclouds.filesystem.integration.FilesystemContainerIntegrationTest)
[TestNG] Test testPutTwiceIsOkAndDoesntOverwrite(org.jclouds.filesystem.integration.FilesystemContainerIntegrationTest) succeeded: 1ms
Test suite progress: tests succeeded: 76, failed: 1, skipped: 6.
Starting test testSetContainerAccess(org.jclouds.filesystem.integration.FilesystemContainerIntegrationTest)
[TestNG] Test testSetContainerAccess(org.jclouds.filesystem.integration.FilesystemContainerIntegrationTest) skipped.
Test suite progress: tests succeeded: 76, failed: 1, skipped: 7.
Starting test testWithDetails(org.jclouds.filesystem.integration.FilesystemContainerIntegrationTest)
[TestNG] Test testWithDetails(org.jclouds.filesystem.integration.FilesystemContainerIntegrationTest) succeeded: 3ms
Test suite progress: tests succeeded: 77, failed: 1, skipped: 7.
Tests run: 85, Failures: 1, Errors: 0, Skipped: 7, Time elapsed: 9.717 sec <<< FAILURE! - in TestSuite
deleteContainerIfEmptyWithContents(org.jclouds.filesystem.integration.FilesystemContainerIntegrationTest)  Time elapsed: 0.009 sec  <<< FAILURE!
java.lang.RuntimeException: java.nio.file.NoSuchFileException: ./target/basedir/jenkins-blobstore6234754557165772660
	at sun.nio.fs.UnixException.translateToIOException(UnixException.java:86)
	at sun.nio.fs.UnixException.rethrowAsIOException(UnixException.java:102)
	at sun.nio.fs.UnixException.rethrowAsIOException(UnixException.java:107)
	at sun.nio.fs.UnixFileAttributeViews$Basic.readAttributes(UnixFileAttributeViews.java:55)
	at sun.nio.fs.UnixFileSystemProvider.readAttributes(UnixFileSystemProvider.java:144)
	at sun.nio.fs.LinuxFileSystemProvider.readAttributes(LinuxFileSystemProvider.java:97)
	at java.nio.file.Files.readAttributes(Files.java:1686)
	at org.jclouds.filesystem.strategy.internal.FilesystemStorageStrategyImpl.getContainerMetadata(FilesystemStorageStrategyImpl.java:271)
	at org.jclouds.blobstore.config.LocalBlobStore$7.apply(LocalBlobStore.java:435)
	at org.jclouds.blobstore.config.LocalBlobStore$7.apply(LocalBlobStore.java:433)
	at com.google.common.collect.Iterators$8.transform(Iterators.java:794)
	at com.google.common.collect.TransformedIterator.next(TransformedIterator.java:48)
	at com.google.common.collect.Iterators.addAll(Iterators.java:357)
	at com.google.common.collect.Iterables.addAll(Iterables.java:354)
	at org.jclouds.blobstore.domain.internal.PageSetImpl.<init>(PageSetImpl.java:31)
	at org.jclouds.blobstore.config.LocalBlobStore.list(LocalBlobStore.java:432)
	at sun.reflect.GeneratedMethodAccessor11.invoke(Unknown Source)
	at sun.reflect.DelegatingMethodAccessorImpl.invoke(DelegatingMethodAccessorImpl.java:43)
	at java.lang.reflect.Method.invoke(Method.java:606)
	at com.google.inject.internal.DelegatingInvocationHandler.invoke(DelegatingInvocationHandler.java:50)
	at com.sun.proxy.$Proxy44.list(Unknown Source)
	at org.jclouds.blobstore.integration.internal.BaseBlobStoreIntegrationTest.returnContainer(BaseBlobStoreIntegrationTest.java:465)
	at org.jclouds.blobstore.integration.internal.BaseBlobStoreIntegrationTest.recycleContainerAndAddToPool(BaseBlobStoreIntegrationTest.java:502)
	at org.jclouds.blobstore.integration.internal.BaseContainerIntegrationTest.deleteContainerIfEmptyWithContents(BaseContainerIntegrationTest.java:449)
	at org.jclouds.filesystem.integration.FilesystemContainerIntegrationTest.deleteContainerIfEmptyWithContents(FilesystemContainerIntegrationTest.java:116)


Results :

Failed tests: 
  FilesystemContainerIntegrationTest.deleteContainerIfEmptyWithContents:116->BaseContainerIntegrationTest.deleteContainerIfEmptyWithContents:449->BaseBlobStoreIntegrationTest.recycleContainerAndAddToPool:502->BaseBlobStoreIntegrationTest.returnContainer:465 » Runtime

Tests run: 85, Failures: 1, Errors: 0, Skipped: 7

[INFO] ------------------------------------------------------------------------
[INFO] Reactor Summary:
[INFO] 
[INFO] Apache jclouds Project ............................ SUCCESS [21.049s]
[INFO] jclouds shared Maven resources .................... SUCCESS [4.673s]
[INFO] jclouds Components Core ........................... SUCCESS [1:39.921s]
[INFO] jclouds SLF4J Logging Module ...................... SUCCESS [2.746s]
[INFO] jclouds OAuth core ................................ SUCCESS [4.943s]
[INFO] jclouds Google Cloud Core ......................... SUCCESS [2.957s]
[INFO] jclouds OpenStack Components Core ................. SUCCESS [20.024s]
[INFO] jclouds commons project ........................... SUCCESS [0.659s]
[INFO] jclouds script builder ............................ SUCCESS [4.632s]
[INFO] jclouds compute core .............................. SUCCESS [53.647s]
[INFO] jclouds Log4J Logging Module ...................... SUCCESS [2.186s]
[INFO] jclouds loadbalancer core ......................... SUCCESS [1.809s]
[INFO] jclouds sts api ................................... SUCCESS [6.120s]
[INFO] jclouds cloudwatch api ............................ SUCCESS [10.706s]
[INFO] jclouds bouncycastle EncryptionService Module ..... SUCCESS [3.998s]
[INFO] jclouds sshj ssh client ........................... SUCCESS [5.350s]
[INFO] jclouds cloudstack core ........................... SUCCESS [51.680s]
[INFO] jclouds blobstore core ............................ SUCCESS [37.024s]
[INFO] jclouds filesystem core ........................... FAILURE [57.842s]
[INFO] jclouds bring your own node provider .............. SKIPPED
[INFO] jclouds OkHttp Driver ............................. SKIPPED
[INFO] jclouds s3 api .................................... SKIPPED
[INFO] jclouds ec2 api ................................... SKIPPED
[INFO] jclouds sqs api ................................... SKIPPED
[INFO] jclouds elasticstack core ......................... SKIPPED
[INFO] jclouds atmos components .......................... SKIPPED
[INFO] jclouds openstack-keystone api .................... SKIPPED
[INFO] jclouds openstack-cinder api ...................... SKIPPED
[INFO] Apache jclouds :: OpenStack :: Nova API ........... SKIPPED
[INFO] jclouds openstack-nova-ec2 api .................... SKIPPED
[INFO] jclouds openstack-swift api ....................... SKIPPED
[INFO] jclouds openstack-trove api ....................... SKIPPED
[INFO] jclouds rackspace cloudidentity api ............... SKIPPED
[INFO] jclouds Rackspace Cloud Load Balancers API ........ SKIPPED
[INFO] jclouds Rackspace Next Generation Cloud Block Storage US provider  SKIPPED
[INFO] jclouds Rackspace Next Generation Cloud Servers US provider  SKIPPED
[INFO] jclouds rackspace clouddns api .................... SKIPPED
[INFO] jclouds rackspace-cloudfiles api .................. SKIPPED
[INFO] jclouds route53 api ............................... SKIPPED
[INFO] jclouds Chef api .................................. SKIPPED
[INFO] jclouds apis project .............................. SKIPPED
[INFO] jclouds GoGrid provider ........................... SKIPPED
[INFO] jclouds Azure Storage provider .................... SKIPPED
[INFO] jclouds Apache Http Components Client ............. SKIPPED
[INFO] jclouds joda DateService Module ................... SKIPPED
[INFO] jclouds netty payload module ...................... SKIPPED
[INFO] jclouds enterprise Module ......................... SKIPPED
[INFO] jclouds Amazon Simple Storage Service (S3) provider  SKIPPED
[INFO] jclouds Amazon Elastic Load Balancer provider ..... SKIPPED
[INFO] jclouds Amazon EC2 provider ....................... SKIPPED
[INFO] jclouds Amazon Simple Queue Service provider ...... SKIPPED
[INFO] jclouds DigitalOcean v2 API Provider .............. SKIPPED
[INFO] jclouds ElasticHosts Peer1 London provider ........ SKIPPED
[INFO] jclouds ElasticHosts Peer1 San Antonio provider ... SKIPPED
[INFO] jclouds ElasticHosts BlueSquare London provider ... SKIPPED
[INFO] jclouds ElasticHosts Peer1 Toronto provider ....... SKIPPED
[INFO] jclouds ElasticHosts Peer1 Los Angeles provider ... SKIPPED
[INFO] jclouds ElasticHosts Amsterdam provider ........... SKIPPED
[INFO] jclouds ElasticHosts San Jose provider ............ SKIPPED
[INFO] jclouds ElasticHosts Hong Kong provider ........... SKIPPED
[INFO] jclouds ElasticHosts Sydney provider .............. SKIPPED
[INFO] jclouds ElasticHosts Miami provider ............... SKIPPED
[INFO] jclouds ElasticHosts Dallas provider .............. SKIPPED
[INFO] jclouds Open Hosting East1 provider ............... SKIPPED
[INFO] jclouds Serverlove Manchester provider ............ SKIPPED
[INFO] jclouds SkaliCloud Malaysia provider .............. SKIPPED
[INFO] jclouds Go2Cloud Johannesburg1 provider ........... SKIPPED
[INFO] jclouds Google Compute Engine provider ............ SKIPPED
[INFO] jclouds SoftLayer core ............................ SKIPPED
[INFO] jclouds Rackspace Cloud Files US provider ......... SKIPPED
[INFO] jclouds Rackspace Cloud Files UK provider ......... SKIPPED
[INFO] jclouds Rackspace Next Generation Cloud DNS US provider  SKIPPED
[INFO] jclouds Rackspace Next Generation Cloud DNS UK provider  SKIPPED
[INFO] jclouds Rackspace Cloud Databases US provider ..... SKIPPED
[INFO] jclouds Rackspace Cloud Databases UK provider ..... SKIPPED
[INFO] jclouds Rackspace Cloud Load Balancers US provider  SKIPPED
[INFO] jclouds Rackspace Cloud Load Balancers UK provider  SKIPPED
[INFO] jclouds Rackspace Next Generation Cloud Block Storage UK provider  SKIPPED
[INFO] jclouds Rackspace Next Generation Cloud Servers provider  SKIPPED
[INFO] jclouds GleSYS core ............................... SKIPPED
[INFO] jclouds Amazon Identity and Access Management (STS) provider  SKIPPED
[INFO] jclouds Amazon Route 53 provider .................. SKIPPED
[INFO] jclouds ultradns-ws provider ...................... SKIPPED
[INFO] jclouds dynect api ................................ SKIPPED
[INFO] jclouds providers project ......................... SKIPPED
[INFO] jclouds jsch ssh client ........................... SKIPPED
[INFO] jclouds example components for a standalone compute provider  SKIPPED
[INFO] jclouds skeletons project ......................... SKIPPED
[INFO] jclouds Google App Engine Components .............. SKIPPED
[INFO] jclouds drivers project ........................... SKIPPED
[INFO] allcompute ........................................ SKIPPED
[INFO] allblobstore ...................................... SKIPPED
[INFO] allloadbalancer ................................... SKIPPED
[INFO] all ............................................... SKIPPED
[INFO] Apache jclouds .................................... SKIPPED
[INFO] ------------------------------------------------------------------------
[INFO] BUILD FAILURE
[INFO] ------------------------------------------------------------------------
[INFO] Total time: 6:36.560s
[INFO] Finished at: Wed Feb 10 07:44:11 EST 2016
[INFO] Final Memory: 82M/298M
[INFO] ------------------------------------------------------------------------
[ERROR] Failed to execute goal org.apache.maven.plugins:maven-surefire-plugin:2.17:test (integration) on project filesystem: There are test failures.
[ERROR] 
[ERROR] Please refer to <https://jclouds.ci.cloudbees.com/job/jclouds-guava-guice-compat/GUAVA_VERSION=17.0,GUICE_VERSION=4.0,jdk=OpenJDK%207%20(latest)/ws/apis/filesystem/target/surefire-reports> for the individual test results.
[ERROR] -> [Help 1]
org.apache.maven.lifecycle.LifecycleExecutionException: Failed to execute goal org.apache.maven.plugins:maven-surefire-plugin:2.17:test (integration) on project filesystem: There are test failures.

Please refer to <https://jclouds.ci.cloudbees.com/job/jclouds-guava-guice-compat/GUAVA_VERSION=17.0,GUICE_VERSION=4.0,jdk=OpenJDK%207%20(latest)/ws/apis/filesystem/target/surefire-reports> for the individual test results.
	at org.apache.maven.lifecycle.internal.MojoExecutor.execute(MojoExecutor.java:213)
	at org.apache.maven.lifecycle.internal.MojoExecutor.execute(MojoExecutor.java:153)
	at org.apache.maven.lifecycle.internal.MojoExecutor.execute(MojoExecutor.java:145)
	at org.apache.maven.lifecycle.internal.LifecycleModuleBuilder.buildProject(LifecycleModuleBuilder.java:84)
	at org.apache.maven.lifecycle.internal.LifecycleModuleBuilder.buildProject(LifecycleModuleBuilder.java:59)
	at org.apache.maven.lifecycle.internal.LifecycleStarter.singleThreadedBuild(LifecycleStarter.java:183)
	at org.apache.maven.lifecycle.internal.LifecycleStarter.execute(LifecycleStarter.java:161)
	at org.apache.maven.DefaultMaven.doExecute(DefaultMaven.java:320)
	at org.apache.maven.DefaultMaven.execute(DefaultMaven.java:156)
	at org.apache.maven.cli.MavenCli.execute(MavenCli.java:537)
	at org.apache.maven.cli.MavenCli.doMain(MavenCli.java:196)
	at org.apache.maven.cli.MavenCli.main(MavenCli.java:141)
	at sun.reflect.NativeMethodAccessorImpl.invoke0(Native Method)
	at sun.reflect.NativeMethodAccessorImpl.invoke(NativeMethodAccessorImpl.java:57)
	at sun.reflect.DelegatingMethodAccessorImpl.invoke(DelegatingMethodAccessorImpl.java:43)
	at java.lang.reflect.Method.invoke(Method.java:606)
	at org.codehaus.plexus.classworlds.launcher.Launcher.launchEnhanced(Launcher.java:290)
	at org.codehaus.plexus.classworlds.launcher.Launcher.launch(Launcher.java:230)
	at org.codehaus.plexus.classworlds.launcher.Launcher.mainWithExitCode(Launcher.java:409)
	at org.codehaus.plexus.classworlds.launcher.Launcher.main(Launcher.java:352)
Caused by: org.apache.maven.plugin.MojoFailureException: There are test failures.

Please refer to <https://jclouds.ci.cloudbees.com/job/jclouds-guava-guice-compat/GUAVA_VERSION=17.0,GUICE_VERSION=4.0,jdk=OpenJDK%207%20(latest)/ws/apis/filesystem/target/surefire-reports> for the individual test results.
	at org.apache.maven.plugin.surefire.SurefireHelper.reportExecution(SurefireHelper.java:82)
	at org.apache.maven.plugin.surefire.SurefirePlugin.handleSummary(SurefirePlugin.java:195)
	at org.apache.maven.plugin.surefire.AbstractSurefireMojo.executeAfterPreconditionsChecked(AbstractSurefireMojo.java:861)
	at org.apache.maven.plugin.surefire.AbstractSurefireMojo.execute(AbstractSurefireMojo.java:729)
	at org.apache.maven.plugin.DefaultBuildPluginManager.executeMojo(DefaultBuildPluginManager.java:101)
	at org.apache.maven.lifecycle.internal.MojoExecutor.execute(MojoExecutor.java:209)
	... 19 more
[ERROR] 
[ERROR] Re-run Maven using the -X switch to enable full debug logging.
[ERROR] 
[ERROR] For more information about the errors and possible solutions, please read the following articles:
[ERROR] [Help 1] http://cwiki.apache.org/confluence/display/MAVEN/MojoFailureException
[ERROR] 
[ERROR] After correcting the problems, you can resume the build with the command
[ERROR]   mvn <goals> -rf :filesystem
Build step 'Invoke top-level Maven targets' marked build as failure

Jenkins build is back to normal : jclouds-guava-guice-compat » 17.0,4.0,OpenJDK 7 (latest) #106

Posted by je...@cloudbees.com.
See <https://jclouds.ci.cloudbees.com/job/jclouds-guava-guice-compat/GUAVA_VERSION=17.0,GUICE_VERSION=4.0,jdk=OpenJDK%207%20(latest)/106/changes>


Build failed in Jenkins: jclouds-guava-guice-compat » 17.0,4.0,OpenJDK 7 (latest) #105

Posted by je...@cloudbees.com.
See <https://jclouds.ci.cloudbees.com/job/jclouds-guava-guice-compat/GUAVA_VERSION=17.0,GUICE_VERSION=4.0,jdk=OpenJDK%207%20(latest)/105/>

------------------------------------------
[...truncated 5985 lines...]
	at org.testng.internal.TestMethodWorker.run(TestMethodWorker.java:108)
	at java.util.concurrent.ThreadPoolExecutor.runWorker(ThreadPoolExecutor.java:1145)
	at java.util.concurrent.ThreadPoolExecutor$Worker.run(ThreadPoolExecutor.java:615)
	at java.lang.Thread.run(Thread.java:744)
ERROR: , completed: 0/2, errors: 1, rate: 0ms/op
java.util.concurrent.ExecutionException: java.lang.RuntimeException
	at com.google.common.util.concurrent.Futures$ImmediateFailedFuture.get(Futures.java:188)
	at org.jclouds.concurrent.FutureIterables$1.run(FutureIterables.java:123)
	at com.google.common.util.concurrent.MoreExecutors$SameThreadExecutorService.execute(MoreExecutors.java:297)
	at com.google.common.util.concurrent.Futures$ImmediateFuture.addListener(Futures.java:104)
	at org.jclouds.concurrent.FutureIterables.awaitCompletion(FutureIterables.java:118)
	at org.jclouds.concurrent.FutureIterables.transformParallel(FutureIterables.java:86)
	at org.jclouds.concurrent.FutureIterables.transformParallel(FutureIterables.java:70)
	at org.jclouds.concurrent.FutureIterablesTest.testNormalExceptionPropagatesAsTransformParallelExceptionAndTries5XPerElement(FutureIterablesTest.java:68)
	at sun.reflect.NativeMethodAccessorImpl.invoke0(Native Method)
	at sun.reflect.NativeMethodAccessorImpl.invoke(NativeMethodAccessorImpl.java:57)
	at sun.reflect.DelegatingMethodAccessorImpl.invoke(DelegatingMethodAccessorImpl.java:43)
	at java.lang.reflect.Method.invoke(Method.java:606)
	at org.testng.internal.MethodInvocationHelper.invokeMethod(MethodInvocationHelper.java:85)
	at org.testng.internal.Invoker.invokeMethod(Invoker.java:696)
	at org.testng.internal.Invoker.invokeTestMethod(Invoker.java:882)
	at org.testng.internal.Invoker.invokeTestMethods(Invoker.java:1189)
	at org.testng.internal.TestMethodWorker.invokeTestMethods(TestMethodWorker.java:124)
	at org.testng.internal.TestMethodWorker.run(TestMethodWorker.java:108)
	at java.util.concurrent.ThreadPoolExecutor.runWorker(ThreadPoolExecutor.java:1145)
	at java.util.concurrent.ThreadPoolExecutor$Worker.run(ThreadPoolExecutor.java:615)
	at java.lang.Thread.run(Thread.java:744)
Caused by: java.lang.RuntimeException
	at org.jclouds.concurrent.FutureIterablesTest$2.apply(FutureIterablesTest.java:71)
	at org.jclouds.concurrent.FutureIterablesTest$2.apply(FutureIterablesTest.java:68)
	at org.jclouds.concurrent.FutureIterables.transformParallel(FutureIterables.java:82)
	... 15 more
ERROR: , completed: 0/2, errors: 2, rate: 0ms/op
java.util.concurrent.ExecutionException: java.lang.RuntimeException
	at com.google.common.util.concurrent.Futures$ImmediateFailedFuture.get(Futures.java:188)
	at org.jclouds.concurrent.FutureIterables$1.run(FutureIterables.java:123)
	at com.google.common.util.concurrent.MoreExecutors$SameThreadExecutorService.execute(MoreExecutors.java:297)
	at com.google.common.util.concurrent.Futures$ImmediateFuture.addListener(Futures.java:104)
	at org.jclouds.concurrent.FutureIterables.awaitCompletion(FutureIterables.java:118)
	at org.jclouds.concurrent.FutureIterables.transformParallel(FutureIterables.java:86)
	at org.jclouds.concurrent.FutureIterables.transformParallel(FutureIterables.java:70)
	at org.jclouds.concurrent.FutureIterablesTest.testNormalExceptionPropagatesAsTransformParallelExceptionAndTries5XPerElement(FutureIterablesTest.java:68)
	at sun.reflect.NativeMethodAccessorImpl.invoke0(Native Method)
	at sun.reflect.NativeMethodAccessorImpl.invoke(NativeMethodAccessorImpl.java:57)
	at sun.reflect.DelegatingMethodAccessorImpl.invoke(DelegatingMethodAccessorImpl.java:43)
	at java.lang.reflect.Method.invoke(Method.java:606)
	at org.testng.internal.MethodInvocationHelper.invokeMethod(MethodInvocationHelper.java:85)
	at org.testng.internal.Invoker.invokeMethod(Invoker.java:696)
	at org.testng.internal.Invoker.invokeTestMethod(Invoker.java:882)
	at org.testng.internal.Invoker.invokeTestMethods(Invoker.java:1189)
	at org.testng.internal.TestMethodWorker.invokeTestMethods(TestMethodWorker.java:124)
	at org.testng.internal.TestMethodWorker.run(TestMethodWorker.java:108)
	at java.util.concurrent.ThreadPoolExecutor.runWorker(ThreadPoolExecutor.java:1145)
	at java.util.concurrent.ThreadPoolExecutor$Worker.run(ThreadPoolExecutor.java:615)
	at java.lang.Thread.run(Thread.java:744)
Caused by: java.lang.RuntimeException
	at org.jclouds.concurrent.FutureIterablesTest$2.apply(FutureIterablesTest.java:71)
	at org.jclouds.concurrent.FutureIterablesTest$2.apply(FutureIterablesTest.java:68)
	at org.jclouds.concurrent.FutureIterables.transformParallel(FutureIterables.java:82)
	... 15 more
ERROR: , completed: 0/2, errors: 2, rate: 0ms/op
java.lang.RuntimeException: , completed: 0/2, errors: 2, rate: 0ms/op
	at org.jclouds.concurrent.FutureIterables.awaitCompletion(FutureIterables.java:153)
	at org.jclouds.concurrent.FutureIterables.transformParallel(FutureIterables.java:86)
	at org.jclouds.concurrent.FutureIterables.transformParallel(FutureIterables.java:70)
	at org.jclouds.concurrent.FutureIterablesTest.testNormalExceptionPropagatesAsTransformParallelExceptionAndTries5XPerElement(FutureIterablesTest.java:68)
	at sun.reflect.NativeMethodAccessorImpl.invoke0(Native Method)
	at sun.reflect.NativeMethodAccessorImpl.invoke(NativeMethodAccessorImpl.java:57)
	at sun.reflect.DelegatingMethodAccessorImpl.invoke(DelegatingMethodAccessorImpl.java:43)
	at java.lang.reflect.Method.invoke(Method.java:606)
	at org.testng.internal.MethodInvocationHelper.invokeMethod(MethodInvocationHelper.java:85)
	at org.testng.internal.Invoker.invokeMethod(Invoker.java:696)
	at org.testng.internal.Invoker.invokeTestMethod(Invoker.java:882)
	at org.testng.internal.Invoker.invokeTestMethods(Invoker.java:1189)
	at org.testng.internal.TestMethodWorker.invokeTestMethods(TestMethodWorker.java:124)
	at org.testng.internal.TestMethodWorker.run(TestMethodWorker.java:108)
	at java.util.concurrent.ThreadPoolExecutor.runWorker(ThreadPoolExecutor.java:1145)
	at java.util.concurrent.ThreadPoolExecutor$Worker.run(ThreadPoolExecutor.java:615)
	at java.lang.Thread.run(Thread.java:744)
[pool-87-thread-1] Test testNormalExceptionPropagatesAsTransformParallelExceptionAndTries5XPerElement(org.jclouds.concurrent.FutureIterablesTest) succeeded: 1749ms
Test suite progress: tests succeeded: 839, failed: 1, skipped: 0.
Tests run: 840, Failures: 1, Errors: 0, Skipped: 0, Time elapsed: 46.11 sec <<< FAILURE! - in TestSuite
testExponentialBackoffDelaySmallInterval1(org.jclouds.http.handlers.BackoffLimitedRetryHandlerTest)  Time elapsed: 0.011 sec  <<< FAILURE!
java.lang.AssertionError: expected [true] but found [false]
	at org.testng.Assert.fail(Assert.java:94)
	at org.testng.Assert.failNotEquals(Assert.java:494)
	at org.testng.Assert.assertTrue(Assert.java:42)
	at org.testng.Assert.assertTrue(Assert.java:52)
	at org.jclouds.http.handlers.BackoffLimitedRetryHandlerTest.testExponentialBackoffDelaySmallInterval1(BackoffLimitedRetryHandlerTest.java:105)


Results :

Failed tests: 
  BackoffLimitedRetryHandlerTest.testExponentialBackoffDelaySmallInterval1:105 expected [true] but found [false]

Tests run: 840, Failures: 1, Errors: 0, Skipped: 0

[INFO] ------------------------------------------------------------------------
[INFO] Reactor Summary:
[INFO] 
[INFO] Apache jclouds Project ............................ SUCCESS [15.224s]
[INFO] jclouds shared Maven resources .................... SUCCESS [6.105s]
[INFO] jclouds Components Core ........................... FAILURE [1:15.149s]
[INFO] jclouds SLF4J Logging Module ...................... SKIPPED
[INFO] jclouds OAuth core ................................ SKIPPED
[INFO] jclouds Google Cloud Core ......................... SKIPPED
[INFO] jclouds OpenStack Components Core ................. SKIPPED
[INFO] jclouds commons project ........................... SKIPPED
[INFO] jclouds script builder ............................ SKIPPED
[INFO] jclouds compute core .............................. SKIPPED
[INFO] jclouds Log4J Logging Module ...................... SKIPPED
[INFO] jclouds loadbalancer core ......................... SKIPPED
[INFO] jclouds sts api ................................... SKIPPED
[INFO] jclouds cloudwatch api ............................ SKIPPED
[INFO] jclouds bouncycastle EncryptionService Module ..... SKIPPED
[INFO] jclouds sshj ssh client ........................... SKIPPED
[INFO] jclouds cloudstack core ........................... SKIPPED
[INFO] jclouds blobstore core ............................ SKIPPED
[INFO] jclouds filesystem core ........................... SKIPPED
[INFO] jclouds bring your own node provider .............. SKIPPED
[INFO] jclouds OkHttp Driver ............................. SKIPPED
[INFO] jclouds s3 api .................................... SKIPPED
[INFO] jclouds ec2 api ................................... SKIPPED
[INFO] jclouds sqs api ................................... SKIPPED
[INFO] jclouds elasticstack core ......................... SKIPPED
[INFO] jclouds atmos components .......................... SKIPPED
[INFO] jclouds openstack-keystone api .................... SKIPPED
[INFO] jclouds openstack-cinder api ...................... SKIPPED
[INFO] Apache jclouds :: OpenStack :: Nova API ........... SKIPPED
[INFO] jclouds openstack-nova-ec2 api .................... SKIPPED
[INFO] jclouds openstack-swift api ....................... SKIPPED
[INFO] jclouds openstack-trove api ....................... SKIPPED
[INFO] jclouds rackspace cloudidentity api ............... SKIPPED
[INFO] jclouds Rackspace Cloud Load Balancers API ........ SKIPPED
[INFO] jclouds Rackspace Next Generation Cloud Block Storage US provider  SKIPPED
[INFO] jclouds Rackspace Next Generation Cloud Servers US provider  SKIPPED
[INFO] jclouds rackspace clouddns api .................... SKIPPED
[INFO] jclouds rackspace-cloudfiles api .................. SKIPPED
[INFO] jclouds route53 api ............................... SKIPPED
[INFO] jclouds Chef api .................................. SKIPPED
[INFO] jclouds apis project .............................. SKIPPED
[INFO] jclouds GoGrid provider ........................... SKIPPED
[INFO] jclouds Azure Storage provider .................... SKIPPED
[INFO] jclouds Apache Http Components Client ............. SKIPPED
[INFO] jclouds joda DateService Module ................... SKIPPED
[INFO] jclouds netty payload module ...................... SKIPPED
[INFO] jclouds enterprise Module ......................... SKIPPED
[INFO] jclouds Amazon Simple Storage Service (S3) provider  SKIPPED
[INFO] jclouds Amazon Elastic Load Balancer provider ..... SKIPPED
[INFO] jclouds Amazon EC2 provider ....................... SKIPPED
[INFO] jclouds Amazon Simple Queue Service provider ...... SKIPPED
[INFO] jclouds DigitalOcean v2 API Provider .............. SKIPPED
[INFO] jclouds ElasticHosts Peer1 London provider ........ SKIPPED
[INFO] jclouds ElasticHosts Peer1 San Antonio provider ... SKIPPED
[INFO] jclouds ElasticHosts BlueSquare London provider ... SKIPPED
[INFO] jclouds ElasticHosts Peer1 Toronto provider ....... SKIPPED
[INFO] jclouds ElasticHosts Peer1 Los Angeles provider ... SKIPPED
[INFO] jclouds ElasticHosts Amsterdam provider ........... SKIPPED
[INFO] jclouds ElasticHosts San Jose provider ............ SKIPPED
[INFO] jclouds ElasticHosts Hong Kong provider ........... SKIPPED
[INFO] jclouds ElasticHosts Sydney provider .............. SKIPPED
[INFO] jclouds ElasticHosts Miami provider ............... SKIPPED
[INFO] jclouds ElasticHosts Dallas provider .............. SKIPPED
[INFO] jclouds Open Hosting East1 provider ............... SKIPPED
[INFO] jclouds Serverlove Manchester provider ............ SKIPPED
[INFO] jclouds SkaliCloud Malaysia provider .............. SKIPPED
[INFO] jclouds Go2Cloud Johannesburg1 provider ........... SKIPPED
[INFO] jclouds Google Compute Engine provider ............ SKIPPED
[INFO] jclouds SoftLayer core ............................ SKIPPED
[INFO] jclouds Rackspace Cloud Files US provider ......... SKIPPED
[INFO] jclouds Rackspace Cloud Files UK provider ......... SKIPPED
[INFO] jclouds Rackspace Next Generation Cloud DNS US provider  SKIPPED
[INFO] jclouds Rackspace Next Generation Cloud DNS UK provider  SKIPPED
[INFO] jclouds Rackspace Cloud Databases US provider ..... SKIPPED
[INFO] jclouds Rackspace Cloud Databases UK provider ..... SKIPPED
[INFO] jclouds Rackspace Cloud Load Balancers US provider  SKIPPED
[INFO] jclouds Rackspace Cloud Load Balancers UK provider  SKIPPED
[INFO] jclouds Rackspace Next Generation Cloud Block Storage UK provider  SKIPPED
[INFO] jclouds Rackspace Next Generation Cloud Servers provider  SKIPPED
[INFO] jclouds GleSYS core ............................... SKIPPED
[INFO] jclouds Amazon Identity and Access Management (STS) provider  SKIPPED
[INFO] jclouds Amazon Route 53 provider .................. SKIPPED
[INFO] jclouds ultradns-ws provider ...................... SKIPPED
[INFO] jclouds dynect api ................................ SKIPPED
[INFO] jclouds providers project ......................... SKIPPED
[INFO] jclouds jsch ssh client ........................... SKIPPED
[INFO] jclouds example components for a standalone compute provider  SKIPPED
[INFO] jclouds skeletons project ......................... SKIPPED
[INFO] jclouds Google App Engine Components .............. SKIPPED
[INFO] jclouds drivers project ........................... SKIPPED
[INFO] allcompute ........................................ SKIPPED
[INFO] allblobstore ...................................... SKIPPED
[INFO] allloadbalancer ................................... SKIPPED
[INFO] all ............................................... SKIPPED
[INFO] Apache jclouds .................................... SKIPPED
[INFO] ------------------------------------------------------------------------
[INFO] BUILD FAILURE
[INFO] ------------------------------------------------------------------------
[INFO] Total time: 1:40.052s
[INFO] Finished at: Tue Feb 16 21:40:04 EST 2016
[INFO] Final Memory: 70M/253M
[INFO] ------------------------------------------------------------------------
[ERROR] Failed to execute goal org.apache.maven.plugins:maven-surefire-plugin:2.17:test (default-test) on project jclouds-core: There are test failures.
[ERROR] 
[ERROR] Please refer to <https://jclouds.ci.cloudbees.com/job/jclouds-guava-guice-compat/GUAVA_VERSION=17.0,GUICE_VERSION=4.0,jdk=OpenJDK%207%20(latest)/ws/core/target/surefire-reports> for the individual test results.
[ERROR] -> [Help 1]
org.apache.maven.lifecycle.LifecycleExecutionException: Failed to execute goal org.apache.maven.plugins:maven-surefire-plugin:2.17:test (default-test) on project jclouds-core: There are test failures.

Please refer to <https://jclouds.ci.cloudbees.com/job/jclouds-guava-guice-compat/GUAVA_VERSION=17.0,GUICE_VERSION=4.0,jdk=OpenJDK%207%20(latest)/ws/core/target/surefire-reports> for the individual test results.
	at org.apache.maven.lifecycle.internal.MojoExecutor.execute(MojoExecutor.java:213)
	at org.apache.maven.lifecycle.internal.MojoExecutor.execute(MojoExecutor.java:153)
	at org.apache.maven.lifecycle.internal.MojoExecutor.execute(MojoExecutor.java:145)
	at org.apache.maven.lifecycle.internal.LifecycleModuleBuilder.buildProject(LifecycleModuleBuilder.java:84)
	at org.apache.maven.lifecycle.internal.LifecycleModuleBuilder.buildProject(LifecycleModuleBuilder.java:59)
	at org.apache.maven.lifecycle.internal.LifecycleStarter.singleThreadedBuild(LifecycleStarter.java:183)
	at org.apache.maven.lifecycle.internal.LifecycleStarter.execute(LifecycleStarter.java:161)
	at org.apache.maven.DefaultMaven.doExecute(DefaultMaven.java:320)
	at org.apache.maven.DefaultMaven.execute(DefaultMaven.java:156)
	at org.apache.maven.cli.MavenCli.execute(MavenCli.java:537)
	at org.apache.maven.cli.MavenCli.doMain(MavenCli.java:196)
	at org.apache.maven.cli.MavenCli.main(MavenCli.java:141)
	at sun.reflect.NativeMethodAccessorImpl.invoke0(Native Method)
	at sun.reflect.NativeMethodAccessorImpl.invoke(NativeMethodAccessorImpl.java:57)
	at sun.reflect.DelegatingMethodAccessorImpl.invoke(DelegatingMethodAccessorImpl.java:43)
	at java.lang.reflect.Method.invoke(Method.java:606)
	at org.codehaus.plexus.classworlds.launcher.Launcher.launchEnhanced(Launcher.java:290)
	at org.codehaus.plexus.classworlds.launcher.Launcher.launch(Launcher.java:230)
	at org.codehaus.plexus.classworlds.launcher.Launcher.mainWithExitCode(Launcher.java:409)
	at org.codehaus.plexus.classworlds.launcher.Launcher.main(Launcher.java:352)
Caused by: org.apache.maven.plugin.MojoFailureException: There are test failures.

Please refer to <https://jclouds.ci.cloudbees.com/job/jclouds-guava-guice-compat/GUAVA_VERSION=17.0,GUICE_VERSION=4.0,jdk=OpenJDK%207%20(latest)/ws/core/target/surefire-reports> for the individual test results.
	at org.apache.maven.plugin.surefire.SurefireHelper.reportExecution(SurefireHelper.java:82)
	at org.apache.maven.plugin.surefire.SurefirePlugin.handleSummary(SurefirePlugin.java:195)
	at org.apache.maven.plugin.surefire.AbstractSurefireMojo.executeAfterPreconditionsChecked(AbstractSurefireMojo.java:861)
	at org.apache.maven.plugin.surefire.AbstractSurefireMojo.execute(AbstractSurefireMojo.java:729)
	at org.apache.maven.plugin.DefaultBuildPluginManager.executeMojo(DefaultBuildPluginManager.java:101)
	at org.apache.maven.lifecycle.internal.MojoExecutor.execute(MojoExecutor.java:209)
	... 19 more
[ERROR] 
[ERROR] Re-run Maven using the -X switch to enable full debug logging.
[ERROR] 
[ERROR] For more information about the errors and possible solutions, please read the following articles:
[ERROR] [Help 1] http://cwiki.apache.org/confluence/display/MAVEN/MojoFailureException
[ERROR] 
[ERROR] After correcting the problems, you can resume the build with the command
[ERROR]   mvn <goals> -rf :jclouds-core
Build step 'Invoke top-level Maven targets' marked build as failure

Build failed in Jenkins: jclouds-guava-guice-compat » 17.0,4.0,OpenJDK 7 (latest) #104

Posted by je...@cloudbees.com.
See <https://jclouds.ci.cloudbees.com/job/jclouds-guava-guice-compat/GUAVA_VERSION=17.0,GUICE_VERSION=4.0,jdk=OpenJDK%207%20(latest)/104/changes>

Changes:

[Zack Shoylev] Enhance the way openstack extensions are resolved. Needed for new openstack versions.

[Andrew Gaul] Convert CopyOptions into an AutoValue

[Andrew Gaul] JCLOUDS-651: Portable support for conditional copies

[Andrew Gaul] JCLOUDS-651: Local blobstore support for conditional copies

[Andrew Gaul] JCLOUDS-651: Atmos support for conditional copies

[Andrew Gaul] JCLOUDS-651: Azure support for conditional copies

[Andrew Gaul] JCLOUDS-651: S3 support for conditional copies

[Andrew Gaul] JCLOUDS-651: Swift support for conditional copies

[Andrew Gaul] Only quote ETag if it does not already have quotes

------------------------------------------
[...truncated 30203 lines...]
Starting test testPutTwiceIsOkAndDoesntOverwrite(org.jclouds.blobstore.integration.TransientContainerIntegrationTest)
[TestNG] Test testPutTwiceIsOkAndDoesntOverwrite(org.jclouds.blobstore.integration.TransientContainerIntegrationTest) succeeded: 2ms
Test suite progress: tests succeeded: 80, failed: 2, skipped: 3.
Starting test testWithDetails(org.jclouds.blobstore.integration.TransientContainerIntegrationTest)
[TestNG] Test testWithDetails(org.jclouds.blobstore.integration.TransientContainerIntegrationTest) succeeded: 1ms
Test suite progress: tests succeeded: 81, failed: 2, skipped: 3.
Starting test containerDoesntExist(org.jclouds.blobstore.integration.TransientServiceIntegrationTest)
[TestNG] Test containerDoesntExist(org.jclouds.blobstore.integration.TransientServiceIntegrationTest) succeeded: 1ms
Test suite progress: tests succeeded: 82, failed: 2, skipped: 3.
Starting test testAllLocations(org.jclouds.blobstore.integration.TransientServiceIntegrationTest)
*** allocated new container jenkins-blobstore8562730332489981438...
 >> creating container in location {scope=PROVIDER, id=transient, description=http://localhost}
 << call complete.. checking
*** allocated new container jenkins-blobstore-7866888213974476654...
[TestNG] Test testAllLocations(org.jclouds.blobstore.integration.TransientServiceIntegrationTest) succeeded: 6ms
Test suite progress: tests succeeded: 83, failed: 2, skipped: 3.
Starting test testGetAssignableLocations(org.jclouds.blobstore.integration.TransientServiceIntegrationTest)
location {scope=PROVIDER, id=transient, description=http://localhost}
[TestNG] Test testGetAssignableLocations(org.jclouds.blobstore.integration.TransientServiceIntegrationTest) succeeded: 1ms
Test suite progress: tests succeeded: 84, failed: 2, skipped: 3.
Starting test testSetBlobAccess(org.jclouds.blobstore.integration.TransientBlobIntegrationTest)
[TestNG] Test testSetBlobAccess(org.jclouds.blobstore.integration.TransientBlobIntegrationTest) skipped.
Test suite progress: tests succeeded: 84, failed: 2, skipped: 4.
Starting test testDuplicateCreateContainer(org.jclouds.blobstore.integration.TransientContainerIntegrationTest)
[TestNG] Test testDuplicateCreateContainer(org.jclouds.blobstore.integration.TransientContainerIntegrationTest) succeeded: 0ms
Test suite progress: tests succeeded: 85, failed: 2, skipped: 4.
Starting test testNotWithDetails(org.jclouds.blobstore.integration.TransientContainerIntegrationTest)
[TestNG] Test testNotWithDetails(org.jclouds.blobstore.integration.TransientContainerIntegrationTest) succeeded: 2ms
Test suite progress: tests succeeded: 86, failed: 2, skipped: 4.
Starting test testSetContainerAccess(org.jclouds.blobstore.integration.TransientContainerIntegrationTest)
[TestNG] Test testSetContainerAccess(org.jclouds.blobstore.integration.TransientContainerIntegrationTest) skipped.
Test suite progress: tests succeeded: 86, failed: 2, skipped: 5.
Tests run: 93, Failures: 2, Errors: 0, Skipped: 5, Time elapsed: 9.952 sec <<< FAILURE! - in TestSuite
testCopyIfMatch(org.jclouds.blobstore.integration.TransientBlobIntegrationTest)  Time elapsed: 0.015 sec  <<< FAILURE!
org.jclouds.http.HttpResponseException: request: GET http://stub HTTP/1.1 failed with response: HTTP/1.1 412 null
	at org.jclouds.blobstore.config.LocalBlobStore.returnResponseException(LocalBlobStore.java:517)
	at org.jclouds.blobstore.config.LocalBlobStore.copyBlob(LocalBlobStore.java:536)
	at sun.reflect.NativeMethodAccessorImpl.invoke0(Native Method)
	at sun.reflect.NativeMethodAccessorImpl.invoke(NativeMethodAccessorImpl.java:57)
	at sun.reflect.DelegatingMethodAccessorImpl.invoke(DelegatingMethodAccessorImpl.java:43)
	at java.lang.reflect.Method.invoke(Method.java:606)
	at com.google.inject.internal.DelegatingInvocationHandler.invoke(DelegatingInvocationHandler.java:50)
	at com.sun.proxy.$Proxy44.copyBlob(Unknown Source)
	at org.jclouds.blobstore.integration.internal.BaseBlobIntegrationTest.testCopyIfMatch(BaseBlobIntegrationTest.java:967)
	at sun.reflect.NativeMethodAccessorImpl.invoke0(Native Method)
	at sun.reflect.NativeMethodAccessorImpl.invoke(NativeMethodAccessorImpl.java:57)
	at sun.reflect.DelegatingMethodAccessorImpl.invoke(DelegatingMethodAccessorImpl.java:43)
	at java.lang.reflect.Method.invoke(Method.java:606)
	at org.testng.internal.MethodInvocationHelper.invokeMethod(MethodInvocationHelper.java:85)
	at org.testng.internal.Invoker.invokeMethod(Invoker.java:696)
	at org.testng.internal.Invoker.invokeTestMethod(Invoker.java:882)
	at org.testng.internal.Invoker.invokeTestMethods(Invoker.java:1189)
	at org.testng.internal.TestMethodWorker.invokeTestMethods(TestMethodWorker.java:124)
	at org.testng.internal.TestMethodWorker.run(TestMethodWorker.java:108)
	at org.testng.TestRunner.privateRun(TestRunner.java:767)
	at org.testng.TestRunner.run(TestRunner.java:617)
	at org.testng.SuiteRunner.runTest(SuiteRunner.java:348)
	at org.testng.SuiteRunner.access$000(SuiteRunner.java:38)
	at org.testng.SuiteRunner$SuiteWorker.run(SuiteRunner.java:382)
	at org.testng.internal.thread.ThreadUtil$2.call(ThreadUtil.java:64)
	at java.util.concurrent.FutureTask.run(FutureTask.java:262)
	at java.util.concurrent.ThreadPoolExecutor.runWorker(ThreadPoolExecutor.java:1145)
	at java.util.concurrent.ThreadPoolExecutor$Worker.run(ThreadPoolExecutor.java:615)
	at java.lang.Thread.run(Thread.java:744)

testCopyIfNoneMatchNegative(org.jclouds.blobstore.integration.TransientBlobIntegrationTest)  Time elapsed: 0.003 sec  <<< FAILURE!
java.lang.AssertionError: Expected HttpResponseException to be thrown
	at org.jclouds.blobstore.integration.internal.BaseBlobIntegrationTest.testCopyIfNoneMatchNegative(BaseBlobIntegrationTest.java:1056)
	at sun.reflect.NativeMethodAccessorImpl.invoke0(Native Method)
	at sun.reflect.NativeMethodAccessorImpl.invoke(NativeMethodAccessorImpl.java:57)
	at sun.reflect.DelegatingMethodAccessorImpl.invoke(DelegatingMethodAccessorImpl.java:43)
	at java.lang.reflect.Method.invoke(Method.java:606)
	at org.testng.internal.MethodInvocationHelper.invokeMethod(MethodInvocationHelper.java:85)
	at org.testng.internal.Invoker.invokeMethod(Invoker.java:696)
	at org.testng.internal.Invoker.invokeTestMethod(Invoker.java:882)
	at org.testng.internal.Invoker.invokeTestMethods(Invoker.java:1189)
	at org.testng.internal.TestMethodWorker.invokeTestMethods(TestMethodWorker.java:124)
	at org.testng.internal.TestMethodWorker.run(TestMethodWorker.java:108)
	at org.testng.TestRunner.privateRun(TestRunner.java:767)
	at org.testng.TestRunner.run(TestRunner.java:617)
	at org.testng.SuiteRunner.runTest(SuiteRunner.java:348)
	at org.testng.SuiteRunner.access$000(SuiteRunner.java:38)
	at org.testng.SuiteRunner$SuiteWorker.run(SuiteRunner.java:382)
	at org.testng.internal.thread.ThreadUtil$2.call(ThreadUtil.java:64)
	at java.util.concurrent.FutureTask.run(FutureTask.java:262)
	at java.util.concurrent.ThreadPoolExecutor.runWorker(ThreadPoolExecutor.java:1145)
	at java.util.concurrent.ThreadPoolExecutor$Worker.run(ThreadPoolExecutor.java:615)
	at java.lang.Thread.run(Thread.java:744)


Results :

Failed tests: 
  TransientBlobIntegrationTest>BaseBlobIntegrationTest.testCopyIfMatch:967 » HttpResponse
  TransientBlobIntegrationTest>BaseBlobIntegrationTest.testCopyIfNoneMatchNegative:1056 Expected HttpResponseException to be thrown

Tests run: 93, Failures: 2, Errors: 0, Skipped: 5

[INFO] ------------------------------------------------------------------------
[INFO] Reactor Summary:
[INFO] 
[INFO] Apache jclouds Project ............................ SUCCESS [26.234s]
[INFO] jclouds shared Maven resources .................... SUCCESS [6.116s]
[INFO] jclouds Components Core ........................... SUCCESS [1:32.161s]
[INFO] jclouds SLF4J Logging Module ...................... SUCCESS [2.944s]
[INFO] jclouds OAuth core ................................ SUCCESS [7.204s]
[INFO] jclouds Google Cloud Core ......................... SUCCESS [2.281s]
[INFO] jclouds OpenStack Components Core ................. SUCCESS [20.702s]
[INFO] jclouds commons project ........................... SUCCESS [0.879s]
[INFO] jclouds script builder ............................ SUCCESS [5.076s]
[INFO] jclouds compute core .............................. SUCCESS [51.144s]
[INFO] jclouds Log4J Logging Module ...................... SUCCESS [2.537s]
[INFO] jclouds loadbalancer core ......................... SUCCESS [2.091s]
[INFO] jclouds sts api ................................... SUCCESS [8.476s]
[INFO] jclouds cloudwatch api ............................ SUCCESS [20.270s]
[INFO] jclouds bouncycastle EncryptionService Module ..... SUCCESS [5.492s]
[INFO] jclouds sshj ssh client ........................... SUCCESS [5.916s]
[INFO] jclouds cloudstack core ........................... SUCCESS [55.670s]
[INFO] jclouds blobstore core ............................ FAILURE [35.291s]
[INFO] jclouds filesystem core ........................... SKIPPED
[INFO] jclouds bring your own node provider .............. SKIPPED
[INFO] jclouds OkHttp Driver ............................. SKIPPED
[INFO] jclouds s3 api .................................... SKIPPED
[INFO] jclouds ec2 api ................................... SKIPPED
[INFO] jclouds sqs api ................................... SKIPPED
[INFO] jclouds elasticstack core ......................... SKIPPED
[INFO] jclouds atmos components .......................... SKIPPED
[INFO] jclouds openstack-keystone api .................... SKIPPED
[INFO] jclouds openstack-cinder api ...................... SKIPPED
[INFO] Apache jclouds :: OpenStack :: Nova API ........... SKIPPED
[INFO] jclouds openstack-nova-ec2 api .................... SKIPPED
[INFO] jclouds openstack-swift api ....................... SKIPPED
[INFO] jclouds openstack-trove api ....................... SKIPPED
[INFO] jclouds rackspace cloudidentity api ............... SKIPPED
[INFO] jclouds Rackspace Cloud Load Balancers API ........ SKIPPED
[INFO] jclouds Rackspace Next Generation Cloud Block Storage US provider  SKIPPED
[INFO] jclouds Rackspace Next Generation Cloud Servers US provider  SKIPPED
[INFO] jclouds rackspace clouddns api .................... SKIPPED
[INFO] jclouds rackspace-cloudfiles api .................. SKIPPED
[INFO] jclouds route53 api ............................... SKIPPED
[INFO] jclouds Chef api .................................. SKIPPED
[INFO] jclouds apis project .............................. SKIPPED
[INFO] jclouds GoGrid provider ........................... SKIPPED
[INFO] jclouds Azure Storage provider .................... SKIPPED
[INFO] jclouds Apache Http Components Client ............. SKIPPED
[INFO] jclouds joda DateService Module ................... SKIPPED
[INFO] jclouds netty payload module ...................... SKIPPED
[INFO] jclouds enterprise Module ......................... SKIPPED
[INFO] jclouds Amazon Simple Storage Service (S3) provider  SKIPPED
[INFO] jclouds Amazon Elastic Load Balancer provider ..... SKIPPED
[INFO] jclouds Amazon EC2 provider ....................... SKIPPED
[INFO] jclouds Amazon Simple Queue Service provider ...... SKIPPED
[INFO] jclouds DigitalOcean v2 API Provider .............. SKIPPED
[INFO] jclouds ElasticHosts Peer1 London provider ........ SKIPPED
[INFO] jclouds ElasticHosts Peer1 San Antonio provider ... SKIPPED
[INFO] jclouds ElasticHosts BlueSquare London provider ... SKIPPED
[INFO] jclouds ElasticHosts Peer1 Toronto provider ....... SKIPPED
[INFO] jclouds ElasticHosts Peer1 Los Angeles provider ... SKIPPED
[INFO] jclouds ElasticHosts Amsterdam provider ........... SKIPPED
[INFO] jclouds ElasticHosts San Jose provider ............ SKIPPED
[INFO] jclouds ElasticHosts Hong Kong provider ........... SKIPPED
[INFO] jclouds ElasticHosts Sydney provider .............. SKIPPED
[INFO] jclouds ElasticHosts Miami provider ............... SKIPPED
[INFO] jclouds ElasticHosts Dallas provider .............. SKIPPED
[INFO] jclouds Open Hosting East1 provider ............... SKIPPED
[INFO] jclouds Serverlove Manchester provider ............ SKIPPED
[INFO] jclouds SkaliCloud Malaysia provider .............. SKIPPED
[INFO] jclouds Go2Cloud Johannesburg1 provider ........... SKIPPED
[INFO] jclouds Google Compute Engine provider ............ SKIPPED
[INFO] jclouds SoftLayer core ............................ SKIPPED
[INFO] jclouds Rackspace Cloud Files US provider ......... SKIPPED
[INFO] jclouds Rackspace Cloud Files UK provider ......... SKIPPED
[INFO] jclouds Rackspace Next Generation Cloud DNS US provider  SKIPPED
[INFO] jclouds Rackspace Next Generation Cloud DNS UK provider  SKIPPED
[INFO] jclouds Rackspace Cloud Databases US provider ..... SKIPPED
[INFO] jclouds Rackspace Cloud Databases UK provider ..... SKIPPED
[INFO] jclouds Rackspace Cloud Load Balancers US provider  SKIPPED
[INFO] jclouds Rackspace Cloud Load Balancers UK provider  SKIPPED
[INFO] jclouds Rackspace Next Generation Cloud Block Storage UK provider  SKIPPED
[INFO] jclouds Rackspace Next Generation Cloud Servers provider  SKIPPED
[INFO] jclouds GleSYS core ............................... SKIPPED
[INFO] jclouds Amazon Identity and Access Management (STS) provider  SKIPPED
[INFO] jclouds Amazon Route 53 provider .................. SKIPPED
[INFO] jclouds ultradns-ws provider ...................... SKIPPED
[INFO] jclouds dynect api ................................ SKIPPED
[INFO] jclouds providers project ......................... SKIPPED
[INFO] jclouds jsch ssh client ........................... SKIPPED
[INFO] jclouds example components for a standalone compute provider  SKIPPED
[INFO] jclouds skeletons project ......................... SKIPPED
[INFO] jclouds Google App Engine Components .............. SKIPPED
[INFO] jclouds drivers project ........................... SKIPPED
[INFO] allcompute ........................................ SKIPPED
[INFO] allblobstore ...................................... SKIPPED
[INFO] allloadbalancer ................................... SKIPPED
[INFO] all ............................................... SKIPPED
[INFO] Apache jclouds .................................... SKIPPED
[INFO] ------------------------------------------------------------------------
[INFO] BUILD FAILURE
[INFO] ------------------------------------------------------------------------
[INFO] Total time: 5:57.753s
[INFO] Finished at: Tue Feb 16 20:34:29 EST 2016
[INFO] Final Memory: 83M/295M
[INFO] ------------------------------------------------------------------------
[ERROR] Failed to execute goal org.apache.maven.plugins:maven-surefire-plugin:2.17:test (integration) on project jclouds-blobstore: There are test failures.
[ERROR] 
[ERROR] Please refer to <https://jclouds.ci.cloudbees.com/job/jclouds-guava-guice-compat/GUAVA_VERSION=17.0,GUICE_VERSION=4.0,jdk=OpenJDK%207%20(latest)/ws/blobstore/target/surefire-reports> for the individual test results.
[ERROR] -> [Help 1]
org.apache.maven.lifecycle.LifecycleExecutionException: Failed to execute goal org.apache.maven.plugins:maven-surefire-plugin:2.17:test (integration) on project jclouds-blobstore: There are test failures.

Please refer to <https://jclouds.ci.cloudbees.com/job/jclouds-guava-guice-compat/GUAVA_VERSION=17.0,GUICE_VERSION=4.0,jdk=OpenJDK%207%20(latest)/ws/blobstore/target/surefire-reports> for the individual test results.
	at org.apache.maven.lifecycle.internal.MojoExecutor.execute(MojoExecutor.java:213)
	at org.apache.maven.lifecycle.internal.MojoExecutor.execute(MojoExecutor.java:153)
	at org.apache.maven.lifecycle.internal.MojoExecutor.execute(MojoExecutor.java:145)
	at org.apache.maven.lifecycle.internal.LifecycleModuleBuilder.buildProject(LifecycleModuleBuilder.java:84)
	at org.apache.maven.lifecycle.internal.LifecycleModuleBuilder.buildProject(LifecycleModuleBuilder.java:59)
	at org.apache.maven.lifecycle.internal.LifecycleStarter.singleThreadedBuild(LifecycleStarter.java:183)
	at org.apache.maven.lifecycle.internal.LifecycleStarter.execute(LifecycleStarter.java:161)
	at org.apache.maven.DefaultMaven.doExecute(DefaultMaven.java:320)
	at org.apache.maven.DefaultMaven.execute(DefaultMaven.java:156)
	at org.apache.maven.cli.MavenCli.execute(MavenCli.java:537)
	at org.apache.maven.cli.MavenCli.doMain(MavenCli.java:196)
	at org.apache.maven.cli.MavenCli.main(MavenCli.java:141)
	at sun.reflect.NativeMethodAccessorImpl.invoke0(Native Method)
	at sun.reflect.NativeMethodAccessorImpl.invoke(NativeMethodAccessorImpl.java:57)
	at sun.reflect.DelegatingMethodAccessorImpl.invoke(DelegatingMethodAccessorImpl.java:43)
	at java.lang.reflect.Method.invoke(Method.java:606)
	at org.codehaus.plexus.classworlds.launcher.Launcher.launchEnhanced(Launcher.java:290)
	at org.codehaus.plexus.classworlds.launcher.Launcher.launch(Launcher.java:230)
	at org.codehaus.plexus.classworlds.launcher.Launcher.mainWithExitCode(Launcher.java:409)
	at org.codehaus.plexus.classworlds.launcher.Launcher.main(Launcher.java:352)
Caused by: org.apache.maven.plugin.MojoFailureException: There are test failures.

Please refer to <https://jclouds.ci.cloudbees.com/job/jclouds-guava-guice-compat/GUAVA_VERSION=17.0,GUICE_VERSION=4.0,jdk=OpenJDK%207%20(latest)/ws/blobstore/target/surefire-reports> for the individual test results.
	at org.apache.maven.plugin.surefire.SurefireHelper.reportExecution(SurefireHelper.java:82)
	at org.apache.maven.plugin.surefire.SurefirePlugin.handleSummary(SurefirePlugin.java:195)
	at org.apache.maven.plugin.surefire.AbstractSurefireMojo.executeAfterPreconditionsChecked(AbstractSurefireMojo.java:861)
	at org.apache.maven.plugin.surefire.AbstractSurefireMojo.execute(AbstractSurefireMojo.java:729)
	at org.apache.maven.plugin.DefaultBuildPluginManager.executeMojo(DefaultBuildPluginManager.java:101)
	at org.apache.maven.lifecycle.internal.MojoExecutor.execute(MojoExecutor.java:209)
	... 19 more
[ERROR] 
[ERROR] Re-run Maven using the -X switch to enable full debug logging.
[ERROR] 
[ERROR] For more information about the errors and possible solutions, please read the following articles:
[ERROR] [Help 1] http://cwiki.apache.org/confluence/display/MAVEN/MojoFailureException
[ERROR] 
[ERROR] After correcting the problems, you can resume the build with the command
[ERROR]   mvn <goals> -rf :jclouds-blobstore
Build step 'Invoke top-level Maven targets' marked build as failure