You are viewing a plain text version of this content. The canonical link for it is here.
Posted to dev@streams.apache.org by Apache Jenkins Server <je...@builds.apache.org> on 2014/10/22 18:24:40 UTC

Build failed in Jenkins: Streams Trunk #82

See <https://builds.apache.org/job/Streams%20Trunk/82/changes>

Changes:

[ryanebanks] Depricated printable monitoring solution, and turned it off by default

[ryanebanks] Added more @Deprecated annotations

------------------------------------------
[...truncated 3609 lines...]

Reason: Cannot find parent: org.apache.lucene:lucene-parent for project: org.apache.lucene:lucene-test-framework:jar:null for project org.apache.lucene:lucene-test-framework:jar:null


[INFO] ------------------------------------------------------------------------
[INFO] Trace
java.lang.RuntimeException: org.apache.maven.shared.dependency.graph.DependencyGraphBuilderException: Cannot build project dependency tree
	at org.apache.maven.plugins.enforcer.AbstractBanDependencies.getDependenciesToCheck(AbstractBanDependencies.java:143)
	at org.apache.maven.plugins.enforcer.AbstractBanDependencies.execute(AbstractBanDependencies.java:90)
	at org.apache.maven.plugins.enforcer.RequireReleaseDeps.execute(RequireReleaseDeps.java:114)
	at org.apache.maven.plugins.enforcer.EnforceMojo.execute(EnforceMojo.java:177)
	at org.apache.maven.plugin.DefaultPluginManager.executeMojo(DefaultPluginManager.java:490)
	at hudson.maven.agent.PluginManagerInterceptor.executeMojo(PluginManagerInterceptor.java:182)
	at org.apache.maven.lifecycle.DefaultLifecycleExecutor.executeGoals(DefaultLifecycleExecutor.java:694)
	at org.apache.maven.lifecycle.DefaultLifecycleExecutor.executeGoalWithLifecycle(DefaultLifecycleExecutor.java:556)
	at org.apache.maven.lifecycle.DefaultLifecycleExecutor.executeGoal(DefaultLifecycleExecutor.java:535)
	at org.apache.maven.lifecycle.DefaultLifecycleExecutor.executeGoalAndHandleFailures(DefaultLifecycleExecutor.java:387)
	at org.apache.maven.lifecycle.DefaultLifecycleExecutor.executeTaskSegments(DefaultLifecycleExecutor.java:348)
	at org.apache.maven.lifecycle.DefaultLifecycleExecutor.execute(DefaultLifecycleExecutor.java:180)
	at org.apache.maven.lifecycle.LifecycleExecutorInterceptor.execute(LifecycleExecutorInterceptor.java:65)
	at org.apache.maven.DefaultMaven.doExecute(DefaultMaven.java:328)
	at org.apache.maven.DefaultMaven.execute(DefaultMaven.java:138)
	at org.apache.maven.cli.MavenCli.main(MavenCli.java:362)
	at sun.reflect.NativeMethodAccessorImpl.invoke0(Native Method)
	at sun.reflect.NativeMethodAccessorImpl.invoke(NativeMethodAccessorImpl.java:57)
	at sun.reflect.DelegatingMethodAccessorImpl.invoke(DelegatingMethodAccessorImpl.java:43)
	at java.lang.reflect.Method.invoke(Method.java:606)
	at org.codehaus.classworlds.Launcher.launchEnhanced(Launcher.java:315)
	at org.codehaus.classworlds.Launcher.launch(Launcher.java:255)
	at hudson.maven.agent.Main.launch(Main.java:205)
	at hudson.maven.MavenBuilder.call(MavenBuilder.java:154)
	at hudson.maven.Maven2Builder.call(Maven2Builder.java:79)
	at hudson.maven.Maven2Builder.call(Maven2Builder.java:55)
	at hudson.remoting.UserRequest.perform(UserRequest.java:118)
	at hudson.remoting.UserRequest.perform(UserRequest.java:48)
	at hudson.remoting.Request$2.run(Request.java:328)
	at hudson.remoting.InterceptingExecutorService$1.call(InterceptingExecutorService.java:72)
	at java.util.concurrent.FutureTask.run(FutureTask.java:262)
	at java.util.concurrent.ThreadPoolExecutor.runWorker(ThreadPoolExecutor.java:1145)
	at java.util.concurrent.ThreadPoolExecutor$Worker.run(ThreadPoolExecutor.java:615)
	at java.lang.Thread.run(Thread.java:745)
Caused by: org.apache.maven.shared.dependency.graph.DependencyGraphBuilderException: Cannot build project dependency tree
	at org.apache.maven.shared.dependency.graph.internal.Maven2DependencyGraphBuilder.buildDependencyGraph(Maven2DependencyGraphBuilder.java:59)
	at org.apache.maven.plugins.enforcer.AbstractBanDependencies.getDependenciesToCheck(AbstractBanDependencies.java:126)
	... 33 more
Caused by: org.apache.maven.shared.dependency.tree.DependencyTreeBuilderException: Cannot build project dependency tree
	at org.apache.maven.shared.dependency.tree.DefaultDependencyTreeBuilder.buildDependencyTree(DefaultDependencyTreeBuilder.java:127)
	at org.apache.maven.shared.dependency.tree.DefaultDependencyTreeBuilder.buildDependencyTree(DefaultDependencyTreeBuilder.java:139)
	at org.apache.maven.shared.dependency.graph.internal.Maven2DependencyGraphBuilder.buildDependencyGraph(Maven2DependencyGraphBuilder.java:55)
	... 34 more
Caused by: org.apache.maven.artifact.resolver.ArtifactResolutionException: Unable to get dependency information: Unable to read the metadata file for artifact 'org.apache.lucene:lucene-test-framework:jar': Cannot find parent: org.apache.lucene:lucene-parent for project: org.apache.lucene:lucene-test-framework:jar:null for project org.apache.lucene:lucene-test-framework:jar:null
  org.apache.lucene:lucene-test-framework:jar:4.7.2

from the specified remote repositories:
  apache.snapshots (http://repository.apache.org/snapshots),
  central (http://repo1.maven.org/maven2),
  clojars.org (http://clojars.org/repo),
  cloudera (https://repository.cloudera.com/artifactory/repo)

Path to dependency: 
	1) org.apache.streams:streams-persist-elasticsearch:jar:0.1-SNAPSHOT


	at org.apache.maven.artifact.resolver.DefaultArtifactCollector.recurse(DefaultArtifactCollector.java:430)
	at org.apache.maven.artifact.resolver.DefaultArtifactCollector.collect(DefaultArtifactCollector.java:74)
	at org.apache.maven.shared.dependency.tree.DefaultDependencyTreeBuilder.buildDependencyTree(DefaultDependencyTreeBuilder.java:118)
	... 36 more
Caused by: org.apache.maven.artifact.metadata.ArtifactMetadataRetrievalException: Unable to read the metadata file for artifact 'org.apache.lucene:lucene-test-framework:jar': Cannot find parent: org.apache.lucene:lucene-parent for project: org.apache.lucene:lucene-test-framework:jar:null for project org.apache.lucene:lucene-test-framework:jar:null
	at org.apache.maven.project.artifact.MavenMetadataSource.retrieveRelocatedProject(MavenMetadataSource.java:200)
	at org.apache.maven.project.artifact.MavenMetadataSource.retrieveRelocatedArtifact(MavenMetadataSource.java:94)
	at org.apache.maven.artifact.resolver.DefaultArtifactCollector.recurse(DefaultArtifactCollector.java:387)
	... 38 more
Caused by: org.apache.maven.project.ProjectBuildingException: Cannot find parent: org.apache.lucene:lucene-parent for project: org.apache.lucene:lucene-test-framework:jar:null for project org.apache.lucene:lucene-test-framework:jar:null
	at org.apache.maven.project.DefaultMavenProjectBuilder.assembleLineage(DefaultMavenProjectBuilder.java:1396)
	at org.apache.maven.project.DefaultMavenProjectBuilder.buildInternal(DefaultMavenProjectBuilder.java:823)
	at org.apache.maven.project.DefaultMavenProjectBuilder.buildFromRepository(DefaultMavenProjectBuilder.java:255)
	at org.apache.maven.project.artifact.MavenMetadataSource.retrieveRelocatedProject(MavenMetadataSource.java:163)
	... 40 more
Caused by: org.apache.maven.project.InvalidProjectModelException: Not a v4.0.0 POM. for project org.apache.lucene:lucene-parent at /home/jenkins/jenkins-slave/maven-repositories/2/org/apache/lucene/lucene-parent/4.7.2/lucene-parent-4.7.2.pom
	at org.apache.maven.project.DefaultMavenProjectBuilder.readModel(DefaultMavenProjectBuilder.java:1599)
	at org.apache.maven.project.DefaultMavenProjectBuilder.readModel(DefaultMavenProjectBuilder.java:1571)
	at org.apache.maven.project.DefaultMavenProjectBuilder.findModelFromRepository(DefaultMavenProjectBuilder.java:562)
	at org.apache.maven.project.DefaultMavenProjectBuilder.assembleLineage(DefaultMavenProjectBuilder.java:1392)
	... 43 more
[INFO] ------------------------------------------------------------------------
[INFO] Total time: 2 minutes 8 seconds
[INFO] Finished at: Wed Oct 22 16:23:46 UTC 2014
[INFO] Final Memory: 389M/2096M
[INFO] ------------------------------------------------------------------------
[JENKINS] Archiving <https://builds.apache.org/job/Streams%20Trunk/ws/streams-core/pom.xml> to org.apache.streams/streams-core/0.1-SNAPSHOT/streams-core-0.1-SNAPSHOT.pom
[JENKINS] Archiving <https://builds.apache.org/job/Streams%20Trunk/ws/streams-core/target/streams-core-0.1-SNAPSHOT.jar> to org.apache.streams/streams-core/0.1-SNAPSHOT/streams-core-0.1-SNAPSHOT.jar
Sending artifact delta relative to Streams Trunk » streams-core #81
Archived 2 artifacts
Archive block size is 32768
Received 0 blocks and 22887 bytes
Compression is 0.0%
Took 0.15 sec
[JENKINS] Archiving <https://builds.apache.org/job/Streams%20Trunk/ws/streams-contrib/streams-persist-cassandra/pom.xml> to org.apache.streams/streams-persist-cassandra/0.1-SNAPSHOT/streams-persist-cassandra-0.1-SNAPSHOT.pom
[JENKINS] Archiving <https://builds.apache.org/job/Streams%20Trunk/ws/streams-contrib/streams-persist-cassandra/target/streams-persist-cassandra-0.1-SNAPSHOT.jar> to org.apache.streams/streams-persist-cassandra/0.1-SNAPSHOT/streams-persist-cassandra-0.1-SNAPSHOT.jar
Sending artifact delta relative to Streams Trunk » streams-persist-cassandra [org.apache.streams] #81
Archived 2 artifacts
Archive block size is 32768
Received 0 blocks and 28599 bytes
Compression is 0.0%
Took 89 ms
[JENKINS] Archiving /home/jenkins/jenkins-slave/maven-repositories/2/org/apache/streams/osgi/components/streams-osgi-components/0.1-SNAPSHOT/streams-osgi-components-0.1-SNAPSHOT.pom to org.apache.streams.osgi.components/streams-osgi-components/0.1-SNAPSHOT/streams-osgi-components-0.1-SNAPSHOT.pom
/home/jenkins/jenkins-slave/maven-repositories/2/org/apache/streams/osgi/components/streams-osgi-components/0.1-SNAPSHOT/streams-osgi-components-0.1-SNAPSHOT.pom is not inside <https://builds.apache.org/job/Streams%20Trunk/ws/streams-osgi-components/;> will archive in a separate pass
Sending artifact delta relative to Streams Trunk » Apache Streams OSGI Components #81
Archived 1 artifacts
Archive block size is 32768
Received 0 blocks and 1722 bytes
Compression is 0.0%
Took 75 ms
[JENKINS] Archiving <https://builds.apache.org/job/Streams%20Trunk/ws/streams-config/pom.xml> to org.apache.streams/streams-config/0.1-SNAPSHOT/streams-config-0.1-SNAPSHOT.pom
[JENKINS] Archiving <https://builds.apache.org/job/Streams%20Trunk/ws/streams-config/target/streams-config-0.1-SNAPSHOT.jar> to org.apache.streams/streams-config/0.1-SNAPSHOT/streams-config-0.1-SNAPSHOT.jar
Sending artifact delta relative to Streams Trunk » streams-config #81
Archived 2 artifacts
Archive block size is 32768
Received 0 blocks and 15760 bytes
Compression is 0.0%
Took 86 ms
[JENKINS] Archiving /home/jenkins/jenkins-slave/maven-repositories/2/org/apache/streams/streams-runtimes/0.1-SNAPSHOT/streams-runtimes-0.1-SNAPSHOT.pom to org.apache.streams/streams-runtimes/0.1-SNAPSHOT/streams-runtimes-0.1-SNAPSHOT.pom
/home/jenkins/jenkins-slave/maven-repositories/2/org/apache/streams/streams-runtimes/0.1-SNAPSHOT/streams-runtimes-0.1-SNAPSHOT.pom is not inside <https://builds.apache.org/job/Streams%20Trunk/ws/streams-runtimes/;> will archive in a separate pass
Sending artifact delta relative to Streams Trunk » streams-runtimes #81
Archived 1 artifacts
Archive block size is 32768
Received 0 blocks and 1631 bytes
Compression is 0.0%
Took 0.23 sec
[JENKINS] Archiving <https://builds.apache.org/job/Streams%20Trunk/ws/streams-osgi-components/activity-registration/pom.xml> to org.apache.streams.osgi.components/activity-registration/0.1-SNAPSHOT/activity-registration-0.1-SNAPSHOT.pom
[JENKINS] Archiving <https://builds.apache.org/job/Streams%20Trunk/ws/streams-osgi-components/activity-registration/target/activity-registration-0.1-SNAPSHOT.jar> to org.apache.streams.osgi.components/activity-registration/0.1-SNAPSHOT/activity-registration-0.1-SNAPSHOT.jar
Sending artifact delta relative to Streams Trunk » activity-registration-bundle [org.apache.streams.osgi.components] #81
Archived 2 artifacts
Archive block size is 32768
Received 0 blocks and 23016 bytes
Compression is 0.0%
Took 0.12 sec
[JENKINS] Archiving <https://builds.apache.org/job/Streams%20Trunk/ws/streams-util/pom.xml> to org.apache.streams/streams-util/0.1-SNAPSHOT/streams-util-0.1-SNAPSHOT.pom
[JENKINS] Archiving <https://builds.apache.org/job/Streams%20Trunk/ws/streams-util/target/streams-util-0.1-SNAPSHOT.jar> to org.apache.streams/streams-util/0.1-SNAPSHOT/streams-util-0.1-SNAPSHOT.jar
Sending artifact delta relative to Streams Trunk » streams-util #81
Archived 2 artifacts
Archive block size is 32768
Received 0 blocks and 28271 bytes
Compression is 0.0%
Took 0.16 sec
[JENKINS] Archiving <https://builds.apache.org/job/Streams%20Trunk/ws/streams-contrib/streams-persist-elasticsearch/pom.xml> to org.apache.streams/streams-persist-elasticsearch/0.1-SNAPSHOT/streams-persist-elasticsearch-0.1-SNAPSHOT.pom
Sending artifact delta relative to Streams Trunk » streams-persist-elasticsearch #80
Archived 1 artifacts
Archive block size is 32768
Received 0 blocks and 6300 bytes
Compression is 0.0%
Took 1.6 sec
[JENKINS] Archiving /home/jenkins/jenkins-slave/maven-repositories/2/org/apache/streams/build/wrapper-bundle-settings/0.1-SNAPSHOT/wrapper-bundle-settings-0.1-SNAPSHOT.pom to org.apache.streams.build/wrapper-bundle-settings/0.1-SNAPSHOT/wrapper-bundle-settings-0.1-SNAPSHOT.pom
/home/jenkins/jenkins-slave/maven-repositories/2/org/apache/streams/build/wrapper-bundle-settings/0.1-SNAPSHOT/wrapper-bundle-settings-0.1-SNAPSHOT.pom is not inside <https://builds.apache.org/job/Streams%20Trunk/ws/poms/wrappers/;> will archive in a separate pass
Sending artifact delta relative to Streams Trunk » apache-streams - wrapper instructions #81
Archived 1 artifacts
Archive block size is 32768
Received 0 blocks and 2650 bytes
Compression is 0.0%
Took 0.14 sec
[JENKINS] Archiving <https://builds.apache.org/job/Streams%20Trunk/ws/streams-osgi-components/activity-subscriber/pom.xml> to org.apache.streams.osgi.components/activity-subscriber/0.1-SNAPSHOT/activity-subscriber-0.1-SNAPSHOT.pom
[JENKINS] Archiving <https://builds.apache.org/job/Streams%20Trunk/ws/streams-osgi-components/activity-subscriber/target/activity-subscriber-0.1-SNAPSHOT.jar> to org.apache.streams.osgi.components/activity-subscriber/0.1-SNAPSHOT/activity-subscriber-0.1-SNAPSHOT.jar
Sending artifact delta relative to Streams Trunk » activity-subscriber-bundle [org.apache.streams.osgi.components.activitysubscriber] #81
Archived 2 artifacts
Archive block size is 32768
Received 0 blocks and 25476 bytes
Compression is 0.0%
Took 0.16 sec
[JENKINS] Archiving /home/jenkins/jenkins-slave/maven-repositories/2/org/apache/streams/build/provision/0.1-SNAPSHOT/provision-0.1-SNAPSHOT.pom to org.apache.streams.build/provision/0.1-SNAPSHOT/provision-0.1-SNAPSHOT.pom
/home/jenkins/jenkins-slave/maven-repositories/2/org/apache/streams/build/provision/0.1-SNAPSHOT/provision-0.1-SNAPSHOT.pom is not inside <https://builds.apache.org/job/Streams%20Trunk/ws/provision/;> will archive in a separate pass
Sending artifact delta relative to Streams Trunk » apache-streams - imported bundles #81
Archived 1 artifacts
Archive block size is 32768
Received 0 blocks and 1637 bytes
Compression is 0.0%
Took 89 ms
[JENKINS] Archiving <https://builds.apache.org/job/Streams%20Trunk/ws/streams-pojo/pom.xml> to org.apache.streams/streams-pojo/0.1-SNAPSHOT/streams-pojo-0.1-SNAPSHOT.pom
[JENKINS] Archiving <https://builds.apache.org/job/Streams%20Trunk/ws/streams-pojo/target/streams-pojo-0.1-SNAPSHOT.jar> to org.apache.streams/streams-pojo/0.1-SNAPSHOT/streams-pojo-0.1-SNAPSHOT.jar
Sending artifact delta relative to Streams Trunk » streams-pojo #81
Archived 2 artifacts
Archive block size is 32768
Received 0 blocks and 110865 bytes
Compression is 0.0%
Took 1.6 sec
[JENKINS] Archiving /home/jenkins/jenkins-slave/maven-repositories/2/org/apache/streams/build/shared-plugin-settings/0.1-SNAPSHOT/shared-plugin-settings-0.1-SNAPSHOT.pom to org.apache.streams.build/shared-plugin-settings/0.1-SNAPSHOT/shared-plugin-settings-0.1-SNAPSHOT.pom
/home/jenkins/jenkins-slave/maven-repositories/2/org/apache/streams/build/shared-plugin-settings/0.1-SNAPSHOT/shared-plugin-settings-0.1-SNAPSHOT.pom is not inside <https://builds.apache.org/job/Streams%20Trunk/ws/poms/;> will archive in a separate pass
Sending artifact delta relative to Streams Trunk » apache-streams - plugin configuration #81
Archived 1 artifacts
Archive block size is 32768
Received 0 blocks and 3177 bytes
Compression is 0.0%
Took 0.23 sec
[JENKINS] Archiving /home/jenkins/jenkins-slave/maven-repositories/2/org/apache/streams/build/compiled-bundle-settings/0.1-SNAPSHOT/compiled-bundle-settings-0.1-SNAPSHOT.pom to org.apache.streams.build/compiled-bundle-settings/0.1-SNAPSHOT/compiled-bundle-settings-0.1-SNAPSHOT.pom
/home/jenkins/jenkins-slave/maven-repositories/2/org/apache/streams/build/compiled-bundle-settings/0.1-SNAPSHOT/compiled-bundle-settings-0.1-SNAPSHOT.pom is not inside <https://builds.apache.org/job/Streams%20Trunk/ws/poms/compiled/;> will archive in a separate pass
Sending artifact delta relative to Streams Trunk » apache-streams - bundle instructions #81
Archived 1 artifacts
Archive block size is 32768
Received 0 blocks and 3004 bytes
Compression is 0.0%
Took 0.13 sec
[JENKINS] Archiving /home/jenkins/jenkins-slave/maven-repositories/2/org/apache/streams/streams-contrib/0.1-SNAPSHOT/streams-contrib-0.1-SNAPSHOT.pom to org.apache.streams/streams-contrib/0.1-SNAPSHOT/streams-contrib-0.1-SNAPSHOT.pom
/home/jenkins/jenkins-slave/maven-repositories/2/org/apache/streams/streams-contrib/0.1-SNAPSHOT/streams-contrib-0.1-SNAPSHOT.pom is not inside <https://builds.apache.org/job/Streams%20Trunk/ws/streams-contrib/;> will archive in a separate pass
Sending artifact delta relative to Streams Trunk » streams-contrib #81
Archived 1 artifacts
Archive block size is 32768
Received 0 blocks and 3390 bytes
Compression is 0.0%
Took 0.1 sec
[JENKINS] Archiving /home/jenkins/jenkins-slave/maven-repositories/2/org/apache/streams/streams-project/0.1-SNAPSHOT/streams-project-0.1-SNAPSHOT.pom to org.apache.streams/streams-project/0.1-SNAPSHOT/streams-project-0.1-SNAPSHOT.pom
/home/jenkins/jenkins-slave/maven-repositories/2/org/apache/streams/streams-project/0.1-SNAPSHOT/streams-project-0.1-SNAPSHOT.pom is not inside <https://builds.apache.org/job/Streams%20Trunk/ws/;> will archive in a separate pass
Sending artifact delta relative to Streams Trunk » Apache Streams Project #81
Archived 1 artifacts
Archive block size is 32768
Received 0 blocks and 15462 bytes
Compression is 0.0%
Took 83 ms
[JENKINS] Archiving <https://builds.apache.org/job/Streams%20Trunk/ws/streams-osgi-components/streams-components-all/target/dependency-reduced-pom.xml> to org.apache.streams.osgi.components/streams-components-all/0.1-SNAPSHOT/streams-components-all-0.1-SNAPSHOT.pom
[JENKINS] Archiving <https://builds.apache.org/job/Streams%20Trunk/ws/streams-osgi-components/streams-components-all/target/streams-components-all-0.1-SNAPSHOT.jar> to org.apache.streams.osgi.components/streams-components-all/0.1-SNAPSHOT/streams-components-all-0.1-SNAPSHOT.jar
Sending artifact delta relative to Streams Trunk » Apache Streams Components All #81
Archived 2 artifacts
Archive block size is 32768
Received 130 blocks and 57567999 bytes
Compression is 6.9%
Took 30 sec
[JENKINS] Archiving <https://builds.apache.org/job/Streams%20Trunk/ws/streams-contrib/streams-persist-console/pom.xml> to org.apache.streams/streams-persist-console/0.1-SNAPSHOT/streams-persist-console-0.1-SNAPSHOT.pom
[JENKINS] Archiving <https://builds.apache.org/job/Streams%20Trunk/ws/streams-contrib/streams-persist-console/target/streams-persist-console-0.1-SNAPSHOT.jar> to org.apache.streams/streams-persist-console/0.1-SNAPSHOT/streams-persist-console-0.1-SNAPSHOT.jar
Sending artifact delta relative to Streams Trunk » streams-persist-console #81
Archived 2 artifacts
Archive block size is 32768
Received 0 blocks and 14229 bytes
Compression is 0.0%
Took 0.15 sec
[JENKINS] Archiving <https://builds.apache.org/job/Streams%20Trunk/ws/streams-osgi-components/activity-consumer/pom.xml> to org.apache.streams.osgi.components/activity-consumer/0.1-SNAPSHOT/activity-consumer-0.1-SNAPSHOT.pom
[JENKINS] Archiving <https://builds.apache.org/job/Streams%20Trunk/ws/streams-osgi-components/activity-consumer/target/activity-consumer-0.1-SNAPSHOT.jar> to org.apache.streams.osgi.components/activity-consumer/0.1-SNAPSHOT/activity-consumer-0.1-SNAPSHOT.jar
Sending artifact delta relative to Streams Trunk » activity-consumer-bundle [org.apache.streams.osgi.components.activityconsumer] #81
Archived 2 artifacts
Archive block size is 32768
Received 0 blocks and 25028 bytes
Compression is 0.0%
Took 1.6 sec
[JENKINS] Archiving <https://builds.apache.org/job/Streams%20Trunk/ws/streams-runtimes/streams-runtime-webapp/pom.xml> to org.apache.streams/streams-runtime-webapp/0.1-SNAPSHOT/streams-runtime-webapp-0.1-SNAPSHOT.pom
[JENKINS] Archiving <https://builds.apache.org/job/Streams%20Trunk/ws/streams-runtimes/streams-runtime-webapp/target/streams-runtime-webapp-0.1-SNAPSHOT.jar> to org.apache.streams/streams-runtime-webapp/0.1-SNAPSHOT/streams-runtime-webapp-0.1-SNAPSHOT.jar
Sending artifact delta relative to Streams Trunk » streams-eip-routes [org.apache.streams] #81
Archived 2 artifacts
Archive block size is 32768
Received 14 blocks and 801725 bytes
Compression is 36.4%
Took 0.37 sec
channel stopped

Jenkins build is back to normal : Streams Trunk #101

Posted by Apache Jenkins Server <je...@builds.apache.org>.
See <https://builds.apache.org/job/Streams%20Trunk/101/changes>


Build failed in Jenkins: Streams Trunk #100

Posted by Apache Jenkins Server <je...@builds.apache.org>.
See <https://builds.apache.org/job/Streams%20Trunk/100/changes>

Changes:

[rdouglas] STREAMS-229 | Updated the GPlusTypeConverter to handle serialized versions of Google's Activity and Person objects, in addition to those objects themselves

------------------------------------------
[...truncated 2074 lines...]
urls[2] = file:/jenkins/maven-repositories/0/commons-lang/commons-lang/2.3/commons-lang-2.3.jar
urls[3] = file:/jenkins/maven-repositories/0/org/apache/maven/enforcer/enforcer-api/1.3.1/enforcer-api-1.3.1.jar
urls[4] = file:/jenkins/maven-repositories/0/org/apache/maven/enforcer/enforcer-rules/1.3.1/enforcer-rules-1.3.1.jar
urls[5] = file:/jenkins/maven-repositories/0/org/apache/maven/shared/maven-common-artifact-filters/1.4/maven-common-artifact-filters-1.4.jar
urls[6] = file:/jenkins/maven-repositories/0/org/beanshell/bsh/2.0b4/bsh-2.0b4.jar
urls[7] = file:/jenkins/maven-repositories/0/org/apache/maven/shared/maven-dependency-tree/2.1/maven-dependency-tree-2.1.jar
urls[8] = file:/jenkins/maven-repositories/0/org/codehaus/plexus/plexus-component-annotations/1.5.5/plexus-component-annotations-1.5.5.jar
urls[9] = file:/jenkins/maven-repositories/0/org/eclipse/aether/aether-util/0.9.0.M2/aether-util-0.9.0.M2.jar
urls[10] = file:/jenkins/maven-repositories/0/org/codehaus/plexus/plexus-i18n/1.0-beta-6/plexus-i18n-1.0-beta-6.jar
Number of imports: 10
import: org.codehaus.classworlds.Entry@a6c57a42
import: org.codehaus.classworlds.Entry@12f43f3b
import: org.codehaus.classworlds.Entry@20025374
import: org.codehaus.classworlds.Entry@f8e44ca4
import: org.codehaus.classworlds.Entry@92758522
import: org.codehaus.classworlds.Entry@ebf2705b
import: org.codehaus.classworlds.Entry@bb25e54
import: org.codehaus.classworlds.Entry@bece5185
import: org.codehaus.classworlds.Entry@3fee8e37
import: org.codehaus.classworlds.Entry@3fee19d8


this realm = plexus.core.maven
Number of imports: 10
import: org.codehaus.classworlds.Entry@a6c57a42
import: org.codehaus.classworlds.Entry@12f43f3b
import: org.codehaus.classworlds.Entry@20025374
import: org.codehaus.classworlds.Entry@f8e44ca4
import: org.codehaus.classworlds.Entry@92758522
import: org.codehaus.classworlds.Entry@ebf2705b
import: org.codehaus.classworlds.Entry@bb25e54
import: org.codehaus.classworlds.Entry@bece5185
import: org.codehaus.classworlds.Entry@3fee8e37
import: org.codehaus.classworlds.Entry@3fee19d8


this realm = plexus.core
urls[0] = file:/jenkins/maven2.1-interceptor.jar
urls[1] = file:/jenkins/maven-interceptor.jar
urls[2] = file:/home/jenkins/tools/maven/apache-maven-2.2.1/lib/maven-2.2.1-uber.jar
Number of imports: 10
import: org.codehaus.classworlds.Entry@a6c57a42
import: org.codehaus.classworlds.Entry@12f43f3b
import: org.codehaus.classworlds.Entry@20025374
import: org.codehaus.classworlds.Entry@f8e44ca4
import: org.codehaus.classworlds.Entry@92758522
import: org.codehaus.classworlds.Entry@ebf2705b
import: org.codehaus.classworlds.Entry@bb25e54
import: org.codehaus.classworlds.Entry@bece5185
import: org.codehaus.classworlds.Entry@3fee8e37
import: org.codehaus.classworlds.Entry@3fee19d8
-----------------------------------------------------
[WARNING] The parameter expression: 'project.build.resources' used in mojo: 'process' has been deprecated. Use 'project.resources' instead.
[INFO] [remote-resources:process {execution: default}]
[INFO] [site:attach-descriptor {execution: default-attach-descriptor}]
[INFO] [install:install {execution: default-install}]
[INFO] Installing <https://builds.apache.org/job/Streams%20Trunk/ws/streams-osgi-components/pom.xml> to /jenkins/maven-repositories/0/org/apache/streams/osgi/components/streams-osgi-components/0.1-SNAPSHOT/streams-osgi-components-0.1-SNAPSHOT.pom
[INFO] ------------------------------------------------------------------------
[INFO] Building activity-subscriber-bundle [org.apache.streams.osgi.components.activitysubscriber]
[INFO]    task-segment: [clean, install]
[INFO] ------------------------------------------------------------------------
[INFO] [clean:clean {execution: default-clean}]
Downloading: http://repo1.maven.org/maven2/org/apache/maven/plugins/maven-resources-plugin/2.5/maven-resources-plugin-2.5.pom
6K downloaded  (maven-resources-plugin-2.5.pom)
Downloading: http://repo1.maven.org/maven2/org/apache/maven/plugins/maven-plugins/19/maven-plugins-19.pom
10K downloaded  (maven-plugins-19.pom)
Downloading: http://repo1.maven.org/maven2/org/apache/maven/plugins/maven-resources-plugin/2.5/maven-resources-plugin-2.5.jar
25K downloaded  (maven-resources-plugin-2.5.jar)
Downloading: http://repo1.maven.org/maven2/org/apache/maven/plugins/maven-surefire-plugin/2.17/maven-surefire-plugin-2.17.pom
4K downloaded  (maven-surefire-plugin-2.17.pom)
Downloading: http://repo1.maven.org/maven2/org/apache/maven/surefire/surefire/2.17/surefire-2.17.pom
16K downloaded  (surefire-2.17.pom)
Downloading: http://repo1.maven.org/maven2/org/apache/maven/plugins/maven-surefire-plugin/2.17/maven-surefire-plugin-2.17.jar
33K downloaded  (maven-surefire-plugin-2.17.jar)
[INFO] [enforcer:enforce {execution: enforce-java}]
[INFO] [enforcer:enforce {execution: enforce-no-snapshots}]
-----------------------------------------------------
this realm = app0.child-container[org.apache.maven.plugins:maven-enforcer-plugin:1.3.1]
urls[0] = file:/jenkins/maven-repositories/0/org/apache/maven/plugins/maven-enforcer-plugin/1.3.1/maven-enforcer-plugin-1.3.1.jar
urls[1] = file:/jenkins/maven-repositories/0/org/codehaus/plexus/plexus-utils/1.5.8/plexus-utils-1.5.8.jar
urls[2] = file:/jenkins/maven-repositories/0/commons-lang/commons-lang/2.3/commons-lang-2.3.jar
urls[3] = file:/jenkins/maven-repositories/0/org/apache/maven/enforcer/enforcer-api/1.3.1/enforcer-api-1.3.1.jar
urls[4] = file:/jenkins/maven-repositories/0/org/apache/maven/enforcer/enforcer-rules/1.3.1/enforcer-rules-1.3.1.jar
urls[5] = file:/jenkins/maven-repositories/0/org/apache/maven/shared/maven-common-artifact-filters/1.4/maven-common-artifact-filters-1.4.jar
urls[6] = file:/jenkins/maven-repositories/0/org/beanshell/bsh/2.0b4/bsh-2.0b4.jar
urls[7] = file:/jenkins/maven-repositories/0/org/apache/maven/shared/maven-dependency-tree/2.1/maven-dependency-tree-2.1.jar
urls[8] = file:/jenkins/maven-repositories/0/org/codehaus/plexus/plexus-component-annotations/1.5.5/plexus-component-annotations-1.5.5.jar
urls[9] = file:/jenkins/maven-repositories/0/org/eclipse/aether/aether-util/0.9.0.M2/aether-util-0.9.0.M2.jar
urls[10] = file:/jenkins/maven-repositories/0/org/codehaus/plexus/plexus-i18n/1.0-beta-6/plexus-i18n-1.0-beta-6.jar
Number of imports: 10
import: org.codehaus.classworlds.Entry@a6c57a42
import: org.codehaus.classworlds.Entry@12f43f3b
import: org.codehaus.classworlds.Entry@20025374
import: org.codehaus.classworlds.Entry@f8e44ca4
import: org.codehaus.classworlds.Entry@92758522
import: org.codehaus.classworlds.Entry@ebf2705b
import: org.codehaus.classworlds.Entry@bb25e54
import: org.codehaus.classworlds.Entry@bece5185
import: org.codehaus.classworlds.Entry@3fee8e37
import: org.codehaus.classworlds.Entry@3fee19d8


this realm = plexus.core.maven
Number of imports: 10
import: org.codehaus.classworlds.Entry@a6c57a42
import: org.codehaus.classworlds.Entry@12f43f3b
import: org.codehaus.classworlds.Entry@20025374
import: org.codehaus.classworlds.Entry@f8e44ca4
import: org.codehaus.classworlds.Entry@92758522
import: org.codehaus.classworlds.Entry@ebf2705b
import: org.codehaus.classworlds.Entry@bb25e54
import: org.codehaus.classworlds.Entry@bece5185
import: org.codehaus.classworlds.Entry@3fee8e37
import: org.codehaus.classworlds.Entry@3fee19d8


this realm = plexus.core
urls[0] = file:/jenkins/maven2.1-interceptor.jar
urls[1] = file:/jenkins/maven-interceptor.jar
urls[2] = file:/home/jenkins/tools/maven/apache-maven-2.2.1/lib/maven-2.2.1-uber.jar
Number of imports: 10
import: org.codehaus.classworlds.Entry@a6c57a42
import: org.codehaus.classworlds.Entry@12f43f3b
import: org.codehaus.classworlds.Entry@20025374
import: org.codehaus.classworlds.Entry@f8e44ca4
import: org.codehaus.classworlds.Entry@92758522
import: org.codehaus.classworlds.Entry@ebf2705b
import: org.codehaus.classworlds.Entry@bb25e54
import: org.codehaus.classworlds.Entry@bece5185
import: org.codehaus.classworlds.Entry@3fee8e37
import: org.codehaus.classworlds.Entry@3fee19d8
-----------------------------------------------------
Downloading: http://repo1.maven.org/maven2/org/osgi/osgi_R4_core/1.0/osgi_R4_core-1.0.pom
285b downloaded  (osgi_R4_core-1.0.pom)
Downloading: http://repo1.maven.org/maven2/org/codehaus/jackson/jackson-mrbean/1.9.11/jackson-mrbean-1.9.11.pom
1K downloaded  (jackson-mrbean-1.9.11.pom)
Downloading: http://clojars.org/repo/org/codehaus/jackson/jackson-mapper-asl/1.9.11/jackson-mapper-asl-1.9.11.pom
[INFO] Unable to find resource 'org.codehaus.jackson:jackson-mapper-asl:pom:1.9.11' in repository clojars.org (http://clojars.org/repo)
Downloading: https://repository.cloudera.com/artifactory/repo/org/codehaus/jackson/jackson-mapper-asl/1.9.11/jackson-mapper-asl-1.9.11.pom
1K downloaded  (jackson-mapper-asl-1.9.11.pom)
Downloading: http://clojars.org/repo/org/codehaus/jackson/jackson-core-asl/1.9.11/jackson-core-asl-1.9.11.pom
[INFO] Unable to find resource 'org.codehaus.jackson:jackson-core-asl:pom:1.9.11' in repository clojars.org (http://clojars.org/repo)
Downloading: https://repository.cloudera.com/artifactory/repo/org/codehaus/jackson/jackson-core-asl/1.9.11/jackson-core-asl-1.9.11.pom
1017b downloaded  (jackson-core-asl-1.9.11.pom)
Downloading: http://repo1.maven.org/maven2/org/osgi/osgi_R4_compendium/1.0/osgi_R4_compendium-1.0.pom
303b downloaded  (osgi_R4_compendium-1.0.pom)
Downloading: http://repo1.maven.org/maven2/commons-logging/commons-logging-api/1.1/commons-logging-api-1.1.pom
5K downloaded  (commons-logging-api-1.1.pom)
[WARNING] The parameter expression: 'project.build.resources' used in mojo: 'process' has been deprecated. Use 'project.resources' instead.
[INFO] [remote-resources:process {execution: default}]
Downloading: http://repo1.maven.org/maven2/commons-logging/commons-logging-api/1.1/commons-logging-api-1.1.jar
Downloading: http://repo1.maven.org/maven2/org/codehaus/jackson/jackson-mrbean/1.9.11/jackson-mrbean-1.9.11.jar
Downloading: http://repo1.maven.org/maven2/org/osgi/osgi_R4_core/1.0/osgi_R4_core-1.0.jar
43K downloaded  (commons-logging-api-1.1.jar)
434K downloaded  (osgi_R4_core-1.0.jar)
Downloading: http://repo1.maven.org/maven2/org/osgi/osgi_R4_compendium/1.0/osgi_R4_compendium-1.0.jar
657K downloaded  (osgi_R4_compendium-1.0.jar)
65K downloaded  (jackson-mrbean-1.9.11.jar)
Downloading: http://repo1.maven.org/maven2/org/codehaus/jackson/jackson-mapper-asl/1.9.11/jackson-mapper-asl-1.9.11.jar
762K downloaded  (jackson-mapper-asl-1.9.11.jar)
Downloading: http://clojars.org/repo/org/codehaus/jackson/jackson-core-asl/1.9.11/jackson-core-asl-1.9.11.jar
[INFO] Unable to find resource 'org.codehaus.jackson:jackson-core-asl:jar:1.9.11' in repository clojars.org (http://clojars.org/repo)
Downloading: https://repository.cloudera.com/artifactory/repo/org/codehaus/jackson/jackson-core-asl/1.9.11/jackson-core-asl-1.9.11.jar
226K downloaded  (jackson-core-asl-1.9.11.jar)
Downloading: http://repo1.maven.org/maven2/org/codehaus/plexus/plexus-interpolation/1.13/plexus-interpolation-1.13.jar
59K downloaded  (plexus-interpolation-1.13.jar)
[debug] execute contextualize
[INFO] [resources:resources {execution: default-resources}]
[INFO] Using 'UTF-8' encoding to copy filtered resources.
[INFO] Copying 7 resources
[INFO] Copying 0 resource
[INFO] Copying 7 resources
[INFO] [pax:compile {execution: default-compile}]
[INFO] Compiling 10 source files to <https://builds.apache.org/job/Streams%20Trunk/ws/streams-osgi-components/activity-subscriber/target/classes>
[INFO] [recovering meta-data]
[INFO] ------------------------------------------------------------------------
[ERROR] BUILD FAILURE
[INFO] ------------------------------------------------------------------------
[INFO] Compilation failure
Unable to locate the Javac Compiler in:
  /usr/lib/jvm/java-7-openjdk-amd64/jre/../lib/tools.jar
Please ensure you are using JDK 1.4 or above and
not a JRE (the com.sun.tools.javac.Main class is required).
In most cases you can change the location of your Java
installation by setting the JAVA_HOME environment variable.

[INFO] ------------------------------------------------------------------------
[INFO] For more information, run Maven with the -e switch
[INFO] ------------------------------------------------------------------------
[INFO] Total time: 2 minutes 29 seconds
[INFO] Finished at: Thu Nov 20 22:42:22 UTC 2014
[INFO] Final Memory: 70M/692M
[INFO] ------------------------------------------------------------------------
[JENKINS] Archiving /jenkins/maven-repositories/0/org/apache/streams/build/wrapper-bundle-settings/0.1-SNAPSHOT/wrapper-bundle-settings-0.1-SNAPSHOT.pom to org.apache.streams.build/wrapper-bundle-settings/0.1-SNAPSHOT/wrapper-bundle-settings-0.1-SNAPSHOT.pom
/jenkins/maven-repositories/0/org/apache/streams/build/wrapper-bundle-settings/0.1-SNAPSHOT/wrapper-bundle-settings-0.1-SNAPSHOT.pom is not inside <https://builds.apache.org/job/Streams%20Trunk/ws/poms/wrappers/;> will archive in a separate pass
Sending artifact delta relative to Streams Trunk » apache-streams - wrapper instructions #99
Archived 1 artifacts
Archive block size is 32768
Received 0 blocks and 2650 bytes
Compression is 0.0%
Took 12 sec
[JENKINS] Archiving <https://builds.apache.org/job/Streams%20Trunk/ws/streams-osgi-components/activity-subscriber/pom.xml> to org.apache.streams.osgi.components/activity-subscriber/0.1-SNAPSHOT/activity-subscriber-0.1-SNAPSHOT.pom
Sending artifact delta relative to Streams Trunk » activity-subscriber-bundle [org.apache.streams.osgi.components.activitysubscriber] #99
Archived 1 artifacts
Archive block size is 32768
Received 0 blocks and 5329 bytes
Compression is 0.0%
Took 0.25 sec
[JENKINS] Archiving /jenkins/maven-repositories/0/org/apache/streams/build/provision/0.1-SNAPSHOT/provision-0.1-SNAPSHOT.pom to org.apache.streams.build/provision/0.1-SNAPSHOT/provision-0.1-SNAPSHOT.pom
/jenkins/maven-repositories/0/org/apache/streams/build/provision/0.1-SNAPSHOT/provision-0.1-SNAPSHOT.pom is not inside <https://builds.apache.org/job/Streams%20Trunk/ws/provision/;> will archive in a separate pass
Sending artifact delta relative to Streams Trunk » apache-streams - imported bundles #99
Archived 1 artifacts
Archive block size is 32768
Received 0 blocks and 1637 bytes
Compression is 0.0%
Took 0.27 sec
[JENKINS] Archiving /jenkins/maven-repositories/0/org/apache/streams/build/shared-plugin-settings/0.1-SNAPSHOT/shared-plugin-settings-0.1-SNAPSHOT.pom to org.apache.streams.build/shared-plugin-settings/0.1-SNAPSHOT/shared-plugin-settings-0.1-SNAPSHOT.pom
/jenkins/maven-repositories/0/org/apache/streams/build/shared-plugin-settings/0.1-SNAPSHOT/shared-plugin-settings-0.1-SNAPSHOT.pom is not inside <https://builds.apache.org/job/Streams%20Trunk/ws/poms/;> will archive in a separate pass
Sending artifact delta relative to Streams Trunk » apache-streams - plugin configuration #99
Archived 1 artifacts
Archive block size is 32768
Received 0 blocks and 3177 bytes
Compression is 0.0%
Took 0.26 sec
[JENKINS] Archiving /jenkins/maven-repositories/0/org/apache/streams/osgi/components/streams-osgi-components/0.1-SNAPSHOT/streams-osgi-components-0.1-SNAPSHOT.pom to org.apache.streams.osgi.components/streams-osgi-components/0.1-SNAPSHOT/streams-osgi-components-0.1-SNAPSHOT.pom
/jenkins/maven-repositories/0/org/apache/streams/osgi/components/streams-osgi-components/0.1-SNAPSHOT/streams-osgi-components-0.1-SNAPSHOT.pom is not inside <https://builds.apache.org/job/Streams%20Trunk/ws/streams-osgi-components/;> will archive in a separate pass
Sending artifact delta relative to Streams Trunk » Apache Streams OSGI Components #99
Archived 1 artifacts
Archive block size is 32768
Received 0 blocks and 1722 bytes
Compression is 0.0%
Took 0.28 sec
[JENKINS] Archiving /jenkins/maven-repositories/0/org/apache/streams/build/compiled-bundle-settings/0.1-SNAPSHOT/compiled-bundle-settings-0.1-SNAPSHOT.pom to org.apache.streams.build/compiled-bundle-settings/0.1-SNAPSHOT/compiled-bundle-settings-0.1-SNAPSHOT.pom
/jenkins/maven-repositories/0/org/apache/streams/build/compiled-bundle-settings/0.1-SNAPSHOT/compiled-bundle-settings-0.1-SNAPSHOT.pom is not inside <https://builds.apache.org/job/Streams%20Trunk/ws/poms/compiled/;> will archive in a separate pass
Sending artifact delta relative to Streams Trunk » apache-streams - bundle instructions #99
Archived 1 artifacts
Archive block size is 32768
Received 0 blocks and 3004 bytes
Compression is 0.0%
Took 0.25 sec
[JENKINS] Archiving /jenkins/maven-repositories/0/org/apache/streams/streams-project/0.1-SNAPSHOT/streams-project-0.1-SNAPSHOT.pom to org.apache.streams/streams-project/0.1-SNAPSHOT/streams-project-0.1-SNAPSHOT.pom
/jenkins/maven-repositories/0/org/apache/streams/streams-project/0.1-SNAPSHOT/streams-project-0.1-SNAPSHOT.pom is not inside <https://builds.apache.org/job/Streams%20Trunk/ws/;> will archive in a separate pass
Sending artifact delta relative to Streams Trunk » Apache Streams Project #99
Archived 1 artifacts
Archive block size is 32768
Received 0 blocks and 18632 bytes
Compression is 0.0%
Took 0.27 sec
channel stopped

Jenkins build is unstable: Streams Trunk #99

Posted by Apache Jenkins Server <je...@builds.apache.org>.
See <https://builds.apache.org/job/Streams%20Trunk/99/changes>


Build failed in Jenkins: Streams Trunk #98

Posted by Apache Jenkins Server <je...@builds.apache.org>.
See <https://builds.apache.org/job/Streams%20Trunk/98/changes>

Changes:

[rdouglas] STREAMS-216 | Updated the broadcast object to contain a streams ID which will make it easier to identify which Stream the beans belong to

[rdouglas] STREAMS-216 | All JMX monitoring beans now include identifying information and the time that the stream was started

[rdouglas] STREAMS-223 | Fixing faulty if statement logic that was causing NPEs when stream config objects were not explicitly set

[rdouglas] STREAMS-216 | Fixed unit tests and hardened LocalStreamBuilder, BaseStreamsTask, and BroadcastMonitorThread against NPEs

------------------------------------------
[...truncated 15320 lines...]
[JENKINS] Archiving <https://builds.apache.org/job/Streams%20Trunk/ws/streams-contrib/streams-processor-urls/target/streams-processor-urls-0.1-SNAPSHOT.jar> to org.apache.streams/streams-processor-urls/0.1-SNAPSHOT/streams-processor-urls-0.1-SNAPSHOT.jar
Sending artifact delta relative to Streams Trunk » streams-processor-urls #97
Archived 2 artifacts
Archive block size is 32768
Received 0 blocks and 31069 bytes
Compression is 0.0%
Took 87 ms
[JENKINS] Archiving <https://builds.apache.org/job/Streams%20Trunk/ws/streams-contrib/streams-processor-json/pom.xml> to org.apache.streams/streams-processor-json/0.1-SNAPSHOT/streams-processor-json-0.1-SNAPSHOT.pom
[JENKINS] Archiving <https://builds.apache.org/job/Streams%20Trunk/ws/streams-contrib/streams-processor-json/target/streams-processor-json-0.1-SNAPSHOT.jar> to org.apache.streams/streams-processor-json/0.1-SNAPSHOT/streams-processor-json-0.1-SNAPSHOT.jar
Sending artifact delta relative to Streams Trunk » streams-processor-json #97
Archived 2 artifacts
Archive block size is 32768
Received 0 blocks and 18548 bytes
Compression is 0.0%
Took 0.13 sec
[JENKINS] Archiving <https://builds.apache.org/job/Streams%20Trunk/ws/streams-contrib/streams-provider-rss/pom.xml> to org.apache.streams/streams-provider-rss/0.1-SNAPSHOT/streams-provider-rss-0.1-SNAPSHOT.pom
[JENKINS] Archiving <https://builds.apache.org/job/Streams%20Trunk/ws/streams-contrib/streams-provider-rss/target/streams-provider-rss-0.1-SNAPSHOT.jar> to org.apache.streams/streams-provider-rss/0.1-SNAPSHOT/streams-provider-rss-0.1-SNAPSHOT.jar
Sending artifact delta relative to Streams Trunk » streams-provider-rss #97
Archived 2 artifacts
Archive block size is 32768
Received 0 blocks and 42001 bytes
Compression is 0.0%
Took 0.17 sec
[JENKINS] Archiving /home/jenkins/jenkins-slave/maven-repositories/1/org/apache/streams/streams-components/0.1-SNAPSHOT/streams-components-0.1-SNAPSHOT.pom to org.apache.streams/streams-components/0.1-SNAPSHOT/streams-components-0.1-SNAPSHOT.pom
/home/jenkins/jenkins-slave/maven-repositories/1/org/apache/streams/streams-components/0.1-SNAPSHOT/streams-components-0.1-SNAPSHOT.pom is not inside <https://builds.apache.org/job/Streams%20Trunk/ws/streams-components/;> will archive in a separate pass
Sending artifact delta relative to Streams Trunk » streams-components #97
Archived 1 artifacts
Archive block size is 32768
Received 0 blocks and 2305 bytes
Compression is 0.0%
Took 75 ms
[JENKINS] Archiving <https://builds.apache.org/job/Streams%20Trunk/ws/streams-contrib/streams-amazon-aws/streams-persist-s3/pom.xml> to org.apache.streams/streams-persist-s3/0.1-SNAPSHOT/streams-persist-s3-0.1-SNAPSHOT.pom
[JENKINS] Archiving <https://builds.apache.org/job/Streams%20Trunk/ws/streams-contrib/streams-amazon-aws/streams-persist-s3/target/streams-persist-s3-0.1-SNAPSHOT.jar> to org.apache.streams/streams-persist-s3/0.1-SNAPSHOT/streams-persist-s3-0.1-SNAPSHOT.jar
Sending artifact delta relative to Streams Trunk » streams-persist-s3 #97
Archived 2 artifacts
Archive block size is 32768
Received 0 blocks and 37431 bytes
Compression is 0.0%
Took 0.13 sec
[JENKINS] Archiving /home/jenkins/jenkins-slave/maven-repositories/1/org/apache/streams/streams-runtimes/0.1-SNAPSHOT/streams-runtimes-0.1-SNAPSHOT.pom to org.apache.streams/streams-runtimes/0.1-SNAPSHOT/streams-runtimes-0.1-SNAPSHOT.pom
/home/jenkins/jenkins-slave/maven-repositories/1/org/apache/streams/streams-runtimes/0.1-SNAPSHOT/streams-runtimes-0.1-SNAPSHOT.pom is not inside <https://builds.apache.org/job/Streams%20Trunk/ws/streams-runtimes/;> will archive in a separate pass
Sending artifact delta relative to Streams Trunk » streams-runtimes #97
Archived 1 artifacts
Archive block size is 32768
Received 0 blocks and 1631 bytes
Compression is 0.0%
Took 82 ms
[JENKINS] Archiving <https://builds.apache.org/job/Streams%20Trunk/ws/streams-contrib/streams-provider-instagram/pom.xml> to org.apache.streams/streams-provider-instagram/0.1-SNAPSHOT/streams-provider-instagram-0.1-SNAPSHOT.pom
[JENKINS] Archiving <https://builds.apache.org/job/Streams%20Trunk/ws/streams-contrib/streams-provider-instagram/target/streams-provider-instagram-0.1-SNAPSHOT.jar> to org.apache.streams/streams-provider-instagram/0.1-SNAPSHOT/streams-provider-instagram-0.1-SNAPSHOT.jar
Sending artifact delta relative to Streams Trunk » streams-provider-instagram #97
Archived 2 artifacts
Archive block size is 32768
Received 0 blocks and 48571 bytes
Compression is 0.0%
Took 96 ms
[JENKINS] Archiving <https://builds.apache.org/job/Streams%20Trunk/ws/streams-pojo-extensions/pom.xml> to org.apache.streams/streams-pojo-extensions/0.1-SNAPSHOT/streams-pojo-extensions-0.1-SNAPSHOT.pom
[JENKINS] Archiving <https://builds.apache.org/job/Streams%20Trunk/ws/streams-pojo-extensions/target/streams-pojo-extensions-0.1-SNAPSHOT.jar> to org.apache.streams/streams-pojo-extensions/0.1-SNAPSHOT/streams-pojo-extensions-0.1-SNAPSHOT.jar
Sending artifact delta relative to Streams Trunk » streams-pojo-extensions #97
Archived 2 artifacts
Archive block size is 32768
Received 0 blocks and 13616 bytes
Compression is 0.0%
Took 80 ms
[JENKINS] Archiving <https://builds.apache.org/job/Streams%20Trunk/ws/streams-components/streams-http/pom.xml> to org.apache.streams/streams-http/0.1-SNAPSHOT/streams-http-0.1-SNAPSHOT.pom
[JENKINS] Archiving <https://builds.apache.org/job/Streams%20Trunk/ws/streams-components/streams-http/target/streams-http-0.1-SNAPSHOT.jar> to org.apache.streams/streams-http/0.1-SNAPSHOT/streams-http-0.1-SNAPSHOT.jar
Sending artifact delta relative to Streams Trunk » streams-http #97
Archived 2 artifacts
Archive block size is 32768
Received 0 blocks and 33586 bytes
Compression is 0.0%
Took 88 ms
[JENKINS] Archiving <https://builds.apache.org/job/Streams%20Trunk/ws/streams-osgi-components/activity-registration/pom.xml> to org.apache.streams.osgi.components/activity-registration/0.1-SNAPSHOT/activity-registration-0.1-SNAPSHOT.pom
[JENKINS] Archiving <https://builds.apache.org/job/Streams%20Trunk/ws/streams-osgi-components/activity-registration/target/activity-registration-0.1-SNAPSHOT.jar> to org.apache.streams.osgi.components/activity-registration/0.1-SNAPSHOT/activity-registration-0.1-SNAPSHOT.jar
Sending artifact delta relative to Streams Trunk » activity-registration-bundle [org.apache.streams.osgi.components] #97
Archived 2 artifacts
Archive block size is 32768
Received 0 blocks and 23017 bytes
Compression is 0.0%
Took 93 ms
[JENKINS] Archiving <https://builds.apache.org/job/Streams%20Trunk/ws/streams-contrib/streams-persist-elasticsearch/pom.xml> to org.apache.streams/streams-persist-elasticsearch/0.1-SNAPSHOT/streams-persist-elasticsearch-0.1-SNAPSHOT.pom
[JENKINS] Archiving <https://builds.apache.org/job/Streams%20Trunk/ws/streams-contrib/streams-persist-elasticsearch/target/streams-persist-elasticsearch-0.1-SNAPSHOT.jar> to org.apache.streams/streams-persist-elasticsearch/0.1-SNAPSHOT/streams-persist-elasticsearch-0.1-SNAPSHOT.jar
Sending artifact delta relative to Streams Trunk » streams-persist-elasticsearch #97
Archived 2 artifacts
Archive block size is 32768
Received 0 blocks and 68248 bytes
Compression is 0.0%
Took 1.6 sec
[JENKINS] Archiving <https://builds.apache.org/job/Streams%20Trunk/ws/streams-contrib/streams-provider-twitter/pom.xml> to org.apache.streams/streams-provider-twitter/0.1-SNAPSHOT/streams-provider-twitter-0.1-SNAPSHOT.pom
[JENKINS] Archiving <https://builds.apache.org/job/Streams%20Trunk/ws/streams-contrib/streams-provider-twitter/target/streams-provider-twitter-0.1-SNAPSHOT.jar> to org.apache.streams/streams-provider-twitter/0.1-SNAPSHOT/streams-provider-twitter-0.1-SNAPSHOT.jar
Sending artifact delta relative to Streams Trunk » streams-provider-twitter #97
Archived 2 artifacts
Archive block size is 32768
Received 0 blocks and 107218 bytes
Compression is 0.0%
Took 0.18 sec
[JENKINS] Archiving <https://builds.apache.org/job/Streams%20Trunk/ws/streams-contrib/streams-processor-regex/pom.xml> to org.apache.streams/streams-processor-regex/0.1-SNAPSHOT/streams-processor-regex-0.1-SNAPSHOT.pom
[JENKINS] Archiving <https://builds.apache.org/job/Streams%20Trunk/ws/streams-contrib/streams-processor-regex/target/streams-processor-regex-0.1-SNAPSHOT.jar> to org.apache.streams/streams-processor-regex/0.1-SNAPSHOT/streams-processor-regex-0.1-SNAPSHOT.jar
Sending artifact delta relative to Streams Trunk » streams-processor-regex #97
Archived 2 artifacts
Archive block size is 32768
Received 0 blocks and 18138 bytes
Compression is 0.0%
Took 0.16 sec
[JENKINS] Archiving <https://builds.apache.org/job/Streams%20Trunk/ws/streams-pojo/pom.xml> to org.apache.streams/streams-pojo/0.1-SNAPSHOT/streams-pojo-0.1-SNAPSHOT.pom
[JENKINS] Archiving <https://builds.apache.org/job/Streams%20Trunk/ws/streams-pojo/target/streams-pojo-0.1-SNAPSHOT.jar> to org.apache.streams/streams-pojo/0.1-SNAPSHOT/streams-pojo-0.1-SNAPSHOT.jar
Sending artifact delta relative to Streams Trunk » streams-pojo #97
Archived 2 artifacts
Archive block size is 32768
Received 0 blocks and 111831 bytes
Compression is 0.0%
Took 0.15 sec
[JENKINS] Archiving /home/jenkins/jenkins-slave/maven-repositories/1/org/apache/streams/streams-amazon-aws/0.1-SNAPSHOT/streams-amazon-aws-0.1-SNAPSHOT.pom to org.apache.streams/streams-amazon-aws/0.1-SNAPSHOT/streams-amazon-aws-0.1-SNAPSHOT.pom
/home/jenkins/jenkins-slave/maven-repositories/1/org/apache/streams/streams-amazon-aws/0.1-SNAPSHOT/streams-amazon-aws-0.1-SNAPSHOT.pom is not inside <https://builds.apache.org/job/Streams%20Trunk/ws/streams-contrib/streams-amazon-aws/;> will archive in a separate pass
Sending artifact delta relative to Streams Trunk » streams-amazon-aws #97
Archived 1 artifacts
Archive block size is 32768
Received 0 blocks and 2492 bytes
Compression is 0.0%
Took 85 ms
[JENKINS] Archiving /home/jenkins/jenkins-slave/maven-repositories/1/org/apache/streams/build/compiled-bundle-settings/0.1-SNAPSHOT/compiled-bundle-settings-0.1-SNAPSHOT.pom to org.apache.streams.build/compiled-bundle-settings/0.1-SNAPSHOT/compiled-bundle-settings-0.1-SNAPSHOT.pom
/home/jenkins/jenkins-slave/maven-repositories/1/org/apache/streams/build/compiled-bundle-settings/0.1-SNAPSHOT/compiled-bundle-settings-0.1-SNAPSHOT.pom is not inside <https://builds.apache.org/job/Streams%20Trunk/ws/poms/compiled/;> will archive in a separate pass
Sending artifact delta relative to Streams Trunk » apache-streams - bundle instructions #97
Archived 1 artifacts
Archive block size is 32768
Received 0 blocks and 3004 bytes
Compression is 0.0%
Took 0.13 sec
[JENKINS] Archiving <https://builds.apache.org/job/Streams%20Trunk/ws/streams-contrib/streams-provider-gnip/gnip-edc-youtube/pom.xml> to org.apache.streams/gnip-edc-youtube/0.1-SNAPSHOT/gnip-edc-youtube-0.1-SNAPSHOT.pom
[JENKINS] Archiving <https://builds.apache.org/job/Streams%20Trunk/ws/streams-contrib/streams-provider-gnip/gnip-edc-youtube/target/gnip-edc-youtube-0.1-SNAPSHOT.jar> to org.apache.streams/gnip-edc-youtube/0.1-SNAPSHOT/gnip-edc-youtube-0.1-SNAPSHOT.jar
Sending artifact delta relative to Streams Trunk » gnip-edc-youtube #97
Archived 2 artifacts
Archive block size is 32768
Received 0 blocks and 13628 bytes
Compression is 0.0%
Took 1.7 sec
[JENKINS] Archiving <https://builds.apache.org/job/Streams%20Trunk/ws/streams-runtimes/streams-runtime-local/pom.xml> to org.apache.streams/streams-runtime-local/0.1-SNAPSHOT/streams-runtime-local-0.1-SNAPSHOT.pom
[JENKINS] Archiving <https://builds.apache.org/job/Streams%20Trunk/ws/streams-runtimes/streams-runtime-local/target/streams-runtime-local-0.1-SNAPSHOT.jar> to org.apache.streams/streams-runtime-local/0.1-SNAPSHOT/streams-runtime-local-0.1-SNAPSHOT.jar
[JENKINS] Archiving <https://builds.apache.org/job/Streams%20Trunk/ws/streams-runtimes/streams-runtime-local/target/streams-runtime-local-0.1-SNAPSHOT-tests.jar> to org.apache.streams/streams-runtime-local/0.1-SNAPSHOT/streams-runtime-local-0.1-SNAPSHOT-tests.jar
Sending artifact delta relative to Streams Trunk » streams-runtime-local #97
Archived 3 artifacts
Archive block size is 32768
Received 0 blocks and 128571 bytes
Compression is 0.0%
Took 0.19 sec
[JENKINS] Archiving /home/jenkins/jenkins-slave/maven-repositories/1/org/apache/streams/streams-contrib/0.1-SNAPSHOT/streams-contrib-0.1-SNAPSHOT.pom to org.apache.streams/streams-contrib/0.1-SNAPSHOT/streams-contrib-0.1-SNAPSHOT.pom
/home/jenkins/jenkins-slave/maven-repositories/1/org/apache/streams/streams-contrib/0.1-SNAPSHOT/streams-contrib-0.1-SNAPSHOT.pom is not inside <https://builds.apache.org/job/Streams%20Trunk/ws/streams-contrib/;> will archive in a separate pass
Sending artifact delta relative to Streams Trunk » streams-contrib #97
Archived 1 artifacts
Archive block size is 32768
Received 0 blocks and 3453 bytes
Compression is 0.0%
Took 83 ms
[JENKINS] Archiving <https://builds.apache.org/job/Streams%20Trunk/ws/streams-monitoring/pom.xml> to org.apache.streams/streams-monitoring/0.1-SNAPSHOT/streams-monitoring-0.1-SNAPSHOT.pom
[JENKINS] Archiving <https://builds.apache.org/job/Streams%20Trunk/ws/streams-monitoring/target/streams-monitoring-0.1-SNAPSHOT.jar> to org.apache.streams/streams-monitoring/0.1-SNAPSHOT/streams-monitoring-0.1-SNAPSHOT.jar
Sending artifact delta relative to Streams Trunk » streams-monitoring #97
Archived 2 artifacts
Archive block size is 32768
Received 0 blocks and 38694 bytes
Compression is 0.0%
Took 87 ms
[JENKINS] Archiving /home/jenkins/jenkins-slave/maven-repositories/1/org/apache/streams/streams-project/0.1-SNAPSHOT/streams-project-0.1-SNAPSHOT.pom to org.apache.streams/streams-project/0.1-SNAPSHOT/streams-project-0.1-SNAPSHOT.pom
/home/jenkins/jenkins-slave/maven-repositories/1/org/apache/streams/streams-project/0.1-SNAPSHOT/streams-project-0.1-SNAPSHOT.pom is not inside <https://builds.apache.org/job/Streams%20Trunk/ws/;> will archive in a separate pass
Sending artifact delta relative to Streams Trunk » Apache Streams Project #97
Archived 1 artifacts
Archive block size is 32768
Received 0 blocks and 18632 bytes
Compression is 0.0%
Took 83 ms
[JENKINS] Archiving <https://builds.apache.org/job/Streams%20Trunk/ws/streams-osgi-components/streams-components-all/target/dependency-reduced-pom.xml> to org.apache.streams.osgi.components/streams-components-all/0.1-SNAPSHOT/streams-components-all-0.1-SNAPSHOT.pom
[JENKINS] Archiving <https://builds.apache.org/job/Streams%20Trunk/ws/streams-osgi-components/streams-components-all/target/streams-components-all-0.1-SNAPSHOT.jar> to org.apache.streams.osgi.components/streams-components-all/0.1-SNAPSHOT/streams-components-all-0.1-SNAPSHOT.jar
Sending artifact delta relative to Streams Trunk » Apache Streams Components All #97
Archived 2 artifacts
Archive block size is 32768
Received 130 blocks and 57567996 bytes
Compression is 6.9%
Took 33 sec
[JENKINS] Archiving <https://builds.apache.org/job/Streams%20Trunk/ws/streams-contrib/streams-processor-peoplepattern/pom.xml> to org.apache.streams/streams-processor-peoplepattern/0.1-SNAPSHOT/streams-processor-peoplepattern-0.1-SNAPSHOT.pom
[JENKINS] Archiving <https://builds.apache.org/job/Streams%20Trunk/ws/streams-contrib/streams-processor-peoplepattern/target/streams-processor-peoplepattern-0.1-SNAPSHOT.jar> to org.apache.streams/streams-processor-peoplepattern/0.1-SNAPSHOT/streams-processor-peoplepattern-0.1-SNAPSHOT.jar
Sending artifact delta relative to Streams Trunk » streams-processor-peoplepattern #97
Archived 2 artifacts
Archive block size is 32768
Received 0 blocks and 31812 bytes
Compression is 0.0%
Took 0.1 sec
[JENKINS] Archiving <https://builds.apache.org/job/Streams%20Trunk/ws/streams-contrib/streams-provider-google/google-gplus/pom.xml> to org.apache.streams/google-gplus/0.1-SNAPSHOT/google-gplus-0.1-SNAPSHOT.pom
[JENKINS] Archiving <https://builds.apache.org/job/Streams%20Trunk/ws/streams-contrib/streams-provider-google/google-gplus/target/google-gplus-0.1-SNAPSHOT.jar> to org.apache.streams/google-gplus/0.1-SNAPSHOT/google-gplus-0.1-SNAPSHOT.jar
Sending artifact delta relative to Streams Trunk » google-gplus #97
Archived 2 artifacts
Archive block size is 32768
Received 0 blocks and 56112 bytes
Compression is 0.0%
Took 2 sec
[JENKINS] Archiving /home/jenkins/jenkins-slave/maven-repositories/1/org/apache/streams/streams-provider-gnip/0.1-SNAPSHOT/streams-provider-gnip-0.1-SNAPSHOT.pom to org.apache.streams/streams-provider-gnip/0.1-SNAPSHOT/streams-provider-gnip-0.1-SNAPSHOT.pom
/home/jenkins/jenkins-slave/maven-repositories/1/org/apache/streams/streams-provider-gnip/0.1-SNAPSHOT/streams-provider-gnip-0.1-SNAPSHOT.pom is not inside <https://builds.apache.org/job/Streams%20Trunk/ws/streams-contrib/streams-provider-gnip/;> will archive in a separate pass
Sending artifact delta relative to Streams Trunk » streams-provider-gnip #97
Archived 1 artifacts
Archive block size is 32768
Received 0 blocks and 1771 bytes
Compression is 0.0%
Took 76 ms
[JENKINS] Archiving <https://builds.apache.org/job/Streams%20Trunk/ws/streams-contrib/streams-persist-hdfs/pom.xml> to org.apache.streams/streams-persist-hdfs/0.1-SNAPSHOT/streams-persist-hdfs-0.1-SNAPSHOT.pom
[JENKINS] Archiving <https://builds.apache.org/job/Streams%20Trunk/ws/streams-contrib/streams-persist-hdfs/target/streams-persist-hdfs-0.1-SNAPSHOT.jar> to org.apache.streams/streams-persist-hdfs/0.1-SNAPSHOT/streams-persist-hdfs-0.1-SNAPSHOT.jar
Sending artifact delta relative to Streams Trunk » streams-persist-hdfs #97
Archived 2 artifacts
Archive block size is 32768
Received 0 blocks and 36922 bytes
Compression is 0.0%
Took 87 ms
[JENKINS] Archiving <https://builds.apache.org/job/Streams%20Trunk/ws/streams-contrib/streams-persist-console/pom.xml> to org.apache.streams/streams-persist-console/0.1-SNAPSHOT/streams-persist-console-0.1-SNAPSHOT.pom
[JENKINS] Archiving <https://builds.apache.org/job/Streams%20Trunk/ws/streams-contrib/streams-persist-console/target/streams-persist-console-0.1-SNAPSHOT.jar> to org.apache.streams/streams-persist-console/0.1-SNAPSHOT/streams-persist-console-0.1-SNAPSHOT.jar
Sending artifact delta relative to Streams Trunk » streams-persist-console #97
Archived 2 artifacts
Archive block size is 32768
Received 0 blocks and 15357 bytes
Compression is 0.0%
Took 83 ms
[JENKINS] Archiving <https://builds.apache.org/job/Streams%20Trunk/ws/streams-osgi-components/activity-consumer/pom.xml> to org.apache.streams.osgi.components/activity-consumer/0.1-SNAPSHOT/activity-consumer-0.1-SNAPSHOT.pom
[JENKINS] Archiving <https://builds.apache.org/job/Streams%20Trunk/ws/streams-osgi-components/activity-consumer/target/activity-consumer-0.1-SNAPSHOT.jar> to org.apache.streams.osgi.components/activity-consumer/0.1-SNAPSHOT/activity-consumer-0.1-SNAPSHOT.jar
Sending artifact delta relative to Streams Trunk » activity-consumer-bundle [org.apache.streams.osgi.components.activityconsumer] #97
Archived 2 artifacts
Archive block size is 32768
Received 0 blocks and 25026 bytes
Compression is 0.0%
Took 75 ms
[JENKINS] Archiving <https://builds.apache.org/job/Streams%20Trunk/ws/streams-contrib/streams-provider-datasift/pom.xml> to org.apache.streams/streams-provider-datasift/0.1-SNAPSHOT/streams-provider-datasift-0.1-SNAPSHOT.pom
[JENKINS] Archiving <https://builds.apache.org/job/Streams%20Trunk/ws/streams-contrib/streams-provider-datasift/target/streams-provider-datasift-0.1-SNAPSHOT.jar> to org.apache.streams/streams-provider-datasift/0.1-SNAPSHOT/streams-provider-datasift-0.1-SNAPSHOT.jar
Sending artifact delta relative to Streams Trunk » streams-provider-datasift #97
Archived 2 artifacts
Archive block size is 32768
Received 0 blocks and 150764 bytes
Compression is 0.0%
Took 2 sec
[JENKINS] Archiving <https://builds.apache.org/job/Streams%20Trunk/ws/streams-contrib/streams-provider-google/google-gmail/pom.xml> to org.apache.streams/google-gmail/0.1-SNAPSHOT/google-gmail-0.1-SNAPSHOT.pom
[JENKINS] Archiving <https://builds.apache.org/job/Streams%20Trunk/ws/streams-contrib/streams-provider-google/google-gmail/target/google-gmail-0.1-SNAPSHOT.jar> to org.apache.streams/google-gmail/0.1-SNAPSHOT/google-gmail-0.1-SNAPSHOT.jar
Sending artifact delta relative to Streams Trunk » google-gmail #97
Archived 2 artifacts
Archive block size is 32768
Received 0 blocks and 26441 bytes
Compression is 0.0%
Took 0.22 sec
[JENKINS] Archiving <https://builds.apache.org/job/Streams%20Trunk/ws/streams-contrib/streams-provider-gnip/gnip-edc-instagram/pom.xml> to org.apache.streams/gnip-edc-instagram/0.1-SNAPSHOT/gnip-edc-instagram-0.1-SNAPSHOT.pom
[JENKINS] Archiving <https://builds.apache.org/job/Streams%20Trunk/ws/streams-contrib/streams-provider-gnip/gnip-edc-instagram/target/gnip-edc-instagram-0.1-SNAPSHOT.jar> to org.apache.streams/gnip-edc-instagram/0.1-SNAPSHOT/gnip-edc-instagram-0.1-SNAPSHOT.jar
Sending artifact delta relative to Streams Trunk » gnip-edc-instagram #97
Archived 2 artifacts
Archive block size is 32768
Received 0 blocks and 30448 bytes
Compression is 0.0%
Took 0.19 sec
channel stopped

Build failed in Jenkins: Streams Trunk #97

Posted by Apache Jenkins Server <je...@builds.apache.org>.
See <https://builds.apache.org/job/Streams%20Trunk/97/changes>

Changes:

[sblackmon] These classes were deleted prematurely, causing unnecessary breaking changes.  They should deprecated as part of STREAMS-218 and deleted in the next minor version.

------------------------------------------
[...truncated 14950 lines...]
[JENKINS] Archiving <https://builds.apache.org/job/Streams%20Trunk/ws/streams-contrib/streams-processor-urls/target/streams-processor-urls-0.1-SNAPSHOT.jar> to org.apache.streams/streams-processor-urls/0.1-SNAPSHOT/streams-processor-urls-0.1-SNAPSHOT.jar
Sending artifact delta relative to Streams Trunk » streams-processor-urls #96
Archived 2 artifacts
Archive block size is 32768
Received 0 blocks and 31069 bytes
Compression is 0.0%
Took 0.11 sec
[JENKINS] Archiving <https://builds.apache.org/job/Streams%20Trunk/ws/streams-contrib/streams-processor-json/pom.xml> to org.apache.streams/streams-processor-json/0.1-SNAPSHOT/streams-processor-json-0.1-SNAPSHOT.pom
[JENKINS] Archiving <https://builds.apache.org/job/Streams%20Trunk/ws/streams-contrib/streams-processor-json/target/streams-processor-json-0.1-SNAPSHOT.jar> to org.apache.streams/streams-processor-json/0.1-SNAPSHOT/streams-processor-json-0.1-SNAPSHOT.jar
Sending artifact delta relative to Streams Trunk » streams-processor-json #96
Archived 2 artifacts
Archive block size is 32768
Received 0 blocks and 18549 bytes
Compression is 0.0%
Took 84 ms
[JENKINS] Archiving <https://builds.apache.org/job/Streams%20Trunk/ws/streams-contrib/streams-provider-rss/pom.xml> to org.apache.streams/streams-provider-rss/0.1-SNAPSHOT/streams-provider-rss-0.1-SNAPSHOT.pom
[JENKINS] Archiving <https://builds.apache.org/job/Streams%20Trunk/ws/streams-contrib/streams-provider-rss/target/streams-provider-rss-0.1-SNAPSHOT.jar> to org.apache.streams/streams-provider-rss/0.1-SNAPSHOT/streams-provider-rss-0.1-SNAPSHOT.jar
Sending artifact delta relative to Streams Trunk » streams-provider-rss #96
Archived 2 artifacts
Archive block size is 32768
Received 0 blocks and 42000 bytes
Compression is 0.0%
Took 0.12 sec
[JENKINS] Archiving /home/jenkins/jenkins-slave/maven-repositories/0/org/apache/streams/streams-components/0.1-SNAPSHOT/streams-components-0.1-SNAPSHOT.pom to org.apache.streams/streams-components/0.1-SNAPSHOT/streams-components-0.1-SNAPSHOT.pom
/home/jenkins/jenkins-slave/maven-repositories/0/org/apache/streams/streams-components/0.1-SNAPSHOT/streams-components-0.1-SNAPSHOT.pom is not inside <https://builds.apache.org/job/Streams%20Trunk/ws/streams-components/;> will archive in a separate pass
Sending artifact delta relative to Streams Trunk » streams-components #96
Archived 1 artifacts
Archive block size is 32768
Received 0 blocks and 2305 bytes
Compression is 0.0%
Took 76 ms
[JENKINS] Archiving <https://builds.apache.org/job/Streams%20Trunk/ws/streams-contrib/streams-amazon-aws/streams-persist-s3/pom.xml> to org.apache.streams/streams-persist-s3/0.1-SNAPSHOT/streams-persist-s3-0.1-SNAPSHOT.pom
[JENKINS] Archiving <https://builds.apache.org/job/Streams%20Trunk/ws/streams-contrib/streams-amazon-aws/streams-persist-s3/target/streams-persist-s3-0.1-SNAPSHOT.jar> to org.apache.streams/streams-persist-s3/0.1-SNAPSHOT/streams-persist-s3-0.1-SNAPSHOT.jar
Sending artifact delta relative to Streams Trunk » streams-persist-s3 #96
Archived 2 artifacts
Archive block size is 32768
Received 0 blocks and 37434 bytes
Compression is 0.0%
Took 84 ms
[JENKINS] Archiving /home/jenkins/jenkins-slave/maven-repositories/0/org/apache/streams/streams-runtimes/0.1-SNAPSHOT/streams-runtimes-0.1-SNAPSHOT.pom to org.apache.streams/streams-runtimes/0.1-SNAPSHOT/streams-runtimes-0.1-SNAPSHOT.pom
/home/jenkins/jenkins-slave/maven-repositories/0/org/apache/streams/streams-runtimes/0.1-SNAPSHOT/streams-runtimes-0.1-SNAPSHOT.pom is not inside <https://builds.apache.org/job/Streams%20Trunk/ws/streams-runtimes/;> will archive in a separate pass
Sending artifact delta relative to Streams Trunk » streams-runtimes #96
Archived 1 artifacts
Archive block size is 32768
Received 0 blocks and 1631 bytes
Compression is 0.0%
Took 0.13 sec
[JENKINS] Archiving <https://builds.apache.org/job/Streams%20Trunk/ws/streams-contrib/streams-provider-instagram/pom.xml> to org.apache.streams/streams-provider-instagram/0.1-SNAPSHOT/streams-provider-instagram-0.1-SNAPSHOT.pom
[JENKINS] Archiving <https://builds.apache.org/job/Streams%20Trunk/ws/streams-contrib/streams-provider-instagram/target/streams-provider-instagram-0.1-SNAPSHOT.jar> to org.apache.streams/streams-provider-instagram/0.1-SNAPSHOT/streams-provider-instagram-0.1-SNAPSHOT.jar
Sending artifact delta relative to Streams Trunk » streams-provider-instagram #96
Archived 2 artifacts
Archive block size is 32768
Received 0 blocks and 48571 bytes
Compression is 0.0%
Took 2 sec
[JENKINS] Archiving <https://builds.apache.org/job/Streams%20Trunk/ws/streams-pojo-extensions/pom.xml> to org.apache.streams/streams-pojo-extensions/0.1-SNAPSHOT/streams-pojo-extensions-0.1-SNAPSHOT.pom
[JENKINS] Archiving <https://builds.apache.org/job/Streams%20Trunk/ws/streams-pojo-extensions/target/streams-pojo-extensions-0.1-SNAPSHOT.jar> to org.apache.streams/streams-pojo-extensions/0.1-SNAPSHOT/streams-pojo-extensions-0.1-SNAPSHOT.jar
Sending artifact delta relative to Streams Trunk » streams-pojo-extensions #96
Archived 2 artifacts
Archive block size is 32768
Received 0 blocks and 13617 bytes
Compression is 0.0%
Took 87 ms
[JENKINS] Archiving <https://builds.apache.org/job/Streams%20Trunk/ws/streams-components/streams-http/pom.xml> to org.apache.streams/streams-http/0.1-SNAPSHOT/streams-http-0.1-SNAPSHOT.pom
[JENKINS] Archiving <https://builds.apache.org/job/Streams%20Trunk/ws/streams-components/streams-http/target/streams-http-0.1-SNAPSHOT.jar> to org.apache.streams/streams-http/0.1-SNAPSHOT/streams-http-0.1-SNAPSHOT.jar
Sending artifact delta relative to Streams Trunk » streams-http #96
Archived 2 artifacts
Archive block size is 32768
Received 0 blocks and 33588 bytes
Compression is 0.0%
Took 79 ms
[JENKINS] Archiving <https://builds.apache.org/job/Streams%20Trunk/ws/streams-osgi-components/activity-registration/pom.xml> to org.apache.streams.osgi.components/activity-registration/0.1-SNAPSHOT/activity-registration-0.1-SNAPSHOT.pom
[JENKINS] Archiving <https://builds.apache.org/job/Streams%20Trunk/ws/streams-osgi-components/activity-registration/target/activity-registration-0.1-SNAPSHOT.jar> to org.apache.streams.osgi.components/activity-registration/0.1-SNAPSHOT/activity-registration-0.1-SNAPSHOT.jar
Sending artifact delta relative to Streams Trunk » activity-registration-bundle [org.apache.streams.osgi.components] #96
Archived 2 artifacts
Archive block size is 32768
Received 0 blocks and 23019 bytes
Compression is 0.0%
Took 92 ms
[JENKINS] Archiving <https://builds.apache.org/job/Streams%20Trunk/ws/streams-contrib/streams-persist-elasticsearch/pom.xml> to org.apache.streams/streams-persist-elasticsearch/0.1-SNAPSHOT/streams-persist-elasticsearch-0.1-SNAPSHOT.pom
[JENKINS] Archiving <https://builds.apache.org/job/Streams%20Trunk/ws/streams-contrib/streams-persist-elasticsearch/target/streams-persist-elasticsearch-0.1-SNAPSHOT.jar> to org.apache.streams/streams-persist-elasticsearch/0.1-SNAPSHOT/streams-persist-elasticsearch-0.1-SNAPSHOT.jar
Sending artifact delta relative to Streams Trunk » streams-persist-elasticsearch #96
Archived 2 artifacts
Archive block size is 32768
Received 0 blocks and 68250 bytes
Compression is 0.0%
Took 0.11 sec
[JENKINS] Archiving <https://builds.apache.org/job/Streams%20Trunk/ws/streams-contrib/streams-provider-twitter/pom.xml> to org.apache.streams/streams-provider-twitter/0.1-SNAPSHOT/streams-provider-twitter-0.1-SNAPSHOT.pom
[JENKINS] Archiving <https://builds.apache.org/job/Streams%20Trunk/ws/streams-contrib/streams-provider-twitter/target/streams-provider-twitter-0.1-SNAPSHOT.jar> to org.apache.streams/streams-provider-twitter/0.1-SNAPSHOT/streams-provider-twitter-0.1-SNAPSHOT.jar
Sending artifact delta relative to Streams Trunk » streams-provider-twitter #96
Archived 2 artifacts
Archive block size is 32768
Received 0 blocks and 107217 bytes
Compression is 0.0%
Took 2.1 sec
[JENKINS] Archiving <https://builds.apache.org/job/Streams%20Trunk/ws/streams-contrib/streams-processor-regex/pom.xml> to org.apache.streams/streams-processor-regex/0.1-SNAPSHOT/streams-processor-regex-0.1-SNAPSHOT.pom
[JENKINS] Archiving <https://builds.apache.org/job/Streams%20Trunk/ws/streams-contrib/streams-processor-regex/target/streams-processor-regex-0.1-SNAPSHOT.jar> to org.apache.streams/streams-processor-regex/0.1-SNAPSHOT/streams-processor-regex-0.1-SNAPSHOT.jar
Sending artifact delta relative to Streams Trunk » streams-processor-regex #96
Archived 2 artifacts
Archive block size is 32768
Received 0 blocks and 18139 bytes
Compression is 0.0%
Took 0.17 sec
[JENKINS] Archiving <https://builds.apache.org/job/Streams%20Trunk/ws/streams-pojo/pom.xml> to org.apache.streams/streams-pojo/0.1-SNAPSHOT/streams-pojo-0.1-SNAPSHOT.pom
[JENKINS] Archiving <https://builds.apache.org/job/Streams%20Trunk/ws/streams-pojo/target/streams-pojo-0.1-SNAPSHOT.jar> to org.apache.streams/streams-pojo/0.1-SNAPSHOT/streams-pojo-0.1-SNAPSHOT.jar
Sending artifact delta relative to Streams Trunk » streams-pojo #96
Archived 2 artifacts
Archive block size is 32768
Received 0 blocks and 111832 bytes
Compression is 0.0%
Took 0.22 sec
[JENKINS] Archiving /home/jenkins/jenkins-slave/maven-repositories/0/org/apache/streams/streams-amazon-aws/0.1-SNAPSHOT/streams-amazon-aws-0.1-SNAPSHOT.pom to org.apache.streams/streams-amazon-aws/0.1-SNAPSHOT/streams-amazon-aws-0.1-SNAPSHOT.pom
/home/jenkins/jenkins-slave/maven-repositories/0/org/apache/streams/streams-amazon-aws/0.1-SNAPSHOT/streams-amazon-aws-0.1-SNAPSHOT.pom is not inside <https://builds.apache.org/job/Streams%20Trunk/ws/streams-contrib/streams-amazon-aws/;> will archive in a separate pass
Sending artifact delta relative to Streams Trunk » streams-amazon-aws #96
Archived 1 artifacts
Archive block size is 32768
Received 0 blocks and 2492 bytes
Compression is 0.0%
Took 87 ms
[JENKINS] Archiving /home/jenkins/jenkins-slave/maven-repositories/0/org/apache/streams/build/compiled-bundle-settings/0.1-SNAPSHOT/compiled-bundle-settings-0.1-SNAPSHOT.pom to org.apache.streams.build/compiled-bundle-settings/0.1-SNAPSHOT/compiled-bundle-settings-0.1-SNAPSHOT.pom
/home/jenkins/jenkins-slave/maven-repositories/0/org/apache/streams/build/compiled-bundle-settings/0.1-SNAPSHOT/compiled-bundle-settings-0.1-SNAPSHOT.pom is not inside <https://builds.apache.org/job/Streams%20Trunk/ws/poms/compiled/;> will archive in a separate pass
Sending artifact delta relative to Streams Trunk » apache-streams - bundle instructions #96
Archived 1 artifacts
Archive block size is 32768
Received 0 blocks and 3004 bytes
Compression is 0.0%
Took 1.5 sec
[JENKINS] Archiving <https://builds.apache.org/job/Streams%20Trunk/ws/streams-contrib/streams-provider-gnip/gnip-edc-youtube/pom.xml> to org.apache.streams/gnip-edc-youtube/0.1-SNAPSHOT/gnip-edc-youtube-0.1-SNAPSHOT.pom
[JENKINS] Archiving <https://builds.apache.org/job/Streams%20Trunk/ws/streams-contrib/streams-provider-gnip/gnip-edc-youtube/target/gnip-edc-youtube-0.1-SNAPSHOT.jar> to org.apache.streams/gnip-edc-youtube/0.1-SNAPSHOT/gnip-edc-youtube-0.1-SNAPSHOT.jar
Sending artifact delta relative to Streams Trunk » gnip-edc-youtube #96
Archived 2 artifacts
Archive block size is 32768
Received 0 blocks and 13629 bytes
Compression is 0.0%
Took 0.1 sec
[JENKINS] Archiving <https://builds.apache.org/job/Streams%20Trunk/ws/streams-runtimes/streams-runtime-local/pom.xml> to org.apache.streams/streams-runtime-local/0.1-SNAPSHOT/streams-runtime-local-0.1-SNAPSHOT.pom
[JENKINS] Archiving <https://builds.apache.org/job/Streams%20Trunk/ws/streams-runtimes/streams-runtime-local/target/streams-runtime-local-0.1-SNAPSHOT.jar> to org.apache.streams/streams-runtime-local/0.1-SNAPSHOT/streams-runtime-local-0.1-SNAPSHOT.jar
[JENKINS] Archiving <https://builds.apache.org/job/Streams%20Trunk/ws/streams-runtimes/streams-runtime-local/target/streams-runtime-local-0.1-SNAPSHOT-tests.jar> to org.apache.streams/streams-runtime-local/0.1-SNAPSHOT/streams-runtime-local-0.1-SNAPSHOT-tests.jar
Sending artifact delta relative to Streams Trunk » streams-runtime-local #96
Archived 3 artifacts
Archive block size is 32768
Received 0 blocks and 125894 bytes
Compression is 0.0%
Took 0.18 sec
[JENKINS] Archiving /home/jenkins/jenkins-slave/maven-repositories/0/org/apache/streams/streams-contrib/0.1-SNAPSHOT/streams-contrib-0.1-SNAPSHOT.pom to org.apache.streams/streams-contrib/0.1-SNAPSHOT/streams-contrib-0.1-SNAPSHOT.pom
/home/jenkins/jenkins-slave/maven-repositories/0/org/apache/streams/streams-contrib/0.1-SNAPSHOT/streams-contrib-0.1-SNAPSHOT.pom is not inside <https://builds.apache.org/job/Streams%20Trunk/ws/streams-contrib/;> will archive in a separate pass
Sending artifact delta relative to Streams Trunk » streams-contrib #96
Archived 1 artifacts
Archive block size is 32768
Received 0 blocks and 3453 bytes
Compression is 0.0%
Took 78 ms
[JENKINS] Archiving <https://builds.apache.org/job/Streams%20Trunk/ws/streams-monitoring/pom.xml> to org.apache.streams/streams-monitoring/0.1-SNAPSHOT/streams-monitoring-0.1-SNAPSHOT.pom
[JENKINS] Archiving <https://builds.apache.org/job/Streams%20Trunk/ws/streams-monitoring/target/streams-monitoring-0.1-SNAPSHOT.jar> to org.apache.streams/streams-monitoring/0.1-SNAPSHOT/streams-monitoring-0.1-SNAPSHOT.jar
Sending artifact delta relative to Streams Trunk » streams-monitoring #96
Archived 2 artifacts
Archive block size is 32768
Received 0 blocks and 38482 bytes
Compression is 0.0%
Took 81 ms
[JENKINS] Archiving /home/jenkins/jenkins-slave/maven-repositories/0/org/apache/streams/streams-project/0.1-SNAPSHOT/streams-project-0.1-SNAPSHOT.pom to org.apache.streams/streams-project/0.1-SNAPSHOT/streams-project-0.1-SNAPSHOT.pom
/home/jenkins/jenkins-slave/maven-repositories/0/org/apache/streams/streams-project/0.1-SNAPSHOT/streams-project-0.1-SNAPSHOT.pom is not inside <https://builds.apache.org/job/Streams%20Trunk/ws/;> will archive in a separate pass
Sending artifact delta relative to Streams Trunk » Apache Streams Project #96
Archived 1 artifacts
Archive block size is 32768
Received 0 blocks and 18632 bytes
Compression is 0.0%
Took 84 ms
[JENKINS] Archiving <https://builds.apache.org/job/Streams%20Trunk/ws/streams-osgi-components/streams-components-all/target/dependency-reduced-pom.xml> to org.apache.streams.osgi.components/streams-components-all/0.1-SNAPSHOT/streams-components-all-0.1-SNAPSHOT.pom
[JENKINS] Archiving <https://builds.apache.org/job/Streams%20Trunk/ws/streams-osgi-components/streams-components-all/target/streams-components-all-0.1-SNAPSHOT.jar> to org.apache.streams.osgi.components/streams-components-all/0.1-SNAPSHOT/streams-components-all-0.1-SNAPSHOT.jar
Sending artifact delta relative to Streams Trunk » Apache Streams Components All #96
Archived 2 artifacts
Archive block size is 32768
Received 130 blocks and 57568003 bytes
Compression is 6.9%
Took 32 sec
[JENKINS] Archiving <https://builds.apache.org/job/Streams%20Trunk/ws/streams-contrib/streams-processor-peoplepattern/pom.xml> to org.apache.streams/streams-processor-peoplepattern/0.1-SNAPSHOT/streams-processor-peoplepattern-0.1-SNAPSHOT.pom
[JENKINS] Archiving <https://builds.apache.org/job/Streams%20Trunk/ws/streams-contrib/streams-processor-peoplepattern/target/streams-processor-peoplepattern-0.1-SNAPSHOT.jar> to org.apache.streams/streams-processor-peoplepattern/0.1-SNAPSHOT/streams-processor-peoplepattern-0.1-SNAPSHOT.jar
Sending artifact delta relative to Streams Trunk » streams-processor-peoplepattern #96
Archived 2 artifacts
Archive block size is 32768
Received 0 blocks and 31812 bytes
Compression is 0.0%
Took 89 ms
[JENKINS] Archiving <https://builds.apache.org/job/Streams%20Trunk/ws/streams-contrib/streams-provider-google/google-gplus/pom.xml> to org.apache.streams/google-gplus/0.1-SNAPSHOT/google-gplus-0.1-SNAPSHOT.pom
[JENKINS] Archiving <https://builds.apache.org/job/Streams%20Trunk/ws/streams-contrib/streams-provider-google/google-gplus/target/google-gplus-0.1-SNAPSHOT.jar> to org.apache.streams/google-gplus/0.1-SNAPSHOT/google-gplus-0.1-SNAPSHOT.jar
Sending artifact delta relative to Streams Trunk » google-gplus #96
Archived 2 artifacts
Archive block size is 32768
Received 0 blocks and 56113 bytes
Compression is 0.0%
Took 93 ms
[JENKINS] Archiving /home/jenkins/jenkins-slave/maven-repositories/0/org/apache/streams/streams-provider-gnip/0.1-SNAPSHOT/streams-provider-gnip-0.1-SNAPSHOT.pom to org.apache.streams/streams-provider-gnip/0.1-SNAPSHOT/streams-provider-gnip-0.1-SNAPSHOT.pom
/home/jenkins/jenkins-slave/maven-repositories/0/org/apache/streams/streams-provider-gnip/0.1-SNAPSHOT/streams-provider-gnip-0.1-SNAPSHOT.pom is not inside <https://builds.apache.org/job/Streams%20Trunk/ws/streams-contrib/streams-provider-gnip/;> will archive in a separate pass
Sending artifact delta relative to Streams Trunk » streams-provider-gnip #96
Archived 1 artifacts
Archive block size is 32768
Received 0 blocks and 1771 bytes
Compression is 0.0%
Took 80 ms
[JENKINS] Archiving <https://builds.apache.org/job/Streams%20Trunk/ws/streams-contrib/streams-persist-hdfs/pom.xml> to org.apache.streams/streams-persist-hdfs/0.1-SNAPSHOT/streams-persist-hdfs-0.1-SNAPSHOT.pom
[JENKINS] Archiving <https://builds.apache.org/job/Streams%20Trunk/ws/streams-contrib/streams-persist-hdfs/target/streams-persist-hdfs-0.1-SNAPSHOT.jar> to org.apache.streams/streams-persist-hdfs/0.1-SNAPSHOT/streams-persist-hdfs-0.1-SNAPSHOT.jar
Sending artifact delta relative to Streams Trunk » streams-persist-hdfs #96
Archived 2 artifacts
Archive block size is 32768
Received 0 blocks and 36924 bytes
Compression is 0.0%
Took 80 ms
[JENKINS] Archiving <https://builds.apache.org/job/Streams%20Trunk/ws/streams-contrib/streams-persist-console/pom.xml> to org.apache.streams/streams-persist-console/0.1-SNAPSHOT/streams-persist-console-0.1-SNAPSHOT.pom
[JENKINS] Archiving <https://builds.apache.org/job/Streams%20Trunk/ws/streams-contrib/streams-persist-console/target/streams-persist-console-0.1-SNAPSHOT.jar> to org.apache.streams/streams-persist-console/0.1-SNAPSHOT/streams-persist-console-0.1-SNAPSHOT.jar
Sending artifact delta relative to Streams Trunk » streams-persist-console #96
Archived 2 artifacts
Archive block size is 32768
Received 0 blocks and 15358 bytes
Compression is 0.0%
Took 0.11 sec
[JENKINS] Archiving <https://builds.apache.org/job/Streams%20Trunk/ws/streams-osgi-components/activity-consumer/pom.xml> to org.apache.streams.osgi.components/activity-consumer/0.1-SNAPSHOT/activity-consumer-0.1-SNAPSHOT.pom
[JENKINS] Archiving <https://builds.apache.org/job/Streams%20Trunk/ws/streams-osgi-components/activity-consumer/target/activity-consumer-0.1-SNAPSHOT.jar> to org.apache.streams.osgi.components/activity-consumer/0.1-SNAPSHOT/activity-consumer-0.1-SNAPSHOT.jar
Sending artifact delta relative to Streams Trunk » activity-consumer-bundle [org.apache.streams.osgi.components.activityconsumer] #96
Archived 2 artifacts
Archive block size is 32768
Received 0 blocks and 25027 bytes
Compression is 0.0%
Took 80 ms
[JENKINS] Archiving <https://builds.apache.org/job/Streams%20Trunk/ws/streams-contrib/streams-provider-datasift/pom.xml> to org.apache.streams/streams-provider-datasift/0.1-SNAPSHOT/streams-provider-datasift-0.1-SNAPSHOT.pom
[JENKINS] Archiving <https://builds.apache.org/job/Streams%20Trunk/ws/streams-contrib/streams-provider-datasift/target/streams-provider-datasift-0.1-SNAPSHOT.jar> to org.apache.streams/streams-provider-datasift/0.1-SNAPSHOT/streams-provider-datasift-0.1-SNAPSHOT.jar
Sending artifact delta relative to Streams Trunk » streams-provider-datasift #96
Archived 2 artifacts
Archive block size is 32768
Received 0 blocks and 150764 bytes
Compression is 0.0%
Took 0.16 sec
[JENKINS] Archiving <https://builds.apache.org/job/Streams%20Trunk/ws/streams-contrib/streams-provider-google/google-gmail/pom.xml> to org.apache.streams/google-gmail/0.1-SNAPSHOT/google-gmail-0.1-SNAPSHOT.pom
[JENKINS] Archiving <https://builds.apache.org/job/Streams%20Trunk/ws/streams-contrib/streams-provider-google/google-gmail/target/google-gmail-0.1-SNAPSHOT.jar> to org.apache.streams/google-gmail/0.1-SNAPSHOT/google-gmail-0.1-SNAPSHOT.jar
Sending artifact delta relative to Streams Trunk » google-gmail #96
Archived 2 artifacts
Archive block size is 32768
Received 0 blocks and 26442 bytes
Compression is 0.0%
Took 88 ms
[JENKINS] Archiving <https://builds.apache.org/job/Streams%20Trunk/ws/streams-contrib/streams-provider-gnip/gnip-edc-instagram/pom.xml> to org.apache.streams/gnip-edc-instagram/0.1-SNAPSHOT/gnip-edc-instagram-0.1-SNAPSHOT.pom
[JENKINS] Archiving <https://builds.apache.org/job/Streams%20Trunk/ws/streams-contrib/streams-provider-gnip/gnip-edc-instagram/target/gnip-edc-instagram-0.1-SNAPSHOT.jar> to org.apache.streams/gnip-edc-instagram/0.1-SNAPSHOT/gnip-edc-instagram-0.1-SNAPSHOT.jar
Sending artifact delta relative to Streams Trunk » gnip-edc-instagram #96
Archived 2 artifacts
Archive block size is 32768
Received 0 blocks and 30449 bytes
Compression is 0.0%
Took 96 ms
channel stopped

Re: Build failed in Jenkins: Streams Trunk #96

Posted by "Steve Blackmon [W2O Group]" <sb...@w2ogroup.com>.
I’m not sure why the build went red on #96 when the same datasift tests were failing in #95.

All 4 of these tests are passing in the STREAMS-68,218 branch (along with 9 new tests in this module) which has an open PR, so for that reason I’m not planning on taking action to get to zero failures on master at this time.

sblackmon@apache.org

> On Nov 17, 2014, at 4:01 PM, Apache Jenkins Server <je...@builds.apache.org> wrote:
>
> See <http://cp.mcafee.com/d/avndy1J5x5NdN5MQsK6XCQQmhPMWWrMUSCyMy-yCOyedFEIzDxRQTDzqqb339EVuujjdQ87XoGHm0ac9RgAhBfj-ndC4WEi8ODF_bC_pKeRNx_HYUeo7ectuVtdBZfAkXzzhOepVqWdAkRrKcYG7DR8OJMddECTNNK_9IInojvvpjdTdAVPmEBC46V7EkXlJIj_w0e2di634U_GJ1WtMj5K1n3hOVByuM8_gSxVAL7VJNwnjpo75W43ZIllH0UMDl2h6kZfVs5kD7ZlFQEmr8reIuRrr4_U02rjovs76NBKhW1EwtSh_E6y2k3h017MaOxh8Qg34U_GJ3h02oJMaCy033hOUrojdUCW2SvGU>
>
> Changes:
>
> [sblackmon] refresh streams-config
>
> [sblackmon] Additional tests
>
> [sblackmon] http://cp.mcafee.com/d/FZsS71MO81NJ5x5NdN5MQsK6XCQQmhPMWWrMUSCyMy-yCOyedFEIzDxRQTDzqqb339EVuujjdQ87XoGHm0ac9RgAhBfj-ndC4WEi8ODF_bC_pKeRNx_HYUeo7ectuVtdBZfAkXzzhOepVqWdAkRrKcYG7DR8OJMddFCTNNK_9IInojvvpjdTdAVPmEBC4pj9JAenPlJIj_9gISgStoBWjz-GQNpIY_4kT3q7CiYvCT61tdBwsnEgfSNlmI3z2tk94pjQ_BMlisvRmDixpIxIWNXlJIj_w09JdxZMsr6mV7E6y1Tp7-wq89gd404v0Ha54zh0cjz-GQd409yT0Gq80cd7bxJxcTFkeSbXtpS3r feedback
>
> ------------------------------------------
> [...truncated 15205 lines...]
> [JENKINS] Archiving <http://cp.mcafee.com/d/2DRPoQcy0Arhohsjshsd7bxKVJd5AsYeKCYedFEI8LEFIEzzqqb8VUttdVUSCyMMOqenDAQPt21-SaGRw2z2tk94pjQ_BPpxeG4ycFWvOVLSrzJsovW_e3C1Pz7nKnjpvjV5eUUQszCumKzp5dmXzfaxVZicHs3jr9JYsrLOrb5S4TTSkPtPpesRG9px1KhW5eRrr4_U03wzkxwNefWHguDs4NrwlMNjajz-GQbSH2sp4cFefWHgKJ6JLFiIiXsjWpfoAvDB9N_lq5RERJZalynryvgLvAiUM310b30n309UhS9J3P9ufPrz0KCOMebQ87XoGHm1NxeG4ycFWvOUaFefWHjFgISgStoZGSS9_M04SCM-UedzbszQ3h0XIz_gd44E6y02fwlB2yhEw69N_lq6y04Nrwld4066zBMSMCrwnlFzdgA60zf> to org.apache.streams/streams-processor-urls/0.1-SNAPSHOT/streams-processor-urls-0.1-SNAPSHOT.jar
> Sending artifact delta relative to Streams Trunk » streams-processor-urls #95
> Archived 2 artifacts
> Archive block size is 32768
> Received 0 blocks and 31069 bytes
> Compression is 0.0%
> Took 0.18 sec
> [JENKINS] Archiving <http://cp.mcafee.com/d/1jWVIg6gUSyMyUCUyUqen3tPqqb8VUttdUsrjhohvhjph76QQmhPMWWrPNJd5xxAQsLf9FCW43ZIllH0564WEi8ODF_bCP2tk94pjQ_BPvIT7qUM_R-s7c3D6eLsKCO-DOatNNEV7cYJt6OaqJT6ul3PWApmU6CS3rUUTvASmbI9LLIFCXCOsVHkiP23szQatGSS9_M0716F31ysvRmwZeU9yT0HxyCkD7ZlEnJm4UO8pisvRmxtqdrviBoBN6BooJlnwZkYSxVAL7VJNwnjpo75W43ZIllH0UMDl2h6kZfVs5kD7ZlFQEmr8reIuRrr4_U02rjovs76NBKhW1EwtSh_E6y2k3h017MaOxh8Qg34U_GJ3h02oJMaCy033hOUrojdFPh08JzH> to org.apache.streams/streams-processor-json/0.1-SNAPSHOT/streams-processor-json-0.1-SNAPSHOT.pom
> [JENKINS] Archiving <http://cp.mcafee.com/d/1jWVIi3x8SyMyUCUyUqen3tPqqb8VUttdUsrjhohvhjph76QQmhPMWWrPNJd5xxAQsLf9FCW43ZIllH0564WEi8ODF_bCP2tk94pjQ_BPvIT7qUM_R-s7c3D6eLsKCO-DOatNNEV7cYJt6OaqJT6ul3PWApmU6CTPrUUTvASmbI9LLIFCXCOsVHkiP23szQatGSS9_M0716F31ysvRmwZeU9yT0HxyCkD7ZlEnJm4UO8pisvRmxtqdrviBoBN6BopfoAvDB9N_lq5RERJZalyn4qlwnLO9so1ww5xwbxw4Y8X4SxVAL7VJNwnjpo75W43ZIllH0UMDl2h6kZfVs5kD7ZlFQEmr8reIuRrr4_U02rjovs76NBKhW1EwtSh_E6y2k3h017MaOxh8Qg34U_GJ3h02oJMaCy033hOUrojdEnEPl0zN9dWS> to org.apache.streams/streams-processor-json/0.1-SNAPSHOT/streams-processor-json-0.1-SNAPSHOT.jar
> Sending artifact delta relative to Streams Trunk » streams-processor-json #95
> Archived 2 artifacts
> Archive block size is 32768
> Received 0 blocks and 18550 bytes
> Compression is 0.0%
> Took 0.16 sec
> [JENKINS] Archiving <http://cp.mcafee.com/d/FZsScCQm4n4T4n3hOUrKrjhp7f3HFL3zqqb2bWara8USCyOeu7njuudFEIccCzBVVdcTgwvJyGJo0EMDl2h6kZfVsSojGx8zauDYKrZCUXn67-LPwVwsUNRXBQSnQ-hjKed78VDBHEShjlKUPOEuvkzaT0QSUrv76XYCONtxdZZBcTsSjDdqymogrAuxjJmSNf-00U8R8ocjz-GQ7FT1cmU5sckOAU_GJ2ZGMD6h3ajz-GQbHhGpAxYiYqkNqGL1WFVJ3P9ufPrz0KCOMebQ87XoGHm1NxeG4ycFWvOUaFefWHjFgISgStoZGSS9_M04SCM-UedzbszQ3h0XIz_gd44E6y02fwlB2yhEw69N_lq6y04Nrwld4066zBMSMCrx04n> to org.apache.streams/streams-provider-rss/0.1-SNAPSHOT/streams-provider-rss-0.1-SNAPSHOT.pom
> [JENKINS] Archiving <http://cp.mcafee.com/d/1jWVIp3xAidEI8K9K8K6zBMTsSCyOeu7nju76QQm4nQkSkhNJd5AsYeKCYYrjhoopd7bPOqpKx0_r5lqM1hxeG4ycFWvOVIMDl2h6kZfVsTXdNSKcfZvD1P0VNzHTbFILFYyDssqehPfbnhIyCHtNDBgY-F6lK1FIsrv76XYCONtxdZZBcTsSjDdqymogrAuxjJmSNf-00U8R8ocjz-GQ7FT1cmU5sckOAU_GJ2ZGMD6h3ajz-GQbHhGpAxYiYqkOuN8_fajz-GQbHhGpAxYiYqkbTV4Kc0Mg2MM5MM2u4tyrgYOnzYSUMbFII3yZ21-SaGRwsojGx8zauDYK2Gjz-GQWkbdAdDmfqJJyvY01dFIfK3zoOT8Z0QgeX8_Q3h1a1Ew0zU5pgEAq81ysvRmxEw1cmU5jh01xEVsdI9CVqcbIVPLPX5k> to org.apache.streams/streams-provider-rss/0.1-SNAPSHOT/streams-provider-rss-0.1-SNAPSHOT.jar
> Sending artifact delta relative to Streams Trunk » streams-provider-rss #95
> Archived 2 artifacts
> Archive block size is 32768
> Received 0 blocks and 42001 bytes
> Compression is 0.0%
> Took 0.12 sec
> [JENKINS] Archiving /home/jenkins/jenkins-slave/maven-repositories/0/org/apache/streams/streams-components/0.1-SNAPSHOT/streams-components-0.1-SNAPSHOT.pom to org.apache.streams/streams-components/0.1-SNAPSHOT/streams-components-0.1-SNAPSHOT.pom
> /home/jenkins/jenkins-slave/maven-repositories/0/org/apache/streams/streams-components/0.1-SNAPSHOT/streams-components-0.1-SNAPSHOT.pom is not inside <http://cp.mcafee.com/d/FZsSd3gOcCQm4n4T4n3hOUrKrjhp7f3HFL3zqqb2bWara8USCyOeu7njuudFEIccCzBVVdcTgwvJyGJo0EMDl2h6kZfVsSojGx8zauDYKrZCUXn67-LPwVwsUNRXBQSnQ-hjKed78VDBHEShjlKUPOEuvkzaT0QSYrv76XYCONtxdZZBcTsSjDdqymogrAuxjJmSNf-00U8R8ocjz-GQ7FT1cmU5sckOAU_GJ2WWRov2tc11J3P9ufPrz0KCOMebQ87XoGHm1NxeG4ycFWvOUaFefWHjFgISgStoZGSS9_M04SCM-UedzbszQ3h0XIz_gd44E6y02fwlB2yhEw69N_lq6y04Nrwld4066zBMSMCr9XeR> will archive in a separate pass
> Sending artifact delta relative to Streams Trunk » streams-components #95
> Archived 1 artifacts
> Archive block size is 32768
> Received 0 blocks and 2305 bytes
> Compression is 0.0%
> Took 0.1 sec
> [JENKINS] Archiving <http://cp.mcafee.com/d/k-Kr41Ag43qb2byrybxEVsdTdFEIzDxRQTxNJd5x5Z5dB4srjhp7f3HFLf6QQm66jhOYYCCrEgfSNlmI0kojGx8zauDYKrc9RgAhBfj-nd-PstHz3_nVMsMesoWZOWrbWv8FT76zAsPORQr8FGTspVkffGhBrwqrd79JYsrLOrb5S4TTSkPtPpesRG9px1KhW5eRrr4_U03wzkxwNefWHguDs4NrwlMNjajz-GQbSH2sp4cFefWHgLGKyBo5ZckOAU_GJ2WTNFaAOZ6smGHMuGurgYOnzYSUMbFII3yZ21-SaGRwsojGx8zauDYK2Gjz-GQWkbdAdDmfqJJyvY01dFIfK3zoOT8Z0QgeX8_Q3h1a1Ew0zU5pgEAq81ysvRmxEw1cmU5jh01xEVsdI9CXLCm0yzmFem> to org.apache.streams/streams-persist-s3/0.1-SNAPSHOT/streams-persist-s3-0.1-SNAPSHOT.pom
> [JENKINS] Archiving <http://cp.mcafee.com/d/2DRPosrhohsjshsd7bxKVJd5AsYeKCYedFEI8LEFIEzzqqb8VUttdVUSCyMMOqenDAQPt21-SaGRw2z2tk94pjQ_BPpxeG4ycFWvOVLSrzJsovW_e3C1Pz7nKnjpvjV5eUUQszCumKzp5dmXzfaxVZicHs3jqdPrUUTvASmbI9LLIFCXCOsVHkiP23szQatGSS9_M0716F31ysvRmwZeU9yT0HxyCkD7ZlEnJm4UO8pisvRmxvlt5aMbWoFB9N_lq5RLzil9BWcVfoAvDB9N_lq5RLzil9BWcBXYyn60o81oo2Uo1f2eNdEupbN-rso5QSm1Nux0_r5lqMec9RgAhBfj-n1l9N_lqta5CO6PH7JmSNf-00CQS7T1NIprAuwq87tAvW1EwB0Qg0hY2IEkid40NefWHgQg0Cbs2FEw0MQsK6S4PpHwU> to org.apache.streams/streams-persist-s3/0.1-SNAPSHOT/streams-persist-s3-0.1-SNAPSHOT.jar
> Sending artifact delta relative to Streams Trunk » streams-persist-s3 #95
> Archived 2 artifacts
> Archive block size is 32768
> Received 0 blocks and 37434 bytes
> Compression is 0.0%
> Took 0.12 sec
> [JENKINS] Archiving /home/jenkins/jenkins-slave/maven-repositories/0/org/apache/streams/streams-runtimes/0.1-SNAPSHOT/streams-runtimes-0.1-SNAPSHOT.pom to org.apache.streams/streams-runtimes/0.1-SNAPSHOT/streams-runtimes-0.1-SNAPSHOT.pom
> /home/jenkins/jenkins-slave/maven-repositories/0/org/apache/streams/streams-runtimes/0.1-SNAPSHOT/streams-runtimes-0.1-SNAPSHOT.pom is not inside <http://cp.mcafee.com/d/1jWVIe6zqb2byrybxEVsdTdFEIzDxRQTxNJd5x5Z5dB4srjhp7f3HFLf6QQm66jhOYYCCrEgfSNlmI0kojGx8zauDYKrc9RgAhBfj-nd-PstHz3_nVMsMesoWZOWrbWv8FT76zAsPORQr8FGTspVkffGhBrwqrhhdLzzt-jpoKMC--OCrKr9PCJhbc8dOfgFSHroD_00s4qAc69N_lq3QXwCbs2K6apisvRmxubs9Ol-C0wSxVAL7VJNwnjpo75W43ZIllH0UMDl2h6kZfVs5kD7ZlFQEmr8reIuRrr4_U02rjovs76NBKhW1EwtSh_E6y2k3h017MaOxh8Qg34U_GJ3h02oJMaCy033hOUrojdye_gU3fT> will archive in a separate pass
> Sending artifact delta relative to Streams Trunk » streams-runtimes #95
> Archived 1 artifacts
> Archive block size is 32768
> Received 0 blocks and 1631 bytes
> Compression is 0.0%
> Took 0.1 sec
> [JENKINS] Archiving <http://cp.mcafee.com/d/k-Kr41EedEI8K9K8K6zBMTsSCyOeu7nju76QQm4nQkSkhNJd5AsYeKCYYrjhoopd7bPOqpKx0_r5lqM1hxeG4ycFWvOVIMDl2h6kZfVsTXdNSKcfZvD1P0VNzHTbFILFYyDssqehPfbnhIyCHtNDBgY-F6lK1FJ5cS-edTVdByX2rXXapKVIDeqR4IMwT8Z2DqJJyvY01MhGgMoD7ZlEfjK2oJMaUoFB9N_lq5Xlxecy6kD7ZlEnmzkP93UBVgFfictlNqGL1WFVJ3P9ufPrz0KCOMebQ87XoGHm1NxeG4ycFWvOUaFefWHjFgISgStoZGSS9_M04SCM-UedzbszQ3h0XIz_gd44E6y02fwlB2yhEw69N_lq6y04Nrwld4066zBMSMCrZdImhVjjpQZw> to org.apache.streams/streams-provider-instagram/0.1-SNAPSHOT/streams-provider-instagram-0.1-SNAPSHOT.pom
> [JENKINS] Archiving <http://cp.mcafee.com/d/1jWVIg4xESyMyUCUyUqen3tPqqb8VUttdUsrjhohvhjph76QQmhPMWWrPNJd5xxAQsLf9FCW43ZIllH0564WEi8ODF_bCP2tk94pjQ_BPvIT7qUM_R-s7c3D6eLsKCO-DOatNNEV7cYJt6OaqJT6ul3PWApmU6CQmjrUUTvASmbI9LLIFCXCOsVHkiP23szQatGSS9_M0716F31ysvRmwZeU9yT0HxyCkD7ZlEnJm4UO8pisvRmxtqdjcAfynB2AZ8NRn9X4zYYFefWHgKJ6FCi7NbOxiuAoWGnLO9so1ww5xwbxw4Y8X4SxVAL7VJNwnjpo75W43ZIllH0UMDl2h6kZfVs5kD7ZlFQEmr8reIuRrr4_U02rjovs76NBKhW1EwtSh_E6y2k3h017MaOxh8Qg34U_GJ3h02oJMaCy033hOUrojdR6zU> to org.apache.streams/streams-provider-instagram/0.1-SNAPSHOT/streams-provider-instagram-0.1-SNAPSHOT.jar
> Sending artifact delta relative to Streams Trunk » streams-provider-instagram #95
> Archived 2 artifacts
> Archive block size is 32768
> Received 0 blocks and 48571 bytes
> Compression is 0.0%
> Took 0.18 sec
> [JENKINS] Archiving <http://cp.mcafee.com/d/FZsS86Qm4n4T4n3hOUrKrjhp7f3HFL3zqqb2bWara8USCyOeu7njuudFEIccCzBVVdcTgwvJyGJo0EMDl2h6kZfVsSojGx8zauDYKrZCUXn67-LPwVwsUNRXBQSnQ-hjKed78VDBHEShjlKUPOEuvkzaT0QSyMrv76XYCONtxdZZBcTsSjDdqymogrAuxjJmSNf-00U8R8ocjz-GQ7FT1cmU5sckOAU_GJ2WRh6FvM-vMFaIaoJlnwZkYSxVAL7VJNwnjpo75W43ZIllH0UMDl2h6kZfVs5kD7ZlFQEmr8reIuRrr4_U02rjovs76NBKhW1EwtSh_E6y2k3h017MaOxh8Qg34U_GJ3h02oJMaCy033hOUrojdC5fS> to org.apache.streams/streams-pojo-extensions/0.1-SNAPSHOT/streams-pojo-extensions-0.1-SNAPSHOT.pom
> [JENKINS] Archiving <http://cp.mcafee.com/d/k-Kr3zqb2byrybxEVsdTdFEIzDxRQTxNJd5x5Z5dB4srjhp7f3HFLf6QQm66jhOYYCCrEgfSNlmI0kojGx8zauDYKrc9RgAhBfj-nd-PstHz3_nVMsMesoWZOWrbWv8FT76zAsPORQr8FGTspVkffGhBrwqrhvdLzzt-jpoKMC--OCrKr9PCJhbc8dOfgFSHroD_00s4qAc69N_lq3QXwCbs2K6apisvRmxtqEzkLUvfUkBm5cDIifPOAU_GJ2WRh6FvM-vMFaIa5XYyn60o81oo2Uo1f2eNdEupbN-rso5QSm1Nux0_r5lqMec9RgAhBfj-n1l9N_lqta5CO6PH7JmSNf-00CQS7T1NIprAuwq87tAvW1EwB0Qg0hY2IEkid40NefWHgQg0Cbs2FEw0MQsK6S4Pp4ozDjcNpsnu> to org.apache.streams/streams-pojo-extensions/0.1-SNAPSHOT/streams-pojo-extensions-0.1-SNAPSHOT.jar
> Sending artifact delta relative to Streams Trunk » streams-pojo-extensions #95
> Archived 2 artifacts
> Archive block size is 32768
> Received 0 blocks and 13617 bytes
> Compression is 0.0%
> Took 0.13 sec
> [JENKINS] Archiving <http://cp.mcafee.com/d/FZsSd3hJ5x5NdN5MQsK6XCQQmhPMWWrMUSCyMy-yCOyedFEIzDxRQTDzqqb339EVuujjdQ87XoGHm0ac9RgAhBfj-ndC4WEi8ODF_bC_pKeRNx_HYUeo7ectuVtdBZfAkXzzhOepVqWdAkRrKcYG7DR8OJMddEK6TNNK_9IInojvvpjdTdAVPmEBC46V7EkXlJIj_w0e2di634U_GJ1WtMj5K1n35cFefWHgKKJm7MDjajz-GQbAVPmNqGL1WFVJ3P9ufPrz0KCOMebQ87XoGHm1NxeG4ycFWvOUaFefWHjFgISgStoZGSS9_M04SCM-UedzbszQ3h0XIz_gd44E6y02fwlB2yhEw69N_lq6y04Nrwld4066zBMSMCrox7D> to org.apache.streams/streams-http/0.1-SNAPSHOT/streams-http-0.1-SNAPSHOT.pom
> [JENKINS] Archiving <http://cp.mcafee.com/d/1jWVIg4zqb2byrybxEVsdTdFEIzDxRQTxNJd5x5Z5dB4srjhp7f3HFLf6QQm66jhOYYCCrEgfSNlmI0kojGx8zauDYKrc9RgAhBfj-nd-PstHz3_nVMsMesoWZOWrbWv8FT76zAsPORQr8FGTspVkffGhBrwqrh76TNNK_9IInojvvpjdTdAVPmEBC46V7EkXlJIj_w0e2di634U_GJ1WtMj5K1n35cFefWHgKKJm7MDjajz-GQbAVPmOuN8_fajz-GQbAVPmbTV4Kc0Mg2MM5MM2u4tyrgYOnzYSUMbFII3yZ21-SaGRwsojGx8zauDYK2Gjz-GQWkbdAdDmfqJJyvY01dFIfK3zoOT8Z0QgeX8_Q3h1a1Ew0zU5pgEAq81ysvRmxEw1cmU5jh01xEVsdI9CTEX91esLjC9D> to org.apache.streams/streams-http/0.1-SNAPSHOT/streams-http-0.1-SNAPSHOT.jar
> Sending artifact delta relative to Streams Trunk » streams-http #95
> Archived 2 artifacts
> Archive block size is 32768
> Received 0 blocks and 33588 bytes
> Compression is 0.0%
> Took 0.11 sec
> [JENKINS] Archiving <http://cp.mcafee.com/d/5fHCN0q4xAgdEI8K9K8K6zBMTsSCyOeu7nju76QQm4nQkSkhNJd5AsYeKCYYrjhoopd7bPOqpKx0_r5lqM1hxeG4ycFWvOVIMDl2h6kZfVsTXdNSKcfZvD1P0VNzHTbFILFYyDssqehPfbnhIyCHtNDBgY-F6lK1FJ5US-edTVdByX2rXXapKVIDeqR4IMwT8Z2DqJJyvY01MhGgMoD7ZlEfjK2oJMaUoFB9N_lq5WQ8ObHHlxY9QPrjApBcInzV6l9NSsGMNqGL1WFVJ3P9ufPrz0KCOMebQ87XoGHm1NxeG4ycFWvOUaFefWHjFgISgStoZGSS9_M04SCM-UedzbszQ3h0XIz_gd44E6y02fwlB2yhEw69N_lq6y04Nrwld4066zBMSMCrmn-OrgCC> to org.apache.streams.osgi.components/activity-registration/0.1-SNAPSHOT/activity-registration-0.1-SNAPSHOT.pom
> [JENKINS] Archiving <http://cp.mcafee.com/d/2DRPoOrhohsjshsd7bxKVJd5AsYeKCYedFEI8LEFIEzzqqb8VUttdVUSCyMMOqenDAQPt21-SaGRw2z2tk94pjQ_BPpxeG4ycFWvOVLSrzJsovW_e3C1Pz7nKnjpvjV5eUUQszCumKzp5dmXzfaxVZicHs3jq9EVdLzzt-jpoKMC--OCrKr9PCJhbc8dOfgFSHroD_00s4qAc69N_lq3QXwCbs2K6apisvRmxuJ2cyWWRov2tcSQV6pjb5U-hBistDaIcDIifPPrjApBcInzV6l9NSsGMbTV4Kc0Mg2MM5MM2u4tyrgYOnzYSUMbFII3yZ21-SaGRwsojGx8zauDYK2Gjz-GQWkbdAdDmfqJJyvY01dFIfK3zoOT8Z0QgeX8_Q3h1a1Ew0zU5pgEAq81ysvRmxEw1cmU5jh01xEVsdI9CYSE6ae_-> to org.apache.streams.osgi.components/activity-registration/0.1-SNAPSHOT/activity-registration-0.1-SNAPSHOT.jar
> Sending artifact delta relative to Streams Trunk » activity-registration-bundle [org.apache.streams.osgi.components] #95
> Archived 2 artifacts
> Archive block size is 32768
> Received 0 blocks and 23018 bytes
> Compression is 0.0%
> Took 90 ms
> [JENKINS] Archiving <http://cp.mcafee.com/d/FZsSd3gwrhohsjshsd7bxKVJd5AsYeKCYedFEI8LEFIEzzqqb8VUttdVUSCyMMOqenDAQPt21-SaGRw2z2tk94pjQ_BPpxeG4ycFWvOVLSrzJsovW_e3C1Pz7nKnjpvjV5eUUQszCumKzp5dmXzfaxVZicHs3jqtPrUUTvASmbI9LLIFCXCOsVHkiP23szQatGSS9_M0716F31ysvRmwZeU9yT0HxyCkD7ZlEnJm4UO8pisvRmxtrUQBipvPZFelGvIr4YmGHMuGurgYOnzYSUMbFII3yZ21-SaGRwsojGx8zauDYK2Gjz-GQWkbdAdDmfqJJyvY01dFIfK3zoOT8Z0QgeX8_Q3h1a1Ew0zU5pgEAq81ysvRmxEw1cmU5jh01xEVsdI9C_vSs> to org.apache.streams/streams-persist-elasticsearch/0.1-SNAPSHOT/streams-persist-elasticsearch-0.1-SNAPSHOT.pom
> [JENKINS] Archiving <http://cp.mcafee.com/d/FZsS920s73hJ5x5NdN5MQsK6XCQQmhPMWWrMUSCyMy-yCOyedFEIzDxRQTDzqqb339EVuujjdQ87XoGHm0ac9RgAhBfj-ndC4WEi8ODF_bC_pKeRNx_HYUeo7ectuVtdBZfAkXzzhOepVqWdAkRrKcYG7DR8OJMddFECTNNK_9IInojvvpjdTdAVPmEBC46V7EkXlJIj_w0e2di634U_GJ1WtMj5K1n35cFefWHgLqI9NAgOAU_GJ2WTNFaAO_DXisHk_oS9VfoAvDB9N_lq5RLzil9B_fSAVmF-NIjbTV4Kc0Mg2MM5MM2u4tyrgYOnzYSUMbFII3yZ21-SaGRwsojGx8zauDYK2Gjz-GQWkbdAdDmfqJJyvY01dFIfK3zoOT8Z0QgeX8_Q3h1a1Ew0zU5pgEAq81ysvRmxEw1cmU5jh01xEVsdI9CQflu> to org.apache.streams/streams-persist-elasticsearch/0.1-SNAPSHOT/streams-persist-elasticsearch-0.1-SNAPSHOT.jar
> Sending artifact delta relative to Streams Trunk » streams-persist-elasticsearch #95
> Archived 2 artifacts
> Archive block size is 32768
> Received 0 blocks and 68250 bytes
> Compression is 0.0%
> Took 0.13 sec
> [JENKINS] Archiving <http://cp.mcafee.com/d/1jWVIe41AqdEI8K9K8K6zBMTsSCyOeu7nju76QQm4nQkSkhNJd5AsYeKCYYrjhoopd7bPOqpKx0_r5lqM1hxeG4ycFWvOVIMDl2h6kZfVsTXdNSKcfZvD1P0VNzHTbFILFYyDssqehPfbnhIyCHtNDBgY-F6lK1FJdcS-edTVdByX2rXXapKVIDeqR4IMwT8Z2DqJJyvY01MhGgMoD7ZlEfjK2oJMaUoFB9N_lq5Xlxecy6kD7ZlEnmzkP93UBVC9jDYsmGHMuGurgYOnzYSUMbFII3yZ21-SaGRwsojGx8zauDYK2Gjz-GQWkbdAdDmfqJJyvY01dFIfK3zoOT8Z0QgeX8_Q3h1a1Ew0zU5pgEAq81ysvRmxEw1cmU5jh01xEVsdI9CYHi8> to org.apache.streams/streams-provider-twitter/0.1-SNAPSHOT/streams-provider-twitter-0.1-SNAPSHOT.pom
> [JENKINS] Archiving <http://cp.mcafee.com/d/k-Kr6gUgdEI8K9K8K6zBMTsSCyOeu7nju76QQm4nQkSkhNJd5AsYeKCYYrjhoopd7bPOqpKx0_r5lqM1hxeG4ycFWvOVIMDl2h6kZfVsTXdNSKcfZvD1P0VNzHTbFILFYyDssqehPfbnhIyCHtNDBgY-F6lK1FJdAS-edTVdByX2rXXapKVIDeqR4IMwT8Z2DqJJyvY01MhGgMoD7ZlEfjK2oJMaUoFB9N_lq5Xlxecy6kD7ZlEnmzkP93UBVC9jDYsDIifPOAU_GJ2WQqCp8v4LcNas_ynLO9so1ww5xwbxw4Y8X4SxVAL7VJNwnjpo75W43ZIllH0UMDl2h6kZfVs5kD7ZlFQEmr8reIuRrr4_U02rjovs76NBKhW1EwtSh_E6y2k3h017MaOxh8Qg34U_GJ3h02oJMaCy033hOUrojdAota> to org.apache.streams/streams-provider-twitter/0.1-SNAPSHOT/streams-provider-twitter-0.1-SNAPSHOT.jar
> Sending artifact delta relative to Streams Trunk » streams-provider-twitter #95
> Archived 2 artifacts
> Archive block size is 32768
> Received 0 blocks and 101432 bytes
> Compression is 0.0%
> Took 0.12 sec
> [JENKINS] Archiving <http://cp.mcafee.com/d/1jWVIedEI8K9K8K6zBMTsSCyOeu7nju76QQm4nQkSkhNJd5AsYeKCYYrjhoopd7bPOqpKx0_r5lqM1hxeG4ycFWvOVIMDl2h6kZfVsTXdNSKcfZvD1P0VNzHTbFILFYyDssqehPfbnhIyCHtNDBgY-F6lK1FJdwS-edTVdByX2rXXapKVIDeqR4IMwT8Z2DqJJyvY01MhGgMoD7ZlEfjK2oJMaUoFB9N_lq5Xlxecy6kD7ZlEnmzmTQFm9ufAv3YmGHMuGurgYOnzYSUMbFII3yZ21-SaGRwsojGx8zauDYK2Gjz-GQWkbdAdDmfqJJyvY01dFIfK3zoOT8Z0QgeX8_Q3h1a1Ew0zU5pgEAq81ysvRmxEw1cmU5jh01xEVsdI9C-bUE-dqG> to org.apache.streams/streams-processor-regex/0.1-SNAPSHOT/streams-processor-regex-0.1-SNAPSHOT.pom
> [JENKINS] Archiving <http://cp.mcafee.com/d/avndzgs76Qm4n4T4n3hOUrKrjhp7f3HFL3zqqb2bWara8USCyOeu7njuudFEIccCzBVVdcTgwvJyGJo0EMDl2h6kZfVsSojGx8zauDYKrZCUXn67-LPwVwsUNRXBQSnQ-hjKed78VDBHEShjlKUPOEuvkzaT0QSC-rv76XYCONtxdZZBcTsSjDdqymogrAuxjJmSNf-00U8R8ocjz-GQ7FT1cmU5sckOAU_GJ2ZGMD6h3ajz-GQbHhHrWkH4L7Ofx-jS97VVisvRmxtqdrviBoBU-hYfbTV4Kc0Mg2MM5MM2u4tyrgYOnzYSUMbFII3yZ21-SaGRwsojGx8zauDYK2Gjz-GQWkbdAdDmfqJJyvY01dFIfK3zoOT8Z0QgeX8_Q3h1a1Ew0zU5pgEAq81ysvRmxEw1cmU5jh01xEVsdI9CQQD8u2Xr> to org.apache.streams/streams-processor-regex/0.1-SNAPSHOT/streams-processor-regex-0.1-SNAPSHOT.jar
> Sending artifact delta relative to Streams Trunk » streams-processor-regex #95
> Archived 2 artifacts
> Archive block size is 32768
> Received 0 blocks and 18139 bytes
> Compression is 0.0%
> Took 2.1 sec
> [JENKINS] Archiving <http://cp.mcafee.com/d/2DRPoArhohsjshsd7bxKVJd5AsYeKCYedFEI8LEFIEzzqqb8VUttdVUSCyMMOqenDAQPt21-SaGRw2z2tk94pjQ_BPpxeG4ycFWvOVLSrzJsovW_e3C1Pz7nKnjpvjV5eUUQszCumKzp5dmXzfaxVZicHs3jqrxJYsrLOrb5S4TTSkPtPpesRG9px1KhW5eRrr4_U03wzkxwNefWHguDs4NrwlMNjajz-GQbHl4qUJlnwZkYSxVAL7VJNwnjpo75W43ZIllH0UMDl2h6kZfVs5kD7ZlFQEmr8reIuRrr4_U02rjovs76NBKhW1EwtSh_E6y2k3h017MaOxh8Qg34U_GJ3h02oJMaCy033hOUrojdJ_NcPi_XISt7> to org.apache.streams/streams-pojo/0.1-SNAPSHOT/streams-pojo-0.1-SNAPSHOT.pom
> [JENKINS] Archiving <http://cp.mcafee.com/d/avndzgArhohsjshsd7bxKVJd5AsYeKCYedFEI8LEFIEzzqqb8VUttdVUSCyMMOqenDAQPt21-SaGRw2z2tk94pjQ_BPpxeG4ycFWvOVLSrzJsovW_e3C1Pz7nKnjpvjV5eUUQszCumKzp5dmXzfaxVZicHs3jqoUS-edTVdByX2rXXapKVIDeqR4IMwT8Z2DqJJyvY01MhGgMoD7ZlEfjK2oJMaUoFB9N_lq5RGydsDIifPOAU_GJ2WRh6Fu_8BNw620m60K60jMzIjq7CiYvCT61tdBwsnEgfSNlmI3z2tk94pjQ_BMlisvRmDixpIxIWNXlJIj_w09JdxZMsr6mV7E6y1Tp7-wq89gd404v0Ha54zh0cjz-GQd409yT0Gq80cd7bxJxcT8jg8HOnSdH8> to org.apache.streams/streams-pojo/0.1-SNAPSHOT/streams-pojo-0.1-SNAPSHOT.jar
> Sending artifact delta relative to Streams Trunk » streams-pojo #95
> Archived 2 artifacts
> Archive block size is 32768
> Received 0 blocks and 111833 bytes
> Compression is 0.0%
> Took 0.2 sec
> [JENKINS] Archiving /home/jenkins/jenkins-slave/maven-repositories/0/org/apache/streams/streams-amazon-aws/0.1-SNAPSHOT/streams-amazon-aws-0.1-SNAPSHOT.pom to org.apache.streams/streams-amazon-aws/0.1-SNAPSHOT/streams-amazon-aws-0.1-SNAPSHOT.pom
> /home/jenkins/jenkins-slave/maven-repositories/0/org/apache/streams/streams-amazon-aws/0.1-SNAPSHOT/streams-amazon-aws-0.1-SNAPSHOT.pom is not inside <http://cp.mcafee.com/d/1jWVIg6x8g6zqb2byrybxEVsdTdFEIzDxRQTxNJd5x5Z5dB4srjhp7f3HFLf6QQm66jhOYYCCrEgfSNlmI0kojGx8zauDYKrc9RgAhBfj-nd-PstHz3_nVMsMesoWZOWrbWv8FT76zAsPORQr8FGTspVkffGhBrwqrjudLzzt-jpoKMC--OCrKr9PCJhbc8dOfgFSHroD_00s4qAc69N_lq3QXwCbs2K6apisvRmxuRojz8xB9N_lq5ZlQkH0LFyC0wSxVAL7VJNwnjpo75W43ZIllH0UMDl2h6kZfVs5kD7ZlFQEmr8reIuRrr4_U02rjovs76NBKhW1EwtSh_E6y2k3h017MaOxh8Qg34U_GJ3h02oJMaCy033hOUrojdDQud> will archive in a separate pass
> Sending artifact delta relative to Streams Trunk » streams-amazon-aws #95
> Archived 1 artifacts
> Archive block size is 32768
> Received 0 blocks and 2492 bytes
> Compression is 0.0%
> Took 0.11 sec
> [JENKINS] Archiving /home/jenkins/jenkins-slave/maven-repositories/0/org/apache/streams/build/compiled-bundle-settings/0.1-SNAPSHOT/compiled-bundle-settings-0.1-SNAPSHOT.pom to org.apache.streams.build/compiled-bundle-settings/0.1-SNAPSHOT/compiled-bundle-settings-0.1-SNAPSHOT.pom
> /home/jenkins/jenkins-slave/maven-repositories/0/org/apache/streams/build/compiled-bundle-settings/0.1-SNAPSHOT/compiled-bundle-settings-0.1-SNAPSHOT.pom is not inside <http://cp.mcafee.com/d/k-Kr6wUe43qb2byrybxEVsdTdFEIzDxRQTxNJd5x5Z5dB4srjhp7f3HFLf6QQm66jhOYYCCrEgfSNlmI0kojGx8zauDYKrc9RgAhBfj-nd-PstHz3_nVMsMesoWZOWrbWv8FT76zAsPORQr8FGTspVkffGhBrwqrjd79JYsrLOrb5S4TTSkPtPpesRG9px1KhW5eRrr4_U03wzkxwNefWHguDs4NrwlMNj5GGQNtqh_Eo23q7CiYvCT61tdBwsnEgfSNlmI3z2tk94pjQ_BMlisvRmDixpIxIWNXlJIj_w09JdxZMsr6mV7E6y1Tp7-wq89gd404v0Ha54zh0cjz-GQd409yT0Gq80cd7bxJxcTZw7qyXy> will archive in a separate pass
> Sending artifact delta relative to Streams Trunk » apache-streams - bundle instructions #95
> Archived 1 artifacts
> Archive block size is 32768
> Received 0 blocks and 3004 bytes
> Compression is 0.0%
> Took 81 ms
> [JENKINS] Archiving <http://cp.mcafee.com/d/k-Kr4wUp3zqb2byrybxEVsdTdFEIzDxRQTxNJd5x5Z5dB4srjhp7f3HFLf6QQm66jhOYYCCrEgfSNlmI0kojGx8zauDYKrc9RgAhBfj-nd-PstHz3_nVMsMesoWZOWrbWv8FT76zAsPORQr8FGTspVkffGhBrwqrpKrv76XYCONtxdZZBcTsSjDdqymogrAuxjJmSNf-00U8R8ocjz-GQ7FT1cmU5sckOAU_GJ2ZGMD6h3ajz-GQbHhGpAxYiV64BI8MAInZ2NsJlKrp3YmGHMuGurgYOnzYSUMbFII3yZ21-SaGRwsojGx8zauDYK2Gjz-GQWkbdAdDmfqJJyvY01dFIfK3zoOT8Z0QgeX8_Q3h1a1Ew0zU5pgEAq81ysvRmxEw1cmU5jh01xEVsdI9CYAApe4_A> to org.apache.streams/gnip-edc-youtube/0.1-SNAPSHOT/gnip-edc-youtube-0.1-SNAPSHOT.pom
> [JENKINS] Archiving <http://cp.mcafee.com/d/5fHCNAe6h0pdEI8K9K8K6zBMTsSCyOeu7nju76QQm4nQkSkhNJd5AsYeKCYYrjhoopd7bPOqpKx0_r5lqM1hxeG4ycFWvOVIMDl2h6kZfVsTXdNSKcfZvD1P0VNzHTbFILFYyDssqehPfbnhIyCHtNDBgY-F6lK1FJB4S-edTVdByX2rXXapKVIDeqR4IMwT8Z2DqJJyvY01MhGgMoD7ZlEfjK2oJMaUoFB9N_lq5Xlxecy6kD7ZlEnmzkP93UBOc9bohx9oLW5yVqHsSO7VfoAvDx64By_EmbBGJPr8unLO9so1ww5xwbxw4Y8X4SxVAL7VJNwnjpo75W43ZIllH0UMDl2h6kZfVs5kD7ZlFQEmr8reIuRrr4_U02rjovs76NBKhW1EwtSh_E6y2k3h017MaOxh8Qg34U_GJ3h02oJMaCy033hOUrojdRWOBR8DxvYJv> to org.apache.streams/gnip-edc-youtube/0.1-SNAPSHOT/gnip-edc-youtube-0.1-SNAPSHOT.jar
> Sending artifact delta relative to Streams Trunk » gnip-edc-youtube #95
> Archived 2 artifacts
> Archive block size is 32768
> Received 0 blocks and 13629 bytes
> Compression is 0.0%
> Took 0.1 sec
> [JENKINS] Archiving <http://cp.mcafee.com/d/k-Kr6jqb2byrybxEVsdTdFEIzDxRQTxNJd5x5Z5dB4srjhp7f3HFLf6QQm66jhOYYCCrEgfSNlmI0kojGx8zauDYKrc9RgAhBfj-nd-PstHz3_nVMsMesoWZOWrbWv8FT76zAsPORQr8FGTspVkffGhBrwqrpjdLzzt-jpoKMC--OCrKr9PCJhbc8dOfgFSHroD_00s4qAc69N_lq3QXwCbs2K6apisvRmxubs9Ol-CkD7ZlEnyT2sBvbDRJF-bllUflfdEupbN-rso5QSm1Nux0_r5lqMec9RgAhBfj-n1l9N_lqta5CO6PH7JmSNf-00CQS7T1NIprAuwq87tAvW1EwB0Qg0hY2IEkid40NefWHgQg0Cbs2FEw0MQsK6S4PqdIjCoizvM33> to org.apache.streams/streams-runtime-local/0.1-SNAPSHOT/streams-runtime-local-0.1-SNAPSHOT.pom
> [JENKINS] Archiving <http://cp.mcafee.com/d/1jWVIe4xEq6jqb2byrybxEVsdTdFEIzDxRQTxNJd5x5Z5dB4srjhp7f3HFLf6QQm66jhOYYCCrEgfSNlmI0kojGx8zauDYKrc9RgAhBfj-nd-PstHz3_nVMsMesoWZOWrbWv8FT76zAsPORQr8FGTspVkffGhBrwqrppdLzzt-jpoKMC--OCrKr9PCJhbc8dOfgFSHroD_00s4qAc69N_lq3QXwCbs2K6apisvRmxubs9Ol-CkD7ZlEnyT2sBvbDRJF-jS97VVisvRmxubs9OlYKvmSDBXYyn60o81oo2Uo1f2eNdEupbN-rso5QSm1Nux0_r5lqMec9RgAhBfj-n1l9N_lqta5CO6PH7JmSNf-00CQS7T1NIprAuwq87tAvW1EwB0Qg0hY2IEkid40NefWHgQg0Cbs2FEw0MQsK6S4PpVDjxD0l_4OK> to org.apache.streams/streams-runtime-local/0.1-SNAPSHOT/streams-runtime-local-0.1-SNAPSHOT.jar
> [JENKINS] Archiving <http://cp.mcafee.com/d/1jWVIp410SyMyUCUyUqen3tPqqb8VUttdUsrjhohvhjph76QQmhPMWWrPNJd5xxAQsLf9FCW43ZIllH0564WEi8ODF_bCP2tk94pjQ_BPvIT7qUM_R-s7c3D6eLsKCO-DOatNNEV7cYJt6OaqJT6ul3PWApmU6CSm3rUUTvASmbI9LLIFCXCOsVHkiP23szQatGSS9_M0716F31ysvRmwZeU9yT0HxyCkD7ZlEnyT2sBvFB9N_lq5UJMD9nOVZrqvAZyh-ukD7ZlEnyT2sBvbDRJFVu_8BNw620m60K60inDZ9QUhS9J3P9ufPrz0KCOMebQ87XoGHm1NxeG4ycFWvOUaFefWHjFgISgStoZGSS9_M04SCM-UedzbszQ3h0XIz_gd44E6y02fwlB2yhEw69N_lq6y04Nrwld4066zBMSMCrTs2Q> to org.apache.streams/streams-runtime-local/0.1-SNAPSHOT/streams-runtime-local-0.1-SNAPSHOT-tests.jar
> Sending artifact delta relative to Streams Trunk » streams-runtime-local #95
> Archived 3 artifacts
> Archive block size is 32768
> Received 0 blocks and 125894 bytes
> Compression is 0.0%
> Took 0.19 sec
> [JENKINS] Archiving /home/jenkins/jenkins-slave/maven-repositories/0/org/apache/streams/streams-contrib/0.1-SNAPSHOT/streams-contrib-0.1-SNAPSHOT.pom to org.apache.streams/streams-contrib/0.1-SNAPSHOT/streams-contrib-0.1-SNAPSHOT.pom
> /home/jenkins/jenkins-slave/maven-repositories/0/org/apache/streams/streams-contrib/0.1-SNAPSHOT/streams-contrib-0.1-SNAPSHOT.pom is not inside <http://cp.mcafee.com/d/k-Kr6x0SyMyUCUyUqen3tPqqb8VUttdUsrjhohvhjph76QQmhPMWWrPNJd5xxAQsLf9FCW43ZIllH0564WEi8ODF_bCP2tk94pjQ_BPvIT7qUM_R-s7c3D6eLsKCO-DOatNNEV7cYJt6OaqJT6ul3PWApmU6CSnPrUUTvASmbI9LLIFCXCOsVHkiP23szQatGSS9_M0716F31ysvRmwZeU9yT0HxyCkD7ZlEnJm4UO8o23q7CiYvCT61tdBwsnEgfSNlmI3z2tk94pjQ_BMlisvRmDixpIxIWNXlJIj_w09JdxZMsr6mV7E6y1Tp7-wq89gd404v0Ha54zh0cjz-GQd409yT0Gq80cd7bxJxcSipE7TUd1Ego> will archive in a separate pass
> Sending artifact delta relative to Streams Trunk » streams-contrib #95
> Archived 1 artifacts
> Archive block size is 32768
> Received 0 blocks and 3453 bytes
> Compression is 0.0%
> Took 85 ms
> [JENKINS] Archiving <http://cp.mcafee.com/d/k-Kr6hEi6zqb2byrybxEVsdTdFEIzDxRQTxNJd5x5Z5dB4srjhp7f3HFLf6QQm66jhOYYCCrEgfSNlmI0kojGx8zauDYKrc9RgAhBfj-nd-PstHz3_nVMsMesoWZOWrbWv8FT76zAsPORQr8FGTspVkffGhBrwqrpsdLzzt-jpoKMC--OCrKr9PCJhbc8dOfgFSHroD_00s4qAc69N_lq3QXwCbs2K6apisvRmxtmI9jH6k2ebllUflfdEupbN-rso5QSm1Nux0_r5lqMec9RgAhBfj-n1l9N_lqta5CO6PH7JmSNf-00CQS7T1NIprAuwq87tAvW1EwB0Qg0hY2IEkid40NefWHgQg0Cbs2FEw0MQsK6S4Po362b1Qwmijg> to org.apache.streams/streams-monitoring/0.1-SNAPSHOT/streams-monitoring-0.1-SNAPSHOT.pom
> [JENKINS] Archiving <http://cp.mcafee.com/d/5fHCN8SyMyUCUyUqen3tPqqb8VUttdUsrjhohvhjph76QQmhPMWWrPNJd5xxAQsLf9FCW43ZIllH0564WEi8ODF_bCP2tk94pjQ_BPvIT7qUM_R-s7c3D6eLsKCO-DOatNNEV7cYJt6OaqJT6ul3PWApmU6CShNJYsrLOrb5S4TTSkPtPpesRG9px1KhW5eRrr4_U03wzkxwNefWHguDs4NrwlMNjajz-GQbGRxatoOwhOuN8_fajz-GQbGRxatoOwhbTV4Kc0Mg2MM5MM2u4tyrgYOnzYSUMbFII3yZ21-SaGRwsojGx8zauDYK2Gjz-GQWkbdAdDmfqJJyvY01dFIfK3zoOT8Z0QgeX8_Q3h1a1Ew0zU5pgEAq81ysvRmxEw1cmU5jh01xEVsdI9CTdxm7ddd> to org.apache.streams/streams-monitoring/0.1-SNAPSHOT/streams-monitoring-0.1-SNAPSHOT.jar
> Sending artifact delta relative to Streams Trunk » streams-monitoring #95
> Archived 2 artifacts
> Archive block size is 32768
> Received 0 blocks and 38482 bytes
> Compression is 0.0%
> Took 91 ms
> [JENKINS] Archiving /home/jenkins/jenkins-slave/maven-repositories/0/org/apache/streams/streams-project/0.1-SNAPSHOT/streams-project-0.1-SNAPSHOT.pom to org.apache.streams/streams-project/0.1-SNAPSHOT/streams-project-0.1-SNAPSHOT.pom
> /home/jenkins/jenkins-slave/maven-repositories/0/org/apache/streams/streams-project/0.1-SNAPSHOT/streams-project-0.1-SNAPSHOT.pom is not inside <http://cp.mcafee.com/d/2DRPosrhohsjshsd7bxKVJd5AsYeKCYedFEI8LEFIEzzqqb8VUttdVUSCyMMOqenDAQPt21-SaGRw2z2tk94pjQ_BPpxeG4ycFWvOVLSrzJsovW_e3C1Pz7nKnjpvjV5eUUQszCumKzp5dmXzfaxVZicHs3jrbNJYsrLOrb5S4TTSkPtPpesRG9px1KhW5eRrr4_U03wzkxwNefWHguDs4NrwlMNj0grgYOnzYSUMbFII3yZ21-SaGRwsojGx8zauDYK2Gjz-GQWkbdAdDmfqJJyvY01dFIfK3zoOT8Z0QgeX8_Q3h1a1Ew0zU5pgEAq81ysvRmxEw1cmU5jh01xEVsdI9CNwEZOG0k> will archive in a separate pass
> Sending artifact delta relative to Streams Trunk » Apache Streams Project #95
> Archived 1 artifacts
> Archive block size is 32768
> Received 0 blocks and 18632 bytes
> Compression is 0.0%
> Took 74 ms
> [JENKINS] Archiving <http://cp.mcafee.com/d/5fHCN8SyMyUCUyUqen3tPqqb8VUttdUsrjhohvhjph76QQmhPMWWrPNJd5xxAQsLf9FCW43ZIllH0564WEi8ODF_bCP2tk94pjQ_BPvIT7qUM_R-s7c3D6eLsKCO-DOatNNEV7cYJt6OaqJT6ul3PWApmU6CSjhOrv76XYCONtxdZZBcTsSjDdqymogrAuxjJmSNf-00U8R8ocjz-GQ7FT1cmU5sckOAU_GJ2Zq4p5RRGM-4WpisvRmxttqIfxexvjPYDIifPN3RLwxYb5yYvgrJW1tqGL1WFVJ3P9ufPrz0KCOMebQ87XoGHm1NxeG4ycFWvOUaFefWHjFgISgStoZGSS9_M04SCM-UedzbszQ3h0XIz_gd44E6y02fwlB2yhEw69N_lq6y04Nrwld4066zBMSMCrD9TYYbO_juT9> to org.apache.streams.osgi.components/streams-components-all/0.1-SNAPSHOT/streams-components-all-0.1-SNAPSHOT.pom
> [JENKINS] Archiving <http://cp.mcafee.com/d/avndxMw96Qm4n4T4n3hOUrKrjhp7f3HFL3zqqb2bWara8USCyOeu7njuudFEIccCzBVVdcTgwvJyGJo0EMDl2h6kZfVsSojGx8zauDYKrZCUXn67-LPwVwsUNRXBQSnQ-hjKed78VDBHEShjlKUPOEuvkzaT0QSNsS-edTVdByX2rXXapKVIDeqR4IMwT8Z2DqJJyvY01MhGgMoD7ZlEfjK2oJMaUoFB9N_lq5WQ8ObHHlxY9QOAU_GJ2WWRov2t2-DDVfoAvDB9N_lq5RRGM-4W5ZffbTV4Kc0Mg2MM5MM2u4tyrgYOnzYSUMbFII3yZ21-SaGRwsojGx8zauDYK2Gjz-GQWkbdAdDmfqJJyvY01dFIfK3zoOT8Z0QgeX8_Q3h1a1Ew0zU5pgEAq81ysvRmxEw1cmU5jh01xEVsdI9C-Q9rlg98UWwh> to org.apache.streams.osgi.components/streams-components-all/0.1-SNAPSHOT/streams-components-all-0.1-SNAPSHOT.jar
> Sending artifact delta relative to Streams Trunk » Apache Streams Components All #95
> Archived 2 artifacts
> Archive block size is 32768
> Received 130 blocks and 57568006 bytes
> Compression is 6.9%
> Took 34 sec
> [JENKINS] Archiving <http://cp.mcafee.com/d/2DRPoOd20scCQm4n4T4n3hOUrKrjhp7f3HFL3zqqb2bWara8USCyOeu7njuudFEIccCzBVVdcTgwvJyGJo0EMDl2h6kZfVsSojGx8zauDYKrZCUXn67-LPwVwsUNRXBQSnQ-hjKed78VDBHEShjlKUPOEuvkzaT0QSMyrv76XYCONtxdZZBcTsSjDdqymogrAuxjJmSNf-00U8R8ocjz-GQ7FT1cmU5sckOAU_GJ2ZGMD6h3ajz-GQbHhHrWkH4KJZlz_mSs_z35GGY7GDCQfcBU_dKc2Wrb0ULgwvJyGJo764WEi8ODF_bwGAU_GJeB2Pp3pRzSHroD_00jqr3XwUScJOfgd43KOfZ0Qgiwq808-1mka96y0oD7ZlEq80j5K1kQg0oqen3r2pKeyhecLP> to org.apache.streams/streams-processor-peoplepattern/0.1-SNAPSHOT/streams-processor-peoplepattern-0.1-SNAPSHOT.pom
> [JENKINS] Archiving <http://cp.mcafee.com/d/1jWVIpdEI8K9K8K6zBMTsSCyOeu7nju76QQm4nQkSkhNJd5AsYeKCYYrjhoopd7bPOqpKx0_r5lqM1hxeG4ycFWvOVIMDl2h6kZfVsTXdNSKcfZvD1P0VNzHTbFILFYyDssqehPfbnhIyCHtNDBgY-F6lK1FJxcS-edTVdByX2rXXapKVIDeqR4IMwT8Z2DqJJyvY01MhGgMoD7ZlEfjK2oJMaUoFB9N_lq5Xlxecy6kD7ZlEnmzmTQFm9trWH7-JIV_66jS97VVisvRmxtqdrviBoBRLGIvWSPDYo5XYyn60o81oo2Uo1f2eNdEupbN-rso5QSm1Nux0_r5lqMec9RgAhBfj-n1l9N_lqta5CO6PH7JmSNf-00CQS7T1NIprAuwq87tAvW1EwB0Qg0hY2IEkid40NefWHgQg0Cbs2FEw0MQsK6S4PrQ4fYNeY> to org.apache.streams/streams-processor-peoplepattern/0.1-SNAPSHOT/streams-processor-peoplepattern-0.1-SNAPSHOT.jar
> Sending artifact delta relative to Streams Trunk » streams-processor-peoplepattern #95
> Archived 2 artifacts
> Archive block size is 32768
> Received 0 blocks and 31813 bytes
> Compression is 0.0%
> Took 82 ms
> [JENKINS] Archiving <http://cp.mcafee.com/d/FZsSczgArhohsjshsd7bxKVJd5AsYeKCYedFEI8LEFIEzzqqb8VUttdVUSCyMMOqenDAQPt21-SaGRw2z2tk94pjQ_BPpxeG4ycFWvOVLSrzJsovW_e3C1Pz7nKnjpvjV5eUUQszCumKzp5dmXzfaxVZicHs3jr39JYsrLOrb5S4TTSkPtPpesRG9px1KhW5eRrr4_U03wzkxwNefWHguDs4NrwlMNjajz-GQbSH2sp4cFefWHgKJ6FCi7NbAqR8D_x6Ji9_BOaNXtcmGHMuGurgYOnzYSUMbFII3yZ21-SaGRwsojGx8zauDYK2Gjz-GQWkbdAdDmfqJJyvY01dFIfK3zoOT8Z0QgeX8_Q3h1a1Ew0zU5pgEAq81ysvRmxEw1cmU5jh01xEVsdI9CYVZgzGFbrAfv> to org.apache.streams/google-gplus/0.1-SNAPSHOT/google-gplus-0.1-SNAPSHOT.pom
> [JENKINS] Archiving <http://cp.mcafee.com/d/1jWVIgdEI8K9K8K6zBMTsSCyOeu7nju76QQm4nQkSkhNJd5AsYeKCYYrjhoopd7bPOqpKx0_r5lqM1hxeG4ycFWvOVIMDl2h6kZfVsTXdNSKcfZvD1P0VNzHTbFILFYyDssqehPfbnhIyCHtNDBgY-F6lK1FJxwS-edTVdByX2rXXapKVIDeqR4IMwT8Z2DqJJyvY01MhGgMoD7ZlEfjK2oJMaUoFB9N_lq5Xlxecy6kD7ZlEnmzkP93UBOdqAj_MzmF4_OV5oZKCjS97VUhHkyvVsyIuTgLvAiUM310b30n309UhS9J3P9ufPrz0KCOMebQ87XoGHm1NxeG4ycFWvOUaFefWHjFgISgStoZGSS9_M04SCM-UedzbszQ3h0XIz_gd44E6y02fwlB2yhEw69N_lq6y04Nrwld4066zBMSMCr8ZyLbugc> to org.apache.streams/google-gplus/0.1-SNAPSHOT/google-gplus-0.1-SNAPSHOT.jar
> Sending artifact delta relative to Streams Trunk » google-gplus #95
> Archived 2 artifacts
> Archive block size is 32768
> Received 0 blocks and 56114 bytes
> Compression is 0.0%
> Took 84 ms
> [JENKINS] Archiving /home/jenkins/jenkins-slave/maven-repositories/0/org/apache/streams/streams-provider-gnip/0.1-SNAPSHOT/streams-provider-gnip-0.1-SNAPSHOT.pom to org.apache.streams/streams-provider-gnip/0.1-SNAPSHOT/streams-provider-gnip-0.1-SNAPSHOT.pom
> /home/jenkins/jenkins-slave/maven-repositories/0/org/apache/streams/streams-provider-gnip/0.1-SNAPSHOT/streams-provider-gnip-0.1-SNAPSHOT.pom is not inside <http://cp.mcafee.com/d/avndz8O96Qm4n4T4n3hOUrKrjhp7f3HFL3zqqb2bWara8USCyOeu7njuudFEIccCzBVVdcTgwvJyGJo0EMDl2h6kZfVsSojGx8zauDYKrZCUXn67-LPwVwsUNRXBQSnQ-hjKed78VDBHEShjlKUPOEuvkzaT0QSM-rv76XYCONtxdZZBcTsSjDdqymogrAuxjJmSNf-00U8R8ocjz-GQ7FT1cmU5sckOAU_GJ2ZGMD6h3ajz-GQbHhGpAxYiV64BI11J3P9ufPrz0KCOMebQ87XoGHm1NxeG4ycFWvOUaFefWHjFgISgStoZGSS9_M04SCM-UedzbszQ3h0XIz_gd44E6y02fwlB2yhEw69N_lq6y04Nrwld4066zBMSMCr_1bLMzs> will archive in a separate pass
> Sending artifact delta relative to Streams Trunk » streams-provider-gnip #95
> Archived 1 artifacts
> Archive block size is 32768
> Received 0 blocks and 1771 bytes
> Compression is 0.0%
> Took 75 ms
> [JENKINS] Archiving <http://cp.mcafee.com/d/k-Kr6x0q6zqb2byrybxEVsdTdFEIzDxRQTxNJd5x5Z5dB4srjhp7f3HFLf6QQm66jhOYYCCrEgfSNlmI0kojGx8zauDYKrc9RgAhBfj-nd-PstHz3_nVMsMesoWZOWrbWv8FT76zAsPORQr8FGTspVkffGhBrwqrosdLzzt-jpoKMC--OCrKr9PCJhbc8dOfgFSHroD_00s4qAc69N_lq3QXwCbs2K6apisvRmxuRojz8xB9N_lq5RLzil9BOq3JcmGHMuGurgYOnzYSUMbFII3yZ21-SaGRwsojGx8zauDYK2Gjz-GQWkbdAdDmfqJJyvY01dFIfK3zoOT8Z0QgeX8_Q3h1a1Ew0zU5pgEAq81ysvRmxEw1cmU5jh01xEVsdI9CQmPp8-4P> to org.apache.streams/streams-persist-hdfs/0.1-SNAPSHOT/streams-persist-hdfs-0.1-SNAPSHOT.pom
> [JENKINS] Archiving <http://cp.mcafee.com/d/1jWVIp6zqb2byrybxEVsdTdFEIzDxRQTxNJd5x5Z5dB4srjhp7f3HFLf6QQm66jhOYYCCrEgfSNlmI0kojGx8zauDYKrc9RgAhBfj-nd-PstHz3_nVMsMesoWZOWrbWv8FT76zAsPORQr8FGTspVkffGhBrwqro76TNNK_9IInojvvpjdTdAVPmEBC46V7EkXlJIj_w0e2di634U_GJ1WtMj5K1n35cFefWHgLqI9NAgOAU_GJ2WTNFaAOVd1SCjS97VVisvRmxtrUQBipsCwXgLvAiUM310b30n309UhS9J3P9ufPrz0KCOMebQ87XoGHm1NxeG4ycFWvOUaFefWHjFgISgStoZGSS9_M04SCM-UedzbszQ3h0XIz_gd44E6y02fwlB2yhEw69N_lq6y04Nrwld4066zBMSMCrslZY> to org.apache.streams/streams-persist-hdfs/0.1-SNAPSHOT/streams-persist-hdfs-0.1-SNAPSHOT.jar
> Sending artifact delta relative to Streams Trunk » streams-persist-hdfs #95
> Archived 2 artifacts
> Archive block size is 32768
> Received 0 blocks and 36925 bytes
> Compression is 0.0%
> Took 97 ms
> [JENKINS] Archiving <http://cp.mcafee.com/d/1jWVIp4wUe6jqb2byrybxEVsdTdFEIzDxRQTxNJd5x5Z5dB4srjhp7f3HFLf6QQm66jhOYYCCrEgfSNlmI0kojGx8zauDYKrc9RgAhBfj-nd-PstHz3_nVMsMesoWZOWrbWv8FT76zAsPORQr8FGTspVkffGhBrwqroudLzzt-jpoKMC--OCrKr9PCJhbc8dOfgFSHroD_00s4qAc69N_lq3QXwCbs2K6apisvRmxuRojz8xB9N_lq5RLzil9BXlxiF_UJlnwZkYSxVAL7VJNwnjpo75W43ZIllH0UMDl2h6kZfVs5kD7ZlFQEmr8reIuRrr4_U02rjovs76NBKhW1EwtSh_E6y2k3h017MaOxh8Qg34U_GJ3h02oJMaCy033hOUrojdZnCi> to org.apache.streams/streams-persist-console/0.1-SNAPSHOT/streams-persist-console-0.1-SNAPSHOT.pom
> [JENKINS] Archiving <http://cp.mcafee.com/d/avndzhJ5x5NdN5MQsK6XCQQmhPMWWrMUSCyMy-yCOyedFEIzDxRQTDzqqb339EVuujjdQ87XoGHm0ac9RgAhBfj-ndC4WEi8ODF_bC_pKeRNx_HYUeo7ectuVtdBZfAkXzzhOepVqWdAkRrKcYG7DR8OJMddI6zAS-edTVdByX2rXXapKVIDeqR4IMwT8Z2DqJJyvY01MhGgMoD7ZlEfjK2oJMaUoFB9N_lq5Xlxecy6kD7ZlEnm-d9kCnJm5aD_AZyh-ukD7ZlEnm-d9kCnJm5aD-nLO9so1ww5xwbxw4Y8X4SxVAL7VJNwnjpo75W43ZIllH0UMDl2h6kZfVs5kD7ZlFQEmr8reIuRrr4_U02rjovs76NBKhW1EwtSh_E6y2k3h017MaOxh8Qg34U_GJ3h02oJMaCy033hOUrojdz5gjpzpirJf0> to org.apache.streams/streams-persist-console/0.1-SNAPSHOT/streams-persist-console-0.1-SNAPSHOT.jar
> Sending artifact delta relative to Streams Trunk » streams-persist-console #95
> Archived 2 artifacts
> Archive block size is 32768
> Received 0 blocks and 15358 bytes
> Compression is 0.0%
> Took 82 ms
> [JENKINS] Archiving <http://cp.mcafee.com/d/k-Kr6xAp4wUSyMyUCUyUqen3tPqqb8VUttdUsrjhohvhjph76QQmhPMWWrPNJd5xxAQsLf9FCW43ZIllH0564WEi8ODF_bCP2tk94pjQ_BPvIT7qUM_R-s7c3D6eLsKCO-DOatNNEV7cYJt6OaqJT6ul3PWApmU6CTXCTNNK_9IInojvvpjdTdAVPmEBC46V7EkXlJIj_w0e2di634U_GJ1WtMj5K1n35cFefWHgLmx6httqIfxeCrqszcFByZGMESHYsmGHMuGurgYOnzYSUMbFII3yZ21-SaGRwsojGx8zauDYK2Gjz-GQWkbdAdDmfqJJyvY01dFIfK3zoOT8Z0QgeX8_Q3h1a1Ew0zU5pgEAq81ysvRmxEw1cmU5jh01xEVsdI9CWp_vMJPz> to org.apache.streams.osgi.components/activity-consumer/0.1-SNAPSHOT/activity-consumer-0.1-SNAPSHOT.pom
> [JENKINS] Archiving <http://cp.mcafee.com/d/2DRPos91NJ5x5NdN5MQsK6XCQQmhPMWWrMUSCyMy-yCOyedFEIzDxRQTDzqqb339EVuujjdQ87XoGHm0ac9RgAhBfj-ndC4WEi8ODF_bC_pKeRNx_HYUeo7ectuVtdBZfAkXzzhOepVqWdAkRrKcYG7DR8OJMddLECTNNK_9IInojvvpjdTdAVPmEBC46V7EkXlJIj_w0e2di634U_GJ1WtMj5K1n35cFefWHgLmx6httqIfxeCrqszcFByZGMESHYsDIifPPrjApBcInJm56RvynLO9so1ww5xwbxw4Y8X4SxVAL7VJNwnjpo75W43ZIllH0UMDl2h6kZfVs5kD7ZlFQEmr8reIuRrr4_U02rjovs76NBKhW1EwtSh_E6y2k3h017MaOxh8Qg34U_GJ3h02oJMaCy033hOUrojdN7PWtaU6> to org.apache.streams.osgi.components/activity-consumer/0.1-SNAPSHOT/activity-consumer-0.1-SNAPSHOT.jar
> Sending artifact delta relative to Streams Trunk » activity-consumer-bundle [org.apache.streams.osgi.components.activityconsumer] #95
> Archived 2 artifacts
> Archive block size is 32768
> Received 0 blocks and 25028 bytes
> Compression is 0.0%
> Took 0.14 sec
> [JENKINS] Archiving <http://cp.mcafee.com/d/k-Kr43qb2byrybxEVsdTdFEIzDxRQTxNJd5x5Z5dB4srjhp7f3HFLf6QQm66jhOYYCCrEgfSNlmI0kojGx8zauDYKrc9RgAhBfj-nd-PstHz3_nVMsMesoWZOWrbWv8FT76zAsPORQr8FGTspVkffGhBrwqrvjdLzzt-jpoKMC--OCrKr9PCJhbc8dOfgFSHroD_00s4qAc69N_lq3QXwCbs2K6apisvRmxuRojz8xB9N_lq5RERcOg-9t3pXijIYmGHMuGurgYOnzYSUMbFII3yZ21-SaGRwsojGx8zauDYK2Gjz-GQWkbdAdDmfqJJyvY01dFIfK3zoOT8Z0QgeX8_Q3h1a1Ew0zU5pgEAq81ysvRmxEw1cmU5jh01xEVsdI9CMVwDmdAz2PTX> to org.apache.streams/streams-provider-datasift/0.1-SNAPSHOT/streams-provider-datasift-0.1-SNAPSHOT.pom
> [JENKINS] Archiving <http://cp.mcafee.com/d/avndygs91NJ5x5NdN5MQsK6XCQQmhPMWWrMUSCyMy-yCOyedFEIzDxRQTDzqqb339EVuujjdQ87XoGHm0ac9RgAhBfj-ndC4WEi8ODF_bC_pKeRNx_HYUeo7ectuVtdBZfAkXzzhOepVqWdAkRrKcYG7DR8OJMddLICTNNK_9IInojvvpjdTdAVPmEBC46V7EkXlJIj_w0e2di634U_GJ1WtMj5K1n35cFefWHgLqI9NAgOAU_GJ2WQqCp8v4KxIZF9SujS97VVisvRmxtqdjcAfyngSuQAXcLvAiUM310b30n309UhS9J3P9ufPrz0KCOMebQ87XoGHm1NxeG4ycFWvOUaFefWHjFgISgStoZGSS9_M04SCM-UedzbszQ3h0XIz_gd44E6y02fwlB2yhEw69N_lq6y04Nrwld4066zBMSMCrw2-9a9ah> to org.apache.streams/streams-provider-datasift/0.1-SNAPSHOT/streams-provider-datasift-0.1-SNAPSHOT.jar
> Sending artifact delta relative to Streams Trunk » streams-provider-datasift #95
> Archived 2 artifacts
> Archive block size is 32768
> Received 0 blocks and 150764 bytes
> Compression is 0.0%
> Took 0.22 sec
> [JENKINS] Archiving <http://cp.mcafee.com/d/2DRPoAd6Qm4n4T4n3hOUrKrjhp7f3HFL3zqqb2bWara8USCyOeu7njuudFEIccCzBVVdcTgwvJyGJo0EMDl2h6kZfVsSojGx8zauDYKrZCUXn67-LPwVwsUNRXBQSnQ-hjKed78VDBHEShjlKUPOEuvkzaT0QS-Mrv76XYCONtxdZZBcTsSjDdqymogrAuxjJmSNf-00U8R8ocjz-GQ7FT1cmU5sckOAU_GJ2ZGMD6h3ajz-GQbHhGpAxYiV6Ji9_UhHkyvVsy9UJlnwZkYSxVAL7VJNwnjpo75W43ZIllH0UMDl2h6kZfVs5kD7ZlFQEmr8reIuRrr4_U02rjovs76NBKhW1EwtSh_E6y2k3h017MaOxh8Qg34U_GJ3h02oJMaCy033hOUrojdzqzC> to org.apache.streams/google-gmail/0.1-SNAPSHOT/google-gmail-0.1-SNAPSHOT.pom
> [JENKINS] Archiving <http://cp.mcafee.com/d/1jWVIqdEI8K9K8K6zBMTsSCyOeu7nju76QQm4nQkSkhNJd5AsYeKCYYrjhoopd7bPOqpKx0_r5lqM1hxeG4ycFWvOVIMDl2h6kZfVsTXdNSKcfZvD1P0VNzHTbFILFYyDssqehPfbnhIyCHtNDBgY-F6lK1FJZYS-edTVdByX2rXXapKVIDeqR4IMwT8Z2DqJJyvY01MhGgMoD7ZlEfjK2oJMaUoFB9N_lq5Xlxecy6kD7ZlEnmzkP93UBOdqAj_MzmF4_OV4jOuN8_f2dqAj_bAhcLvAiUM310b30n309UhS9J3P9ufPrz0KCOMebQ87XoGHm1NxeG4ycFWvOUaFefWHjFgISgStoZGSS9_M04SCM-UedzbszQ3h0XIz_gd44E6y02fwlB2yhEw69N_lq6y04Nrwld4066zBMSMCrvQZa> to org.apache.streams/google-gmail/0.1-SNAPSHOT/google-gmail-0.1-SNAPSHOT.jar
> Sending artifact delta relative to Streams Trunk » google-gmail #95
> Archived 2 artifacts
> Archive block size is 32768
> Received 0 blocks and 26442 bytes
> Compression is 0.0%
> Took 0.15 sec
> [JENKINS] Archiving <http://cp.mcafee.com/d/avndzgs76Qm4n4T4n3hOUrKrjhp7f3HFL3zqqb2bWara8USCyOeu7njuudFEIccCzBVVdcTgwvJyGJo0EMDl2h6kZfVsSojGx8zauDYKrZCUXn67-LPwVwsUNRXBQSnQ-hjKed78VDBHEShjlKUPOEuvkzaT0QS-Urv76XYCONtxdZZBcTsSjDdqymogrAuxjJmSNf-00U8R8ocjz-GQ7FT1cmU5sckOAU_GJ2ZGMD6h3ajz-GQbHhGpAxYiV64BI8MAInZ2NukajQz7lsmGHMuGurgYOnzYSUMbFII3yZ21-SaGRwsojGx8zauDYK2Gjz-GQWkbdAdDmfqJJyvY01dFIfK3zoOT8Z0QgeX8_Q3h1a1Ew0zU5pgEAq81ysvRmxEw1cmU5jh01xEVsdI9CO7UM> to org.apache.streams/gnip-edc-instagram/0.1-SNAPSHOT/gnip-edc-instagram-0.1-SNAPSHOT.pom
> [JENKINS] Archiving <http://cp.mcafee.com/d/k-Kr3xEg6xESyMyUCUyUqen3tPqqb8VUttdUsrjhohvhjph76QQmhPMWWrPNJd5xxAQsLf9FCW43ZIllH0564WEi8ODF_bCP2tk94pjQ_BPvIT7qUM_R-s7c3D6eLsKCO-DOatNNEV7cYJt6OaqJT6ul3PWApmU6CTNNJYsrLOrb5S4TTSkPtPpesRG9px1KhW5eRrr4_U03wzkxwNefWHguDs4NrwlMNjajz-GQbSH2sp4cFefWHgKJ6FCi7NbAoimMz2iNvQb5VgFfictlOuN8_f2c9b5_gInB2AZ8NRkLvAiUM310b30n309UhS9J3P9ufPrz0KCOMebQ87XoGHm1NxeG4ycFWvOUaFefWHjFgISgStoZGSS9_M04SCM-UedzbszQ3h0XIz_gd44E6y02fwlB2yhEw69N_lq6y04Nrwld4066zBMSMCrGuVY> to org.apache.streams/gnip-edc-instagram/0.1-SNAPSHOT/gnip-edc-instagram-0.1-SNAPSHOT.jar
> Sending artifact delta relative to Streams Trunk » gnip-edc-instagram #95
> Archived 2 artifacts
> Archive block size is 32768
> Received 0 blocks and 30449 bytes
> Compression is 0.0%
> Took 0.14 sec
> channel stopped
>


Build failed in Jenkins: Streams Trunk #96

Posted by Apache Jenkins Server <je...@builds.apache.org>.
See <https://builds.apache.org/job/Streams%20Trunk/96/changes>

Changes:

[sblackmon] refresh streams-config

[sblackmon] Additional tests

[sblackmon] https://github.com/apache/incubator-streams/pull/126 feedback

------------------------------------------
[...truncated 15205 lines...]
[JENKINS] Archiving <https://builds.apache.org/job/Streams%20Trunk/ws/streams-contrib/streams-processor-urls/target/streams-processor-urls-0.1-SNAPSHOT.jar> to org.apache.streams/streams-processor-urls/0.1-SNAPSHOT/streams-processor-urls-0.1-SNAPSHOT.jar
Sending artifact delta relative to Streams Trunk » streams-processor-urls #95
Archived 2 artifacts
Archive block size is 32768
Received 0 blocks and 31069 bytes
Compression is 0.0%
Took 0.18 sec
[JENKINS] Archiving <https://builds.apache.org/job/Streams%20Trunk/ws/streams-contrib/streams-processor-json/pom.xml> to org.apache.streams/streams-processor-json/0.1-SNAPSHOT/streams-processor-json-0.1-SNAPSHOT.pom
[JENKINS] Archiving <https://builds.apache.org/job/Streams%20Trunk/ws/streams-contrib/streams-processor-json/target/streams-processor-json-0.1-SNAPSHOT.jar> to org.apache.streams/streams-processor-json/0.1-SNAPSHOT/streams-processor-json-0.1-SNAPSHOT.jar
Sending artifact delta relative to Streams Trunk » streams-processor-json #95
Archived 2 artifacts
Archive block size is 32768
Received 0 blocks and 18550 bytes
Compression is 0.0%
Took 0.16 sec
[JENKINS] Archiving <https://builds.apache.org/job/Streams%20Trunk/ws/streams-contrib/streams-provider-rss/pom.xml> to org.apache.streams/streams-provider-rss/0.1-SNAPSHOT/streams-provider-rss-0.1-SNAPSHOT.pom
[JENKINS] Archiving <https://builds.apache.org/job/Streams%20Trunk/ws/streams-contrib/streams-provider-rss/target/streams-provider-rss-0.1-SNAPSHOT.jar> to org.apache.streams/streams-provider-rss/0.1-SNAPSHOT/streams-provider-rss-0.1-SNAPSHOT.jar
Sending artifact delta relative to Streams Trunk » streams-provider-rss #95
Archived 2 artifacts
Archive block size is 32768
Received 0 blocks and 42001 bytes
Compression is 0.0%
Took 0.12 sec
[JENKINS] Archiving /home/jenkins/jenkins-slave/maven-repositories/0/org/apache/streams/streams-components/0.1-SNAPSHOT/streams-components-0.1-SNAPSHOT.pom to org.apache.streams/streams-components/0.1-SNAPSHOT/streams-components-0.1-SNAPSHOT.pom
/home/jenkins/jenkins-slave/maven-repositories/0/org/apache/streams/streams-components/0.1-SNAPSHOT/streams-components-0.1-SNAPSHOT.pom is not inside <https://builds.apache.org/job/Streams%20Trunk/ws/streams-components/;> will archive in a separate pass
Sending artifact delta relative to Streams Trunk » streams-components #95
Archived 1 artifacts
Archive block size is 32768
Received 0 blocks and 2305 bytes
Compression is 0.0%
Took 0.1 sec
[JENKINS] Archiving <https://builds.apache.org/job/Streams%20Trunk/ws/streams-contrib/streams-amazon-aws/streams-persist-s3/pom.xml> to org.apache.streams/streams-persist-s3/0.1-SNAPSHOT/streams-persist-s3-0.1-SNAPSHOT.pom
[JENKINS] Archiving <https://builds.apache.org/job/Streams%20Trunk/ws/streams-contrib/streams-amazon-aws/streams-persist-s3/target/streams-persist-s3-0.1-SNAPSHOT.jar> to org.apache.streams/streams-persist-s3/0.1-SNAPSHOT/streams-persist-s3-0.1-SNAPSHOT.jar
Sending artifact delta relative to Streams Trunk » streams-persist-s3 #95
Archived 2 artifacts
Archive block size is 32768
Received 0 blocks and 37434 bytes
Compression is 0.0%
Took 0.12 sec
[JENKINS] Archiving /home/jenkins/jenkins-slave/maven-repositories/0/org/apache/streams/streams-runtimes/0.1-SNAPSHOT/streams-runtimes-0.1-SNAPSHOT.pom to org.apache.streams/streams-runtimes/0.1-SNAPSHOT/streams-runtimes-0.1-SNAPSHOT.pom
/home/jenkins/jenkins-slave/maven-repositories/0/org/apache/streams/streams-runtimes/0.1-SNAPSHOT/streams-runtimes-0.1-SNAPSHOT.pom is not inside <https://builds.apache.org/job/Streams%20Trunk/ws/streams-runtimes/;> will archive in a separate pass
Sending artifact delta relative to Streams Trunk » streams-runtimes #95
Archived 1 artifacts
Archive block size is 32768
Received 0 blocks and 1631 bytes
Compression is 0.0%
Took 0.1 sec
[JENKINS] Archiving <https://builds.apache.org/job/Streams%20Trunk/ws/streams-contrib/streams-provider-instagram/pom.xml> to org.apache.streams/streams-provider-instagram/0.1-SNAPSHOT/streams-provider-instagram-0.1-SNAPSHOT.pom
[JENKINS] Archiving <https://builds.apache.org/job/Streams%20Trunk/ws/streams-contrib/streams-provider-instagram/target/streams-provider-instagram-0.1-SNAPSHOT.jar> to org.apache.streams/streams-provider-instagram/0.1-SNAPSHOT/streams-provider-instagram-0.1-SNAPSHOT.jar
Sending artifact delta relative to Streams Trunk » streams-provider-instagram #95
Archived 2 artifacts
Archive block size is 32768
Received 0 blocks and 48571 bytes
Compression is 0.0%
Took 0.18 sec
[JENKINS] Archiving <https://builds.apache.org/job/Streams%20Trunk/ws/streams-pojo-extensions/pom.xml> to org.apache.streams/streams-pojo-extensions/0.1-SNAPSHOT/streams-pojo-extensions-0.1-SNAPSHOT.pom
[JENKINS] Archiving <https://builds.apache.org/job/Streams%20Trunk/ws/streams-pojo-extensions/target/streams-pojo-extensions-0.1-SNAPSHOT.jar> to org.apache.streams/streams-pojo-extensions/0.1-SNAPSHOT/streams-pojo-extensions-0.1-SNAPSHOT.jar
Sending artifact delta relative to Streams Trunk » streams-pojo-extensions #95
Archived 2 artifacts
Archive block size is 32768
Received 0 blocks and 13617 bytes
Compression is 0.0%
Took 0.13 sec
[JENKINS] Archiving <https://builds.apache.org/job/Streams%20Trunk/ws/streams-components/streams-http/pom.xml> to org.apache.streams/streams-http/0.1-SNAPSHOT/streams-http-0.1-SNAPSHOT.pom
[JENKINS] Archiving <https://builds.apache.org/job/Streams%20Trunk/ws/streams-components/streams-http/target/streams-http-0.1-SNAPSHOT.jar> to org.apache.streams/streams-http/0.1-SNAPSHOT/streams-http-0.1-SNAPSHOT.jar
Sending artifact delta relative to Streams Trunk » streams-http #95
Archived 2 artifacts
Archive block size is 32768
Received 0 blocks and 33588 bytes
Compression is 0.0%
Took 0.11 sec
[JENKINS] Archiving <https://builds.apache.org/job/Streams%20Trunk/ws/streams-osgi-components/activity-registration/pom.xml> to org.apache.streams.osgi.components/activity-registration/0.1-SNAPSHOT/activity-registration-0.1-SNAPSHOT.pom
[JENKINS] Archiving <https://builds.apache.org/job/Streams%20Trunk/ws/streams-osgi-components/activity-registration/target/activity-registration-0.1-SNAPSHOT.jar> to org.apache.streams.osgi.components/activity-registration/0.1-SNAPSHOT/activity-registration-0.1-SNAPSHOT.jar
Sending artifact delta relative to Streams Trunk » activity-registration-bundle [org.apache.streams.osgi.components] #95
Archived 2 artifacts
Archive block size is 32768
Received 0 blocks and 23018 bytes
Compression is 0.0%
Took 90 ms
[JENKINS] Archiving <https://builds.apache.org/job/Streams%20Trunk/ws/streams-contrib/streams-persist-elasticsearch/pom.xml> to org.apache.streams/streams-persist-elasticsearch/0.1-SNAPSHOT/streams-persist-elasticsearch-0.1-SNAPSHOT.pom
[JENKINS] Archiving <https://builds.apache.org/job/Streams%20Trunk/ws/streams-contrib/streams-persist-elasticsearch/target/streams-persist-elasticsearch-0.1-SNAPSHOT.jar> to org.apache.streams/streams-persist-elasticsearch/0.1-SNAPSHOT/streams-persist-elasticsearch-0.1-SNAPSHOT.jar
Sending artifact delta relative to Streams Trunk » streams-persist-elasticsearch #95
Archived 2 artifacts
Archive block size is 32768
Received 0 blocks and 68250 bytes
Compression is 0.0%
Took 0.13 sec
[JENKINS] Archiving <https://builds.apache.org/job/Streams%20Trunk/ws/streams-contrib/streams-provider-twitter/pom.xml> to org.apache.streams/streams-provider-twitter/0.1-SNAPSHOT/streams-provider-twitter-0.1-SNAPSHOT.pom
[JENKINS] Archiving <https://builds.apache.org/job/Streams%20Trunk/ws/streams-contrib/streams-provider-twitter/target/streams-provider-twitter-0.1-SNAPSHOT.jar> to org.apache.streams/streams-provider-twitter/0.1-SNAPSHOT/streams-provider-twitter-0.1-SNAPSHOT.jar
Sending artifact delta relative to Streams Trunk » streams-provider-twitter #95
Archived 2 artifacts
Archive block size is 32768
Received 0 blocks and 101432 bytes
Compression is 0.0%
Took 0.12 sec
[JENKINS] Archiving <https://builds.apache.org/job/Streams%20Trunk/ws/streams-contrib/streams-processor-regex/pom.xml> to org.apache.streams/streams-processor-regex/0.1-SNAPSHOT/streams-processor-regex-0.1-SNAPSHOT.pom
[JENKINS] Archiving <https://builds.apache.org/job/Streams%20Trunk/ws/streams-contrib/streams-processor-regex/target/streams-processor-regex-0.1-SNAPSHOT.jar> to org.apache.streams/streams-processor-regex/0.1-SNAPSHOT/streams-processor-regex-0.1-SNAPSHOT.jar
Sending artifact delta relative to Streams Trunk » streams-processor-regex #95
Archived 2 artifacts
Archive block size is 32768
Received 0 blocks and 18139 bytes
Compression is 0.0%
Took 2.1 sec
[JENKINS] Archiving <https://builds.apache.org/job/Streams%20Trunk/ws/streams-pojo/pom.xml> to org.apache.streams/streams-pojo/0.1-SNAPSHOT/streams-pojo-0.1-SNAPSHOT.pom
[JENKINS] Archiving <https://builds.apache.org/job/Streams%20Trunk/ws/streams-pojo/target/streams-pojo-0.1-SNAPSHOT.jar> to org.apache.streams/streams-pojo/0.1-SNAPSHOT/streams-pojo-0.1-SNAPSHOT.jar
Sending artifact delta relative to Streams Trunk » streams-pojo #95
Archived 2 artifacts
Archive block size is 32768
Received 0 blocks and 111833 bytes
Compression is 0.0%
Took 0.2 sec
[JENKINS] Archiving /home/jenkins/jenkins-slave/maven-repositories/0/org/apache/streams/streams-amazon-aws/0.1-SNAPSHOT/streams-amazon-aws-0.1-SNAPSHOT.pom to org.apache.streams/streams-amazon-aws/0.1-SNAPSHOT/streams-amazon-aws-0.1-SNAPSHOT.pom
/home/jenkins/jenkins-slave/maven-repositories/0/org/apache/streams/streams-amazon-aws/0.1-SNAPSHOT/streams-amazon-aws-0.1-SNAPSHOT.pom is not inside <https://builds.apache.org/job/Streams%20Trunk/ws/streams-contrib/streams-amazon-aws/;> will archive in a separate pass
Sending artifact delta relative to Streams Trunk » streams-amazon-aws #95
Archived 1 artifacts
Archive block size is 32768
Received 0 blocks and 2492 bytes
Compression is 0.0%
Took 0.11 sec
[JENKINS] Archiving /home/jenkins/jenkins-slave/maven-repositories/0/org/apache/streams/build/compiled-bundle-settings/0.1-SNAPSHOT/compiled-bundle-settings-0.1-SNAPSHOT.pom to org.apache.streams.build/compiled-bundle-settings/0.1-SNAPSHOT/compiled-bundle-settings-0.1-SNAPSHOT.pom
/home/jenkins/jenkins-slave/maven-repositories/0/org/apache/streams/build/compiled-bundle-settings/0.1-SNAPSHOT/compiled-bundle-settings-0.1-SNAPSHOT.pom is not inside <https://builds.apache.org/job/Streams%20Trunk/ws/poms/compiled/;> will archive in a separate pass
Sending artifact delta relative to Streams Trunk » apache-streams - bundle instructions #95
Archived 1 artifacts
Archive block size is 32768
Received 0 blocks and 3004 bytes
Compression is 0.0%
Took 81 ms
[JENKINS] Archiving <https://builds.apache.org/job/Streams%20Trunk/ws/streams-contrib/streams-provider-gnip/gnip-edc-youtube/pom.xml> to org.apache.streams/gnip-edc-youtube/0.1-SNAPSHOT/gnip-edc-youtube-0.1-SNAPSHOT.pom
[JENKINS] Archiving <https://builds.apache.org/job/Streams%20Trunk/ws/streams-contrib/streams-provider-gnip/gnip-edc-youtube/target/gnip-edc-youtube-0.1-SNAPSHOT.jar> to org.apache.streams/gnip-edc-youtube/0.1-SNAPSHOT/gnip-edc-youtube-0.1-SNAPSHOT.jar
Sending artifact delta relative to Streams Trunk » gnip-edc-youtube #95
Archived 2 artifacts
Archive block size is 32768
Received 0 blocks and 13629 bytes
Compression is 0.0%
Took 0.1 sec
[JENKINS] Archiving <https://builds.apache.org/job/Streams%20Trunk/ws/streams-runtimes/streams-runtime-local/pom.xml> to org.apache.streams/streams-runtime-local/0.1-SNAPSHOT/streams-runtime-local-0.1-SNAPSHOT.pom
[JENKINS] Archiving <https://builds.apache.org/job/Streams%20Trunk/ws/streams-runtimes/streams-runtime-local/target/streams-runtime-local-0.1-SNAPSHOT.jar> to org.apache.streams/streams-runtime-local/0.1-SNAPSHOT/streams-runtime-local-0.1-SNAPSHOT.jar
[JENKINS] Archiving <https://builds.apache.org/job/Streams%20Trunk/ws/streams-runtimes/streams-runtime-local/target/streams-runtime-local-0.1-SNAPSHOT-tests.jar> to org.apache.streams/streams-runtime-local/0.1-SNAPSHOT/streams-runtime-local-0.1-SNAPSHOT-tests.jar
Sending artifact delta relative to Streams Trunk » streams-runtime-local #95
Archived 3 artifacts
Archive block size is 32768
Received 0 blocks and 125894 bytes
Compression is 0.0%
Took 0.19 sec
[JENKINS] Archiving /home/jenkins/jenkins-slave/maven-repositories/0/org/apache/streams/streams-contrib/0.1-SNAPSHOT/streams-contrib-0.1-SNAPSHOT.pom to org.apache.streams/streams-contrib/0.1-SNAPSHOT/streams-contrib-0.1-SNAPSHOT.pom
/home/jenkins/jenkins-slave/maven-repositories/0/org/apache/streams/streams-contrib/0.1-SNAPSHOT/streams-contrib-0.1-SNAPSHOT.pom is not inside <https://builds.apache.org/job/Streams%20Trunk/ws/streams-contrib/;> will archive in a separate pass
Sending artifact delta relative to Streams Trunk » streams-contrib #95
Archived 1 artifacts
Archive block size is 32768
Received 0 blocks and 3453 bytes
Compression is 0.0%
Took 85 ms
[JENKINS] Archiving <https://builds.apache.org/job/Streams%20Trunk/ws/streams-monitoring/pom.xml> to org.apache.streams/streams-monitoring/0.1-SNAPSHOT/streams-monitoring-0.1-SNAPSHOT.pom
[JENKINS] Archiving <https://builds.apache.org/job/Streams%20Trunk/ws/streams-monitoring/target/streams-monitoring-0.1-SNAPSHOT.jar> to org.apache.streams/streams-monitoring/0.1-SNAPSHOT/streams-monitoring-0.1-SNAPSHOT.jar
Sending artifact delta relative to Streams Trunk » streams-monitoring #95
Archived 2 artifacts
Archive block size is 32768
Received 0 blocks and 38482 bytes
Compression is 0.0%
Took 91 ms
[JENKINS] Archiving /home/jenkins/jenkins-slave/maven-repositories/0/org/apache/streams/streams-project/0.1-SNAPSHOT/streams-project-0.1-SNAPSHOT.pom to org.apache.streams/streams-project/0.1-SNAPSHOT/streams-project-0.1-SNAPSHOT.pom
/home/jenkins/jenkins-slave/maven-repositories/0/org/apache/streams/streams-project/0.1-SNAPSHOT/streams-project-0.1-SNAPSHOT.pom is not inside <https://builds.apache.org/job/Streams%20Trunk/ws/;> will archive in a separate pass
Sending artifact delta relative to Streams Trunk » Apache Streams Project #95
Archived 1 artifacts
Archive block size is 32768
Received 0 blocks and 18632 bytes
Compression is 0.0%
Took 74 ms
[JENKINS] Archiving <https://builds.apache.org/job/Streams%20Trunk/ws/streams-osgi-components/streams-components-all/target/dependency-reduced-pom.xml> to org.apache.streams.osgi.components/streams-components-all/0.1-SNAPSHOT/streams-components-all-0.1-SNAPSHOT.pom
[JENKINS] Archiving <https://builds.apache.org/job/Streams%20Trunk/ws/streams-osgi-components/streams-components-all/target/streams-components-all-0.1-SNAPSHOT.jar> to org.apache.streams.osgi.components/streams-components-all/0.1-SNAPSHOT/streams-components-all-0.1-SNAPSHOT.jar
Sending artifact delta relative to Streams Trunk » Apache Streams Components All #95
Archived 2 artifacts
Archive block size is 32768
Received 130 blocks and 57568006 bytes
Compression is 6.9%
Took 34 sec
[JENKINS] Archiving <https://builds.apache.org/job/Streams%20Trunk/ws/streams-contrib/streams-processor-peoplepattern/pom.xml> to org.apache.streams/streams-processor-peoplepattern/0.1-SNAPSHOT/streams-processor-peoplepattern-0.1-SNAPSHOT.pom
[JENKINS] Archiving <https://builds.apache.org/job/Streams%20Trunk/ws/streams-contrib/streams-processor-peoplepattern/target/streams-processor-peoplepattern-0.1-SNAPSHOT.jar> to org.apache.streams/streams-processor-peoplepattern/0.1-SNAPSHOT/streams-processor-peoplepattern-0.1-SNAPSHOT.jar
Sending artifact delta relative to Streams Trunk » streams-processor-peoplepattern #95
Archived 2 artifacts
Archive block size is 32768
Received 0 blocks and 31813 bytes
Compression is 0.0%
Took 82 ms
[JENKINS] Archiving <https://builds.apache.org/job/Streams%20Trunk/ws/streams-contrib/streams-provider-google/google-gplus/pom.xml> to org.apache.streams/google-gplus/0.1-SNAPSHOT/google-gplus-0.1-SNAPSHOT.pom
[JENKINS] Archiving <https://builds.apache.org/job/Streams%20Trunk/ws/streams-contrib/streams-provider-google/google-gplus/target/google-gplus-0.1-SNAPSHOT.jar> to org.apache.streams/google-gplus/0.1-SNAPSHOT/google-gplus-0.1-SNAPSHOT.jar
Sending artifact delta relative to Streams Trunk » google-gplus #95
Archived 2 artifacts
Archive block size is 32768
Received 0 blocks and 56114 bytes
Compression is 0.0%
Took 84 ms
[JENKINS] Archiving /home/jenkins/jenkins-slave/maven-repositories/0/org/apache/streams/streams-provider-gnip/0.1-SNAPSHOT/streams-provider-gnip-0.1-SNAPSHOT.pom to org.apache.streams/streams-provider-gnip/0.1-SNAPSHOT/streams-provider-gnip-0.1-SNAPSHOT.pom
/home/jenkins/jenkins-slave/maven-repositories/0/org/apache/streams/streams-provider-gnip/0.1-SNAPSHOT/streams-provider-gnip-0.1-SNAPSHOT.pom is not inside <https://builds.apache.org/job/Streams%20Trunk/ws/streams-contrib/streams-provider-gnip/;> will archive in a separate pass
Sending artifact delta relative to Streams Trunk » streams-provider-gnip #95
Archived 1 artifacts
Archive block size is 32768
Received 0 blocks and 1771 bytes
Compression is 0.0%
Took 75 ms
[JENKINS] Archiving <https://builds.apache.org/job/Streams%20Trunk/ws/streams-contrib/streams-persist-hdfs/pom.xml> to org.apache.streams/streams-persist-hdfs/0.1-SNAPSHOT/streams-persist-hdfs-0.1-SNAPSHOT.pom
[JENKINS] Archiving <https://builds.apache.org/job/Streams%20Trunk/ws/streams-contrib/streams-persist-hdfs/target/streams-persist-hdfs-0.1-SNAPSHOT.jar> to org.apache.streams/streams-persist-hdfs/0.1-SNAPSHOT/streams-persist-hdfs-0.1-SNAPSHOT.jar
Sending artifact delta relative to Streams Trunk » streams-persist-hdfs #95
Archived 2 artifacts
Archive block size is 32768
Received 0 blocks and 36925 bytes
Compression is 0.0%
Took 97 ms
[JENKINS] Archiving <https://builds.apache.org/job/Streams%20Trunk/ws/streams-contrib/streams-persist-console/pom.xml> to org.apache.streams/streams-persist-console/0.1-SNAPSHOT/streams-persist-console-0.1-SNAPSHOT.pom
[JENKINS] Archiving <https://builds.apache.org/job/Streams%20Trunk/ws/streams-contrib/streams-persist-console/target/streams-persist-console-0.1-SNAPSHOT.jar> to org.apache.streams/streams-persist-console/0.1-SNAPSHOT/streams-persist-console-0.1-SNAPSHOT.jar
Sending artifact delta relative to Streams Trunk » streams-persist-console #95
Archived 2 artifacts
Archive block size is 32768
Received 0 blocks and 15358 bytes
Compression is 0.0%
Took 82 ms
[JENKINS] Archiving <https://builds.apache.org/job/Streams%20Trunk/ws/streams-osgi-components/activity-consumer/pom.xml> to org.apache.streams.osgi.components/activity-consumer/0.1-SNAPSHOT/activity-consumer-0.1-SNAPSHOT.pom
[JENKINS] Archiving <https://builds.apache.org/job/Streams%20Trunk/ws/streams-osgi-components/activity-consumer/target/activity-consumer-0.1-SNAPSHOT.jar> to org.apache.streams.osgi.components/activity-consumer/0.1-SNAPSHOT/activity-consumer-0.1-SNAPSHOT.jar
Sending artifact delta relative to Streams Trunk » activity-consumer-bundle [org.apache.streams.osgi.components.activityconsumer] #95
Archived 2 artifacts
Archive block size is 32768
Received 0 blocks and 25028 bytes
Compression is 0.0%
Took 0.14 sec
[JENKINS] Archiving <https://builds.apache.org/job/Streams%20Trunk/ws/streams-contrib/streams-provider-datasift/pom.xml> to org.apache.streams/streams-provider-datasift/0.1-SNAPSHOT/streams-provider-datasift-0.1-SNAPSHOT.pom
[JENKINS] Archiving <https://builds.apache.org/job/Streams%20Trunk/ws/streams-contrib/streams-provider-datasift/target/streams-provider-datasift-0.1-SNAPSHOT.jar> to org.apache.streams/streams-provider-datasift/0.1-SNAPSHOT/streams-provider-datasift-0.1-SNAPSHOT.jar
Sending artifact delta relative to Streams Trunk » streams-provider-datasift #95
Archived 2 artifacts
Archive block size is 32768
Received 0 blocks and 150764 bytes
Compression is 0.0%
Took 0.22 sec
[JENKINS] Archiving <https://builds.apache.org/job/Streams%20Trunk/ws/streams-contrib/streams-provider-google/google-gmail/pom.xml> to org.apache.streams/google-gmail/0.1-SNAPSHOT/google-gmail-0.1-SNAPSHOT.pom
[JENKINS] Archiving <https://builds.apache.org/job/Streams%20Trunk/ws/streams-contrib/streams-provider-google/google-gmail/target/google-gmail-0.1-SNAPSHOT.jar> to org.apache.streams/google-gmail/0.1-SNAPSHOT/google-gmail-0.1-SNAPSHOT.jar
Sending artifact delta relative to Streams Trunk » google-gmail #95
Archived 2 artifacts
Archive block size is 32768
Received 0 blocks and 26442 bytes
Compression is 0.0%
Took 0.15 sec
[JENKINS] Archiving <https://builds.apache.org/job/Streams%20Trunk/ws/streams-contrib/streams-provider-gnip/gnip-edc-instagram/pom.xml> to org.apache.streams/gnip-edc-instagram/0.1-SNAPSHOT/gnip-edc-instagram-0.1-SNAPSHOT.pom
[JENKINS] Archiving <https://builds.apache.org/job/Streams%20Trunk/ws/streams-contrib/streams-provider-gnip/gnip-edc-instagram/target/gnip-edc-instagram-0.1-SNAPSHOT.jar> to org.apache.streams/gnip-edc-instagram/0.1-SNAPSHOT/gnip-edc-instagram-0.1-SNAPSHOT.jar
Sending artifact delta relative to Streams Trunk » gnip-edc-instagram #95
Archived 2 artifacts
Archive block size is 32768
Received 0 blocks and 30449 bytes
Compression is 0.0%
Took 0.14 sec
channel stopped

Jenkins build is still unstable: Streams Trunk #95

Posted by Apache Jenkins Server <je...@builds.apache.org>.
See <https://builds.apache.org/job/Streams%20Trunk/changes>


Jenkins build is unstable: Streams Trunk #94

Posted by Apache Jenkins Server <je...@builds.apache.org>.
See <https://builds.apache.org/job/Streams%20Trunk/94/changes>


Build failed in Jenkins: Streams Trunk #93

Posted by Apache Jenkins Server <je...@builds.apache.org>.
See <https://builds.apache.org/job/Streams%20Trunk/93/changes>

Changes:

[rdouglas] STREAMS-211 | Added the BroadcastMessagePersister interface which allows us to persist serialized JMX messages (like the ones we aggregate in the BroadcastMonitorThread). There is an implementation of that interface which persists those messages via a HTTP POST to a URI that is defined in the Streams configuration

[rdouglas] STREAMS-211 | Removed unnecessary include

[rdouglas] Merge

[rdouglas] STREAMS-211 | Responded to code review feedback

------------------------------------------
[...truncated 2076 lines...]
urls[2] = file:/jenkins/maven-repositories/0/commons-lang/commons-lang/2.3/commons-lang-2.3.jar
urls[3] = file:/jenkins/maven-repositories/0/org/apache/maven/enforcer/enforcer-api/1.3.1/enforcer-api-1.3.1.jar
urls[4] = file:/jenkins/maven-repositories/0/org/apache/maven/enforcer/enforcer-rules/1.3.1/enforcer-rules-1.3.1.jar
urls[5] = file:/jenkins/maven-repositories/0/org/apache/maven/shared/maven-common-artifact-filters/1.4/maven-common-artifact-filters-1.4.jar
urls[6] = file:/jenkins/maven-repositories/0/org/beanshell/bsh/2.0b4/bsh-2.0b4.jar
urls[7] = file:/jenkins/maven-repositories/0/org/apache/maven/shared/maven-dependency-tree/2.1/maven-dependency-tree-2.1.jar
urls[8] = file:/jenkins/maven-repositories/0/org/codehaus/plexus/plexus-component-annotations/1.5.5/plexus-component-annotations-1.5.5.jar
urls[9] = file:/jenkins/maven-repositories/0/org/eclipse/aether/aether-util/0.9.0.M2/aether-util-0.9.0.M2.jar
urls[10] = file:/jenkins/maven-repositories/0/org/codehaus/plexus/plexus-i18n/1.0-beta-6/plexus-i18n-1.0-beta-6.jar
Number of imports: 10
import: org.codehaus.classworlds.Entry@a6c57a42
import: org.codehaus.classworlds.Entry@12f43f3b
import: org.codehaus.classworlds.Entry@20025374
import: org.codehaus.classworlds.Entry@f8e44ca4
import: org.codehaus.classworlds.Entry@92758522
import: org.codehaus.classworlds.Entry@ebf2705b
import: org.codehaus.classworlds.Entry@bb25e54
import: org.codehaus.classworlds.Entry@bece5185
import: org.codehaus.classworlds.Entry@3fee8e37
import: org.codehaus.classworlds.Entry@3fee19d8


this realm = plexus.core.maven
Number of imports: 10
import: org.codehaus.classworlds.Entry@a6c57a42
import: org.codehaus.classworlds.Entry@12f43f3b
import: org.codehaus.classworlds.Entry@20025374
import: org.codehaus.classworlds.Entry@f8e44ca4
import: org.codehaus.classworlds.Entry@92758522
import: org.codehaus.classworlds.Entry@ebf2705b
import: org.codehaus.classworlds.Entry@bb25e54
import: org.codehaus.classworlds.Entry@bece5185
import: org.codehaus.classworlds.Entry@3fee8e37
import: org.codehaus.classworlds.Entry@3fee19d8


this realm = plexus.core
urls[0] = file:/jenkins/maven2.1-interceptor.jar
urls[1] = file:/jenkins/maven-interceptor.jar
urls[2] = file:/home/jenkins/tools/maven/apache-maven-2.2.1/lib/maven-2.2.1-uber.jar
Number of imports: 10
import: org.codehaus.classworlds.Entry@a6c57a42
import: org.codehaus.classworlds.Entry@12f43f3b
import: org.codehaus.classworlds.Entry@20025374
import: org.codehaus.classworlds.Entry@f8e44ca4
import: org.codehaus.classworlds.Entry@92758522
import: org.codehaus.classworlds.Entry@ebf2705b
import: org.codehaus.classworlds.Entry@bb25e54
import: org.codehaus.classworlds.Entry@bece5185
import: org.codehaus.classworlds.Entry@3fee8e37
import: org.codehaus.classworlds.Entry@3fee19d8
-----------------------------------------------------
[WARNING] The parameter expression: 'project.build.resources' used in mojo: 'process' has been deprecated. Use 'project.resources' instead.
[INFO] [remote-resources:process {execution: default}]
[INFO] [site:attach-descriptor {execution: default-attach-descriptor}]
[INFO] [install:install {execution: default-install}]
[INFO] Installing <https://builds.apache.org/job/Streams%20Trunk/ws/streams-osgi-components/pom.xml> to /jenkins/maven-repositories/0/org/apache/streams/osgi/components/streams-osgi-components/0.1-SNAPSHOT/streams-osgi-components-0.1-SNAPSHOT.pom
[INFO] ------------------------------------------------------------------------
[INFO] Building activity-subscriber-bundle [org.apache.streams.osgi.components.activitysubscriber]
[INFO]    task-segment: [clean, install]
[INFO] ------------------------------------------------------------------------
[INFO] [clean:clean {execution: default-clean}]
Downloading: http://repo1.maven.org/maven2/org/apache/maven/plugins/maven-resources-plugin/2.5/maven-resources-plugin-2.5.pom
6K downloaded  (maven-resources-plugin-2.5.pom)
Downloading: http://repo1.maven.org/maven2/org/apache/maven/plugins/maven-plugins/19/maven-plugins-19.pom
10K downloaded  (maven-plugins-19.pom)
Downloading: http://repo1.maven.org/maven2/org/apache/maven/plugins/maven-resources-plugin/2.5/maven-resources-plugin-2.5.jar
25K downloaded  (maven-resources-plugin-2.5.jar)
Downloading: http://repo1.maven.org/maven2/org/apache/maven/plugins/maven-surefire-plugin/2.17/maven-surefire-plugin-2.17.pom
4K downloaded  (maven-surefire-plugin-2.17.pom)
Downloading: http://repo1.maven.org/maven2/org/apache/maven/surefire/surefire/2.17/surefire-2.17.pom
16K downloaded  (surefire-2.17.pom)
Downloading: http://repo1.maven.org/maven2/org/apache/maven/plugins/maven-surefire-plugin/2.17/maven-surefire-plugin-2.17.jar
33K downloaded  (maven-surefire-plugin-2.17.jar)
[INFO] [enforcer:enforce {execution: enforce-java}]
[INFO] [enforcer:enforce {execution: enforce-no-snapshots}]
-----------------------------------------------------
this realm = app0.child-container[org.apache.maven.plugins:maven-enforcer-plugin:1.3.1]
urls[0] = file:/jenkins/maven-repositories/0/org/apache/maven/plugins/maven-enforcer-plugin/1.3.1/maven-enforcer-plugin-1.3.1.jar
urls[1] = file:/jenkins/maven-repositories/0/org/codehaus/plexus/plexus-utils/1.5.8/plexus-utils-1.5.8.jar
urls[2] = file:/jenkins/maven-repositories/0/commons-lang/commons-lang/2.3/commons-lang-2.3.jar
urls[3] = file:/jenkins/maven-repositories/0/org/apache/maven/enforcer/enforcer-api/1.3.1/enforcer-api-1.3.1.jar
urls[4] = file:/jenkins/maven-repositories/0/org/apache/maven/enforcer/enforcer-rules/1.3.1/enforcer-rules-1.3.1.jar
urls[5] = file:/jenkins/maven-repositories/0/org/apache/maven/shared/maven-common-artifact-filters/1.4/maven-common-artifact-filters-1.4.jar
urls[6] = file:/jenkins/maven-repositories/0/org/beanshell/bsh/2.0b4/bsh-2.0b4.jar
urls[7] = file:/jenkins/maven-repositories/0/org/apache/maven/shared/maven-dependency-tree/2.1/maven-dependency-tree-2.1.jar
urls[8] = file:/jenkins/maven-repositories/0/org/codehaus/plexus/plexus-component-annotations/1.5.5/plexus-component-annotations-1.5.5.jar
urls[9] = file:/jenkins/maven-repositories/0/org/eclipse/aether/aether-util/0.9.0.M2/aether-util-0.9.0.M2.jar
urls[10] = file:/jenkins/maven-repositories/0/org/codehaus/plexus/plexus-i18n/1.0-beta-6/plexus-i18n-1.0-beta-6.jar
Number of imports: 10
import: org.codehaus.classworlds.Entry@a6c57a42
import: org.codehaus.classworlds.Entry@12f43f3b
import: org.codehaus.classworlds.Entry@20025374
import: org.codehaus.classworlds.Entry@f8e44ca4
import: org.codehaus.classworlds.Entry@92758522
import: org.codehaus.classworlds.Entry@ebf2705b
import: org.codehaus.classworlds.Entry@bb25e54
import: org.codehaus.classworlds.Entry@bece5185
import: org.codehaus.classworlds.Entry@3fee8e37
import: org.codehaus.classworlds.Entry@3fee19d8


this realm = plexus.core.maven
Number of imports: 10
import: org.codehaus.classworlds.Entry@a6c57a42
import: org.codehaus.classworlds.Entry@12f43f3b
import: org.codehaus.classworlds.Entry@20025374
import: org.codehaus.classworlds.Entry@f8e44ca4
import: org.codehaus.classworlds.Entry@92758522
import: org.codehaus.classworlds.Entry@ebf2705b
import: org.codehaus.classworlds.Entry@bb25e54
import: org.codehaus.classworlds.Entry@bece5185
import: org.codehaus.classworlds.Entry@3fee8e37
import: org.codehaus.classworlds.Entry@3fee19d8


this realm = plexus.core
urls[0] = file:/jenkins/maven2.1-interceptor.jar
urls[1] = file:/jenkins/maven-interceptor.jar
urls[2] = file:/home/jenkins/tools/maven/apache-maven-2.2.1/lib/maven-2.2.1-uber.jar
Number of imports: 10
import: org.codehaus.classworlds.Entry@a6c57a42
import: org.codehaus.classworlds.Entry@12f43f3b
import: org.codehaus.classworlds.Entry@20025374
import: org.codehaus.classworlds.Entry@f8e44ca4
import: org.codehaus.classworlds.Entry@92758522
import: org.codehaus.classworlds.Entry@ebf2705b
import: org.codehaus.classworlds.Entry@bb25e54
import: org.codehaus.classworlds.Entry@bece5185
import: org.codehaus.classworlds.Entry@3fee8e37
import: org.codehaus.classworlds.Entry@3fee19d8
-----------------------------------------------------
Downloading: http://repo1.maven.org/maven2/org/osgi/osgi_R4_core/1.0/osgi_R4_core-1.0.pom
285b downloaded  (osgi_R4_core-1.0.pom)
Downloading: http://repo1.maven.org/maven2/org/codehaus/jackson/jackson-mrbean/1.9.11/jackson-mrbean-1.9.11.pom
1K downloaded  (jackson-mrbean-1.9.11.pom)
Downloading: http://clojars.org/repo/org/codehaus/jackson/jackson-mapper-asl/1.9.11/jackson-mapper-asl-1.9.11.pom
[INFO] Unable to find resource 'org.codehaus.jackson:jackson-mapper-asl:pom:1.9.11' in repository clojars.org (http://clojars.org/repo)
Downloading: https://repository.cloudera.com/artifactory/repo/org/codehaus/jackson/jackson-mapper-asl/1.9.11/jackson-mapper-asl-1.9.11.pom
1K downloaded  (jackson-mapper-asl-1.9.11.pom)
Downloading: http://clojars.org/repo/org/codehaus/jackson/jackson-core-asl/1.9.11/jackson-core-asl-1.9.11.pom
[INFO] Unable to find resource 'org.codehaus.jackson:jackson-core-asl:pom:1.9.11' in repository clojars.org (http://clojars.org/repo)
Downloading: https://repository.cloudera.com/artifactory/repo/org/codehaus/jackson/jackson-core-asl/1.9.11/jackson-core-asl-1.9.11.pom
1017b downloaded  (jackson-core-asl-1.9.11.pom)
Downloading: http://repo1.maven.org/maven2/org/osgi/osgi_R4_compendium/1.0/osgi_R4_compendium-1.0.pom
303b downloaded  (osgi_R4_compendium-1.0.pom)
Downloading: http://repo1.maven.org/maven2/commons-logging/commons-logging-api/1.1/commons-logging-api-1.1.pom
5K downloaded  (commons-logging-api-1.1.pom)
[WARNING] The parameter expression: 'project.build.resources' used in mojo: 'process' has been deprecated. Use 'project.resources' instead.
[INFO] [remote-resources:process {execution: default}]
Downloading: http://repo1.maven.org/maven2/commons-logging/commons-logging-api/1.1/commons-logging-api-1.1.jar
Downloading: http://repo1.maven.org/maven2/org/codehaus/jackson/jackson-mrbean/1.9.11/jackson-mrbean-1.9.11.jar
Downloading: http://repo1.maven.org/maven2/org/osgi/osgi_R4_core/1.0/osgi_R4_core-1.0.jar
65K downloaded  (jackson-mrbean-1.9.11.jar)
43K downloaded  (commons-logging-api-1.1.jar)
Downloading: http://repo1.maven.org/maven2/org/codehaus/jackson/jackson-mapper-asl/1.9.11/jackson-mapper-asl-1.9.11.jar
434K downloaded  (osgi_R4_core-1.0.jar)
Downloading: http://repo1.maven.org/maven2/org/osgi/osgi_R4_compendium/1.0/osgi_R4_compendium-1.0.jar
762K downloaded  (jackson-mapper-asl-1.9.11.jar)
Downloading: http://clojars.org/repo/org/codehaus/jackson/jackson-core-asl/1.9.11/jackson-core-asl-1.9.11.jar
657K downloaded  (osgi_R4_compendium-1.0.jar)
[INFO] Unable to find resource 'org.codehaus.jackson:jackson-core-asl:jar:1.9.11' in repository clojars.org (http://clojars.org/repo)
Downloading: https://repository.cloudera.com/artifactory/repo/org/codehaus/jackson/jackson-core-asl/1.9.11/jackson-core-asl-1.9.11.jar
226K downloaded  (jackson-core-asl-1.9.11.jar)
Downloading: http://repo1.maven.org/maven2/org/codehaus/plexus/plexus-interpolation/1.13/plexus-interpolation-1.13.jar
59K downloaded  (plexus-interpolation-1.13.jar)
[debug] execute contextualize
[INFO] [resources:resources {execution: default-resources}]
[INFO] Using 'UTF-8' encoding to copy filtered resources.
[INFO] Copying 7 resources
[INFO] Copying 0 resource
[INFO] Copying 7 resources
[INFO] [pax:compile {execution: default-compile}]
[INFO] Compiling 10 source files to <https://builds.apache.org/job/Streams%20Trunk/ws/streams-osgi-components/activity-subscriber/target/classes>
[INFO] [recovering meta-data]
[INFO] ------------------------------------------------------------------------
[ERROR] BUILD FAILURE
[INFO] ------------------------------------------------------------------------
[INFO] Compilation failure
Unable to locate the Javac Compiler in:
  /usr/lib/jvm/java-7-openjdk-amd64/jre/../lib/tools.jar
Please ensure you are using JDK 1.4 or above and
not a JRE (the com.sun.tools.javac.Main class is required).
In most cases you can change the location of your Java
installation by setting the JAVA_HOME environment variable.

[INFO] ------------------------------------------------------------------------
[INFO] For more information, run Maven with the -e switch
[INFO] ------------------------------------------------------------------------
[INFO] Total time: 1 minute 54 seconds
[INFO] Finished at: Thu Nov 13 06:42:11 UTC 2014
[INFO] Final Memory: 70M/692M
[INFO] ------------------------------------------------------------------------
[JENKINS] Archiving /jenkins/maven-repositories/0/org/apache/streams/build/wrapper-bundle-settings/0.1-SNAPSHOT/wrapper-bundle-settings-0.1-SNAPSHOT.pom to org.apache.streams.build/wrapper-bundle-settings/0.1-SNAPSHOT/wrapper-bundle-settings-0.1-SNAPSHOT.pom
/jenkins/maven-repositories/0/org/apache/streams/build/wrapper-bundle-settings/0.1-SNAPSHOT/wrapper-bundle-settings-0.1-SNAPSHOT.pom is not inside <https://builds.apache.org/job/Streams%20Trunk/ws/poms/wrappers/;> will archive in a separate pass
Sending artifact delta relative to Streams Trunk » apache-streams - wrapper instructions #92
Archived 1 artifacts
Archive block size is 32768
Received 0 blocks and 2650 bytes
Compression is 0.0%
Took 8.6 sec
[JENKINS] Archiving <https://builds.apache.org/job/Streams%20Trunk/ws/streams-osgi-components/activity-subscriber/pom.xml> to org.apache.streams.osgi.components/activity-subscriber/0.1-SNAPSHOT/activity-subscriber-0.1-SNAPSHOT.pom
Sending artifact delta relative to Streams Trunk » activity-subscriber-bundle [org.apache.streams.osgi.components.activitysubscriber] #92
Archived 1 artifacts
Archive block size is 32768
Received 0 blocks and 5329 bytes
Compression is 0.0%
Took 0.35 sec
[JENKINS] Archiving /jenkins/maven-repositories/0/org/apache/streams/build/provision/0.1-SNAPSHOT/provision-0.1-SNAPSHOT.pom to org.apache.streams.build/provision/0.1-SNAPSHOT/provision-0.1-SNAPSHOT.pom
/jenkins/maven-repositories/0/org/apache/streams/build/provision/0.1-SNAPSHOT/provision-0.1-SNAPSHOT.pom is not inside <https://builds.apache.org/job/Streams%20Trunk/ws/provision/;> will archive in a separate pass
Sending artifact delta relative to Streams Trunk » apache-streams - imported bundles #92
Archived 1 artifacts
Archive block size is 32768
Received 0 blocks and 1637 bytes
Compression is 0.0%
Took 0.34 sec
[JENKINS] Archiving /jenkins/maven-repositories/0/org/apache/streams/build/shared-plugin-settings/0.1-SNAPSHOT/shared-plugin-settings-0.1-SNAPSHOT.pom to org.apache.streams.build/shared-plugin-settings/0.1-SNAPSHOT/shared-plugin-settings-0.1-SNAPSHOT.pom
/jenkins/maven-repositories/0/org/apache/streams/build/shared-plugin-settings/0.1-SNAPSHOT/shared-plugin-settings-0.1-SNAPSHOT.pom is not inside <https://builds.apache.org/job/Streams%20Trunk/ws/poms/;> will archive in a separate pass
Sending artifact delta relative to Streams Trunk » apache-streams - plugin configuration #92
Archived 1 artifacts
Archive block size is 32768
Received 0 blocks and 3177 bytes
Compression is 0.0%
Took 0.23 sec
[JENKINS] Archiving /jenkins/maven-repositories/0/org/apache/streams/osgi/components/streams-osgi-components/0.1-SNAPSHOT/streams-osgi-components-0.1-SNAPSHOT.pom to org.apache.streams.osgi.components/streams-osgi-components/0.1-SNAPSHOT/streams-osgi-components-0.1-SNAPSHOT.pom
/jenkins/maven-repositories/0/org/apache/streams/osgi/components/streams-osgi-components/0.1-SNAPSHOT/streams-osgi-components-0.1-SNAPSHOT.pom is not inside <https://builds.apache.org/job/Streams%20Trunk/ws/streams-osgi-components/;> will archive in a separate pass
Sending artifact delta relative to Streams Trunk » Apache Streams OSGI Components #92
Archived 1 artifacts
Archive block size is 32768
Received 0 blocks and 1722 bytes
Compression is 0.0%
Took 1.9 sec
[JENKINS] Archiving /jenkins/maven-repositories/0/org/apache/streams/build/compiled-bundle-settings/0.1-SNAPSHOT/compiled-bundle-settings-0.1-SNAPSHOT.pom to org.apache.streams.build/compiled-bundle-settings/0.1-SNAPSHOT/compiled-bundle-settings-0.1-SNAPSHOT.pom
/jenkins/maven-repositories/0/org/apache/streams/build/compiled-bundle-settings/0.1-SNAPSHOT/compiled-bundle-settings-0.1-SNAPSHOT.pom is not inside <https://builds.apache.org/job/Streams%20Trunk/ws/poms/compiled/;> will archive in a separate pass
Sending artifact delta relative to Streams Trunk » apache-streams - bundle instructions #92
Archived 1 artifacts
Archive block size is 32768
Received 0 blocks and 3004 bytes
Compression is 0.0%
Took 0.31 sec
[JENKINS] Archiving /jenkins/maven-repositories/0/org/apache/streams/streams-project/0.1-SNAPSHOT/streams-project-0.1-SNAPSHOT.pom to org.apache.streams/streams-project/0.1-SNAPSHOT/streams-project-0.1-SNAPSHOT.pom
/jenkins/maven-repositories/0/org/apache/streams/streams-project/0.1-SNAPSHOT/streams-project-0.1-SNAPSHOT.pom is not inside <https://builds.apache.org/job/Streams%20Trunk/ws/;> will archive in a separate pass
Sending artifact delta relative to Streams Trunk » Apache Streams Project #92
Archived 1 artifacts
Archive block size is 32768
Received 0 blocks and 18632 bytes
Compression is 0.0%
Took 0.23 sec
channel stopped

Jenkins build is still unstable: Streams Trunk #92

Posted by Apache Jenkins Server <je...@builds.apache.org>.
See <https://builds.apache.org/job/Streams%20Trunk/changes>


Jenkins build is unstable: Streams Trunk #91

Posted by Apache Jenkins Server <je...@builds.apache.org>.
See <https://builds.apache.org/job/Streams%20Trunk/91/changes>


Build failed in Jenkins: Streams Trunk #90

Posted by Apache Jenkins Server <je...@builds.apache.org>.
See <https://builds.apache.org/job/Streams%20Trunk/90/changes>

Changes:

[sblackmon] use StreamsJacksonMapper with channel-specific date support

[sblackmon] deleting this was a mistake

[sblackmon] adding new test to SCM

[sblackmon] need to add these classes to SCM

[sblackmon] add license header

[sblackmon] revamped testing, more cases more conditions per test

------------------------------------------
[...truncated 649 lines...]
[INFO] Installing <https://builds.apache.org/job/Streams%20Trunk/ws/provision/pom.xml> to /jenkins/maven-repositories/0/org/apache/streams/build/provision/0.1-SNAPSHOT/provision-0.1-SNAPSHOT.pom
[INFO] ------------------------------------------------------------------------
[INFO] Building Apache Streams OSGI Components
[INFO]    task-segment: [clean, install]
[INFO] ------------------------------------------------------------------------
[INFO] [clean:clean {execution: default-clean}]
[INFO] [enforcer:enforce {execution: enforce-java}]
[INFO] [enforcer:enforce {execution: enforce-no-snapshots}]
-----------------------------------------------------
this realm = app0.child-container[org.apache.maven.plugins:maven-enforcer-plugin:1.3.1]
urls[0] = file:/jenkins/maven-repositories/0/org/apache/maven/plugins/maven-enforcer-plugin/1.3.1/maven-enforcer-plugin-1.3.1.jar
urls[1] = file:/jenkins/maven-repositories/0/org/codehaus/plexus/plexus-utils/1.5.8/plexus-utils-1.5.8.jar
urls[2] = file:/jenkins/maven-repositories/0/commons-lang/commons-lang/2.3/commons-lang-2.3.jar
urls[3] = file:/jenkins/maven-repositories/0/org/apache/maven/enforcer/enforcer-api/1.3.1/enforcer-api-1.3.1.jar
urls[4] = file:/jenkins/maven-repositories/0/org/apache/maven/enforcer/enforcer-rules/1.3.1/enforcer-rules-1.3.1.jar
urls[5] = file:/jenkins/maven-repositories/0/org/apache/maven/shared/maven-common-artifact-filters/1.4/maven-common-artifact-filters-1.4.jar
urls[6] = file:/jenkins/maven-repositories/0/org/beanshell/bsh/2.0b4/bsh-2.0b4.jar
urls[7] = file:/jenkins/maven-repositories/0/org/apache/maven/shared/maven-dependency-tree/2.1/maven-dependency-tree-2.1.jar
urls[8] = file:/jenkins/maven-repositories/0/org/codehaus/plexus/plexus-component-annotations/1.5.5/plexus-component-annotations-1.5.5.jar
urls[9] = file:/jenkins/maven-repositories/0/org/eclipse/aether/aether-util/0.9.0.M2/aether-util-0.9.0.M2.jar
urls[10] = file:/jenkins/maven-repositories/0/org/codehaus/plexus/plexus-i18n/1.0-beta-6/plexus-i18n-1.0-beta-6.jar
Number of imports: 10
import: org.codehaus.classworlds.Entry@a6c57a42
import: org.codehaus.classworlds.Entry@12f43f3b
import: org.codehaus.classworlds.Entry@20025374
import: org.codehaus.classworlds.Entry@f8e44ca4
import: org.codehaus.classworlds.Entry@92758522
import: org.codehaus.classworlds.Entry@ebf2705b
import: org.codehaus.classworlds.Entry@bb25e54
import: org.codehaus.classworlds.Entry@bece5185
import: org.codehaus.classworlds.Entry@3fee8e37
import: org.codehaus.classworlds.Entry@3fee19d8


this realm = plexus.core.maven
Number of imports: 10
import: org.codehaus.classworlds.Entry@a6c57a42
import: org.codehaus.classworlds.Entry@12f43f3b
import: org.codehaus.classworlds.Entry@20025374
import: org.codehaus.classworlds.Entry@f8e44ca4
import: org.codehaus.classworlds.Entry@92758522
import: org.codehaus.classworlds.Entry@ebf2705b
import: org.codehaus.classworlds.Entry@bb25e54
import: org.codehaus.classworlds.Entry@bece5185
import: org.codehaus.classworlds.Entry@3fee8e37
import: org.codehaus.classworlds.Entry@3fee19d8


this realm = plexus.core
urls[0] = file:/jenkins/maven2.1-interceptor.jar
urls[1] = file:/jenkins/maven-interceptor.jar
urls[2] = file:/home/jenkins/tools/maven/apache-maven-2.2.1/lib/maven-2.2.1-uber.jar
Number of imports: 10
import: org.codehaus.classworlds.Entry@a6c57a42
import: org.codehaus.classworlds.Entry@12f43f3b
import: org.codehaus.classworlds.Entry@20025374
import: org.codehaus.classworlds.Entry@f8e44ca4
import: org.codehaus.classworlds.Entry@92758522
import: org.codehaus.classworlds.Entry@ebf2705b
import: org.codehaus.classworlds.Entry@bb25e54
import: org.codehaus.classworlds.Entry@bece5185
import: org.codehaus.classworlds.Entry@3fee8e37
import: org.codehaus.classworlds.Entry@3fee19d8
-----------------------------------------------------
[WARNING] The parameter expression: 'project.build.resources' used in mojo: 'process' has been deprecated. Use 'project.resources' instead.
[INFO] [remote-resources:process {execution: default}]
[INFO] [site:attach-descriptor {execution: default-attach-descriptor}]
[INFO] [install:install {execution: default-install}]
[INFO] Installing <https://builds.apache.org/job/Streams%20Trunk/ws/streams-osgi-components/pom.xml> to /jenkins/maven-repositories/0/org/apache/streams/osgi/components/streams-osgi-components/0.1-SNAPSHOT/streams-osgi-components-0.1-SNAPSHOT.pom
[INFO] ------------------------------------------------------------------------
[INFO] Building activity-subscriber-bundle [org.apache.streams.osgi.components.activitysubscriber]
[INFO]    task-segment: [clean, install]
[INFO] ------------------------------------------------------------------------
[INFO] [clean:clean {execution: default-clean}]
Downloading: http://repo1.maven.org/maven2/org/apache/maven/plugins/maven-resources-plugin/2.5/maven-resources-plugin-2.5.pom
6K downloaded  (maven-resources-plugin-2.5.pom)
Downloading: http://repo1.maven.org/maven2/org/apache/maven/plugins/maven-plugins/19/maven-plugins-19.pom
10K downloaded  (maven-plugins-19.pom)
Downloading: http://repo1.maven.org/maven2/org/apache/maven/plugins/maven-resources-plugin/2.5/maven-resources-plugin-2.5.jar
25K downloaded  (maven-resources-plugin-2.5.jar)
[INFO] [enforcer:enforce {execution: enforce-java}]
[INFO] [enforcer:enforce {execution: enforce-no-snapshots}]
-----------------------------------------------------
this realm = app0.child-container[org.apache.maven.plugins:maven-enforcer-plugin:1.3.1]
urls[0] = file:/jenkins/maven-repositories/0/org/apache/maven/plugins/maven-enforcer-plugin/1.3.1/maven-enforcer-plugin-1.3.1.jar
urls[1] = file:/jenkins/maven-repositories/0/org/codehaus/plexus/plexus-utils/1.5.8/plexus-utils-1.5.8.jar
urls[2] = file:/jenkins/maven-repositories/0/commons-lang/commons-lang/2.3/commons-lang-2.3.jar
urls[3] = file:/jenkins/maven-repositories/0/org/apache/maven/enforcer/enforcer-api/1.3.1/enforcer-api-1.3.1.jar
urls[4] = file:/jenkins/maven-repositories/0/org/apache/maven/enforcer/enforcer-rules/1.3.1/enforcer-rules-1.3.1.jar
urls[5] = file:/jenkins/maven-repositories/0/org/apache/maven/shared/maven-common-artifact-filters/1.4/maven-common-artifact-filters-1.4.jar
urls[6] = file:/jenkins/maven-repositories/0/org/beanshell/bsh/2.0b4/bsh-2.0b4.jar
urls[7] = file:/jenkins/maven-repositories/0/org/apache/maven/shared/maven-dependency-tree/2.1/maven-dependency-tree-2.1.jar
urls[8] = file:/jenkins/maven-repositories/0/org/codehaus/plexus/plexus-component-annotations/1.5.5/plexus-component-annotations-1.5.5.jar
urls[9] = file:/jenkins/maven-repositories/0/org/eclipse/aether/aether-util/0.9.0.M2/aether-util-0.9.0.M2.jar
urls[10] = file:/jenkins/maven-repositories/0/org/codehaus/plexus/plexus-i18n/1.0-beta-6/plexus-i18n-1.0-beta-6.jar
Number of imports: 10
import: org.codehaus.classworlds.Entry@a6c57a42
import: org.codehaus.classworlds.Entry@12f43f3b
import: org.codehaus.classworlds.Entry@20025374
import: org.codehaus.classworlds.Entry@f8e44ca4
import: org.codehaus.classworlds.Entry@92758522
import: org.codehaus.classworlds.Entry@ebf2705b
import: org.codehaus.classworlds.Entry@bb25e54
import: org.codehaus.classworlds.Entry@bece5185
import: org.codehaus.classworlds.Entry@3fee8e37
import: org.codehaus.classworlds.Entry@3fee19d8


this realm = plexus.core.maven
Number of imports: 10
import: org.codehaus.classworlds.Entry@a6c57a42
import: org.codehaus.classworlds.Entry@12f43f3b
import: org.codehaus.classworlds.Entry@20025374
import: org.codehaus.classworlds.Entry@f8e44ca4
import: org.codehaus.classworlds.Entry@92758522
import: org.codehaus.classworlds.Entry@ebf2705b
import: org.codehaus.classworlds.Entry@bb25e54
import: org.codehaus.classworlds.Entry@bece5185
import: org.codehaus.classworlds.Entry@3fee8e37
import: org.codehaus.classworlds.Entry@3fee19d8


this realm = plexus.core
urls[0] = file:/jenkins/maven2.1-interceptor.jar
urls[1] = file:/jenkins/maven-interceptor.jar
urls[2] = file:/home/jenkins/tools/maven/apache-maven-2.2.1/lib/maven-2.2.1-uber.jar
Number of imports: 10
import: org.codehaus.classworlds.Entry@a6c57a42
import: org.codehaus.classworlds.Entry@12f43f3b
import: org.codehaus.classworlds.Entry@20025374
import: org.codehaus.classworlds.Entry@f8e44ca4
import: org.codehaus.classworlds.Entry@92758522
import: org.codehaus.classworlds.Entry@ebf2705b
import: org.codehaus.classworlds.Entry@bb25e54
import: org.codehaus.classworlds.Entry@bece5185
import: org.codehaus.classworlds.Entry@3fee8e37
import: org.codehaus.classworlds.Entry@3fee19d8
-----------------------------------------------------
Downloading: http://repo1.maven.org/maven2/org/osgi/osgi_R4_core/1.0/osgi_R4_core-1.0.pom
285b downloaded  (osgi_R4_core-1.0.pom)
Downloading: http://repo1.maven.org/maven2/org/codehaus/jackson/jackson-mrbean/1.9.11/jackson-mrbean-1.9.11.pom
1K downloaded  (jackson-mrbean-1.9.11.pom)
Downloading: http://clojars.org/repo/org/codehaus/jackson/jackson-mapper-asl/1.9.11/jackson-mapper-asl-1.9.11.pom
[INFO] Unable to find resource 'org.codehaus.jackson:jackson-mapper-asl:pom:1.9.11' in repository clojars.org (http://clojars.org/repo)
Downloading: https://repository.cloudera.com/artifactory/repo/org/codehaus/jackson/jackson-mapper-asl/1.9.11/jackson-mapper-asl-1.9.11.pom
1K downloaded  (jackson-mapper-asl-1.9.11.pom)
Downloading: http://clojars.org/repo/org/codehaus/jackson/jackson-core-asl/1.9.11/jackson-core-asl-1.9.11.pom
[INFO] Unable to find resource 'org.codehaus.jackson:jackson-core-asl:pom:1.9.11' in repository clojars.org (http://clojars.org/repo)
Downloading: https://repository.cloudera.com/artifactory/repo/org/codehaus/jackson/jackson-core-asl/1.9.11/jackson-core-asl-1.9.11.pom
1017b downloaded  (jackson-core-asl-1.9.11.pom)
Downloading: http://repo1.maven.org/maven2/org/osgi/osgi_R4_compendium/1.0/osgi_R4_compendium-1.0.pom
303b downloaded  (osgi_R4_compendium-1.0.pom)
[WARNING] The parameter expression: 'project.build.resources' used in mojo: 'process' has been deprecated. Use 'project.resources' instead.
[INFO] [remote-resources:process {execution: default}]
Downloading: http://repo1.maven.org/maven2/org/codehaus/jackson/jackson-mrbean/1.9.11/jackson-mrbean-1.9.11.jar
Downloading: http://repo1.maven.org/maven2/org/osgi/osgi_R4_core/1.0/osgi_R4_core-1.0.jar
65K downloaded  (jackson-mrbean-1.9.11.jar)
Downloading: http://repo1.maven.org/maven2/org/codehaus/jackson/jackson-mapper-asl/1.9.11/jackson-mapper-asl-1.9.11.jar
434K downloaded  (osgi_R4_core-1.0.jar)
Downloading: http://repo1.maven.org/maven2/org/osgi/osgi_R4_compendium/1.0/osgi_R4_compendium-1.0.jar
657K downloaded  (osgi_R4_compendium-1.0.jar)
762K downloaded  (jackson-mapper-asl-1.9.11.jar)
Downloading: http://clojars.org/repo/org/codehaus/jackson/jackson-core-asl/1.9.11/jackson-core-asl-1.9.11.jar
[INFO] Unable to find resource 'org.codehaus.jackson:jackson-core-asl:jar:1.9.11' in repository clojars.org (http://clojars.org/repo)
Downloading: https://repository.cloudera.com/artifactory/repo/org/codehaus/jackson/jackson-core-asl/1.9.11/jackson-core-asl-1.9.11.jar
226K downloaded  (jackson-core-asl-1.9.11.jar)
[debug] execute contextualize
[INFO] [resources:resources {execution: default-resources}]
[INFO] Using 'UTF-8' encoding to copy filtered resources.
[INFO] Copying 7 resources
[INFO] Copying 0 resource
[INFO] Copying 7 resources
[INFO] [pax:compile {execution: default-compile}]
[INFO] Compiling 10 source files to <https://builds.apache.org/job/Streams%20Trunk/ws/streams-osgi-components/activity-subscriber/target/classes>
[INFO] [recovering meta-data]
[INFO] ------------------------------------------------------------------------
[ERROR] BUILD FAILURE
[INFO] ------------------------------------------------------------------------
[INFO] Compilation failure
Unable to locate the Javac Compiler in:
  /usr/lib/jvm/java-7-openjdk-amd64/jre/../lib/tools.jar
Please ensure you are using JDK 1.4 or above and
not a JRE (the com.sun.tools.javac.Main class is required).
In most cases you can change the location of your Java
installation by setting the JAVA_HOME environment variable.

[INFO] ------------------------------------------------------------------------
[INFO] For more information, run Maven with the -e switch
[INFO] ------------------------------------------------------------------------
[INFO] Total time: 1 minute 14 seconds
[INFO] Finished at: Wed Nov 12 00:27:16 UTC 2014
[INFO] Final Memory: 71M/703M
[INFO] ------------------------------------------------------------------------
[JENKINS] Archiving /jenkins/maven-repositories/0/org/apache/streams/build/wrapper-bundle-settings/0.1-SNAPSHOT/wrapper-bundle-settings-0.1-SNAPSHOT.pom to org.apache.streams.build/wrapper-bundle-settings/0.1-SNAPSHOT/wrapper-bundle-settings-0.1-SNAPSHOT.pom
/jenkins/maven-repositories/0/org/apache/streams/build/wrapper-bundle-settings/0.1-SNAPSHOT/wrapper-bundle-settings-0.1-SNAPSHOT.pom is not inside <https://builds.apache.org/job/Streams%20Trunk/ws/poms/wrappers/;> will archive in a separate pass
Sending artifact delta relative to Streams Trunk » apache-streams - wrapper instructions #89
Archived 1 artifacts
Archive block size is 32768
Received 0 blocks and 2650 bytes
Compression is 0.0%
Took 17 sec
[JENKINS] Archiving <https://builds.apache.org/job/Streams%20Trunk/ws/streams-osgi-components/activity-subscriber/pom.xml> to org.apache.streams.osgi.components/activity-subscriber/0.1-SNAPSHOT/activity-subscriber-0.1-SNAPSHOT.pom
Sending artifact delta relative to Streams Trunk » activity-subscriber-bundle [org.apache.streams.osgi.components.activitysubscriber] #89
Archived 1 artifacts
Archive block size is 32768
Received 0 blocks and 5329 bytes
Compression is 0.0%
Took 0.22 sec
[JENKINS] Archiving /jenkins/maven-repositories/0/org/apache/streams/build/provision/0.1-SNAPSHOT/provision-0.1-SNAPSHOT.pom to org.apache.streams.build/provision/0.1-SNAPSHOT/provision-0.1-SNAPSHOT.pom
/jenkins/maven-repositories/0/org/apache/streams/build/provision/0.1-SNAPSHOT/provision-0.1-SNAPSHOT.pom is not inside <https://builds.apache.org/job/Streams%20Trunk/ws/provision/;> will archive in a separate pass
Sending artifact delta relative to Streams Trunk » apache-streams - imported bundles #89
Archived 1 artifacts
Archive block size is 32768
Received 0 blocks and 1637 bytes
Compression is 0.0%
Took 2.2 sec
[JENKINS] Archiving /jenkins/maven-repositories/0/org/apache/streams/build/shared-plugin-settings/0.1-SNAPSHOT/shared-plugin-settings-0.1-SNAPSHOT.pom to org.apache.streams.build/shared-plugin-settings/0.1-SNAPSHOT/shared-plugin-settings-0.1-SNAPSHOT.pom
/jenkins/maven-repositories/0/org/apache/streams/build/shared-plugin-settings/0.1-SNAPSHOT/shared-plugin-settings-0.1-SNAPSHOT.pom is not inside <https://builds.apache.org/job/Streams%20Trunk/ws/poms/;> will archive in a separate pass
Sending artifact delta relative to Streams Trunk » apache-streams - plugin configuration #89
Archived 1 artifacts
Archive block size is 32768
Received 0 blocks and 3177 bytes
Compression is 0.0%
Took 0.22 sec
[JENKINS] Archiving /jenkins/maven-repositories/0/org/apache/streams/osgi/components/streams-osgi-components/0.1-SNAPSHOT/streams-osgi-components-0.1-SNAPSHOT.pom to org.apache.streams.osgi.components/streams-osgi-components/0.1-SNAPSHOT/streams-osgi-components-0.1-SNAPSHOT.pom
/jenkins/maven-repositories/0/org/apache/streams/osgi/components/streams-osgi-components/0.1-SNAPSHOT/streams-osgi-components-0.1-SNAPSHOT.pom is not inside <https://builds.apache.org/job/Streams%20Trunk/ws/streams-osgi-components/;> will archive in a separate pass
Sending artifact delta relative to Streams Trunk » Apache Streams OSGI Components #89
Archived 1 artifacts
Archive block size is 32768
Received 0 blocks and 1722 bytes
Compression is 0.0%
Took 0.21 sec
[JENKINS] Archiving /jenkins/maven-repositories/0/org/apache/streams/build/compiled-bundle-settings/0.1-SNAPSHOT/compiled-bundle-settings-0.1-SNAPSHOT.pom to org.apache.streams.build/compiled-bundle-settings/0.1-SNAPSHOT/compiled-bundle-settings-0.1-SNAPSHOT.pom
/jenkins/maven-repositories/0/org/apache/streams/build/compiled-bundle-settings/0.1-SNAPSHOT/compiled-bundle-settings-0.1-SNAPSHOT.pom is not inside <https://builds.apache.org/job/Streams%20Trunk/ws/poms/compiled/;> will archive in a separate pass
Sending artifact delta relative to Streams Trunk » apache-streams - bundle instructions #89
Archived 1 artifacts
Archive block size is 32768
Received 0 blocks and 3004 bytes
Compression is 0.0%
Took 0.21 sec
[JENKINS] Archiving /jenkins/maven-repositories/0/org/apache/streams/streams-project/0.1-SNAPSHOT/streams-project-0.1-SNAPSHOT.pom to org.apache.streams/streams-project/0.1-SNAPSHOT/streams-project-0.1-SNAPSHOT.pom
/jenkins/maven-repositories/0/org/apache/streams/streams-project/0.1-SNAPSHOT/streams-project-0.1-SNAPSHOT.pom is not inside <https://builds.apache.org/job/Streams%20Trunk/ws/;> will archive in a separate pass
Sending artifact delta relative to Streams Trunk » Apache Streams Project #89
Archived 1 artifacts
Archive block size is 32768
Received 0 blocks and 18438 bytes
Compression is 0.0%
Took 0.22 sec
channel stopped

Jenkins build is still unstable: Streams Trunk #89

Posted by Apache Jenkins Server <je...@builds.apache.org>.
See <https://builds.apache.org/job/Streams%20Trunk/changes>


Jenkins build is still unstable: Streams Trunk #88

Posted by Apache Jenkins Server <je...@builds.apache.org>.
See <https://builds.apache.org/job/Streams%20Trunk/changes>


Jenkins build is still unstable: Streams Trunk #87

Posted by Apache Jenkins Server <je...@builds.apache.org>.
See <https://builds.apache.org/job/Streams%20Trunk/changes>


Jenkins build is still unstable: Streams Trunk #86

Posted by Apache Jenkins Server <je...@builds.apache.org>.
See <https://builds.apache.org/job/Streams%20Trunk/changes>


Jenkins build is still unstable: Streams Trunk #85

Posted by Apache Jenkins Server <je...@builds.apache.org>.
See <https://builds.apache.org/job/Streams%20Trunk/changes>


Jenkins build is still unstable: Streams Trunk #84

Posted by Apache Jenkins Server <je...@builds.apache.org>.
See <https://builds.apache.org/job/Streams%20Trunk/changes>


Jenkins build is unstable: Streams Trunk #83

Posted by Apache Jenkins Server <je...@builds.apache.org>.
See <https://builds.apache.org/job/Streams%20Trunk/83/changes>