You are viewing a plain text version of this content. The canonical link for it is here.
Posted to commits@cayenne.apache.org by Apache Jenkins Server <je...@builds.apache.org> on 2011/07/20 14:29:08 UTC

Build failed in Jenkins: Cayenne-30 » JDK 1.6 (latest),Ubuntu #135

See <https://builds.apache.org/job/Cayenne-30/./jdk=JDK%201.6%20(latest),label=Ubuntu/135/changes>

Changes:

[dkazimirchyk] CAY-1583 context.getObjectStore() returning null causing NullpointerException in DataMergeHandler

release notes

------------------------------------------
[...truncated 72493 lines...]
[INFO] Using 'UTF-8' encoding to copy filtered resources.
[INFO] Copying 1 resource
[INFO] [remote-resources:process {execution: default}]
[INFO] [compiler:compile {execution: default-compile}]
[INFO] Compiling 2 source files to /x1/jenkins/jenkins-slave/workspace/Cayenne-30/jdk/JDK 1.6 (latest)/label/Ubuntu/STABLE-3.0/framework/cayenne-agent/target/classes
[INFO] [resources:testResources {execution: default-testResources}]
[INFO] Using 'UTF-8' encoding to copy filtered resources.
[INFO] skip non existing resourceDirectory /x1/jenkins/jenkins-slave/workspace/Cayenne-30/jdk/JDK 1.6 (latest)/label/Ubuntu/STABLE-3.0/framework/cayenne-agent/src/test/resources
[INFO] Copying 7 resources
[INFO] [compiler:testCompile {execution: default-testCompile}]
[INFO] No sources to compile
[INFO] [surefire:test {execution: default-test}]
[INFO] Surefire report directory: /x1/jenkins/jenkins-slave/workspace/Cayenne-30/jdk/JDK 1.6 (latest)/label/Ubuntu/STABLE-3.0/framework/cayenne-agent/target/surefire-reports

-------------------------------------------------------
 T E S T S
-------------------------------------------------------
There are no tests to run.

Results :

Tests run: 0, Failures: 0, Errors: 0, Skipped: 0

[INFO] [jar:jar {execution: default-jar}]
[INFO] Building jar: /x1/jenkins/jenkins-slave/workspace/Cayenne-30/jdk/JDK 1.6 (latest)/label/Ubuntu/STABLE-3.0/framework/cayenne-agent/target/cayenne-agent-3.0-SNAPSHOT.jar
[INFO] Preparing source:jar
[WARNING] Removing: jar from forked lifecycle, to prevent recursive invocation.
[INFO] No goals needed for project - skipping
[INFO] [source:jar {execution: bundle-source-jar}]
[INFO] Building jar: /x1/jenkins/jenkins-slave/workspace/Cayenne-30/jdk/JDK 1.6 (latest)/label/Ubuntu/STABLE-3.0/framework/cayenne-agent/target/cayenne-agent-3.0-SNAPSHOT-sources.jar
[INFO] [install:install {execution: default-install}]
[INFO] Installing /x1/jenkins/jenkins-slave/workspace/Cayenne-30/jdk/JDK 1.6 (latest)/label/Ubuntu/STABLE-3.0/framework/cayenne-agent/target/cayenne-agent-3.0-SNAPSHOT.jar to /home/jenkins/.m2/repository/org/apache/cayenne/cayenne-agent/3.0-SNAPSHOT/cayenne-agent-3.0-SNAPSHOT.jar
[INFO] Installing /x1/jenkins/jenkins-slave/workspace/Cayenne-30/jdk/JDK 1.6 (latest)/label/Ubuntu/STABLE-3.0/framework/cayenne-agent/target/cayenne-agent-3.0-SNAPSHOT-sources.jar to /home/jenkins/.m2/repository/org/apache/cayenne/cayenne-agent/3.0-SNAPSHOT/cayenne-agent-3.0-SNAPSHOT-sources.jar
[INFO] ------------------------------------------------------------------------
[INFO] Building Cayenne Aggregated Server Jar
[INFO]    task-segment: [clean, install]
[INFO] ------------------------------------------------------------------------
[INFO] [clean:clean {execution: default-clean}]
[INFO] Deleting directory /x1/jenkins/jenkins-slave/workspace/Cayenne-30/jdk/JDK 1.6 (latest)/label/Ubuntu/STABLE-3.0/framework/cayenne-server/target
[INFO] [resources:resources {execution: default-resources}]
[INFO] Using 'UTF-8' encoding to copy filtered resources.
[INFO] skip non existing resourceDirectory /x1/jenkins/jenkins-slave/workspace/Cayenne-30/jdk/JDK 1.6 (latest)/label/Ubuntu/STABLE-3.0/framework/cayenne-server/src/main/resources
[INFO] [compiler:compile {execution: default-compile}]
[INFO] No sources to compile
[INFO] [resources:testResources {execution: default-testResources}]
[INFO] Using 'UTF-8' encoding to copy filtered resources.
[INFO] skip non existing resourceDirectory /x1/jenkins/jenkins-slave/workspace/Cayenne-30/jdk/JDK 1.6 (latest)/label/Ubuntu/STABLE-3.0/framework/cayenne-server/src/test/resources
[INFO] [compiler:testCompile {execution: default-testCompile}]
[INFO] No sources to compile
[INFO] [surefire:test {execution: default-test}]
[INFO] No tests to run.
[INFO] [jar:jar {execution: default-jar}]
[WARNING] JAR will be empty - no content was marked for inclusion!
[INFO] Building jar: /x1/jenkins/jenkins-slave/workspace/Cayenne-30/jdk/JDK 1.6 (latest)/label/Ubuntu/STABLE-3.0/framework/cayenne-server/target/cayenne-server-3.0-SNAPSHOT.jar
[INFO] [cayenne-build:aggregate-bin {execution: aggregate-all}]
[INFO] Expanding: /home/jenkins/.m2/repository/org/apache/cayenne/unpublished/cayenne-jdk1.5-unpublished/3.0-SNAPSHOT/cayenne-jdk1.5-unpublished-3.0-SNAPSHOT.jar into /x1/jenkins/jenkins-slave/workspace/Cayenne-30/jdk/JDK 1.6 (latest)/label/Ubuntu/STABLE-3.0/framework/cayenne-server/target/aggregate/unpack-bin
[INFO] Expanding: /home/jenkins/.m2/repository/org/apache/cayenne/unpublished/cayenne-jdk1.6-unpublished/3.0-SNAPSHOT/cayenne-jdk1.6-unpublished-3.0-SNAPSHOT.jar into /x1/jenkins/jenkins-slave/workspace/Cayenne-30/jdk/JDK 1.6 (latest)/label/Ubuntu/STABLE-3.0/framework/cayenne-server/target/aggregate/unpack-bin
[INFO] Expanding: /home/jenkins/.m2/repository/org/apache/cayenne/unpublished/cayenne-legal-unpublished/3.0-SNAPSHOT/cayenne-legal-unpublished-3.0-SNAPSHOT.jar into /x1/jenkins/jenkins-slave/workspace/Cayenne-30/jdk/JDK 1.6 (latest)/label/Ubuntu/STABLE-3.0/framework/cayenne-server/target/aggregate/unpack-bin
[INFO] Building jar: /x1/jenkins/jenkins-slave/workspace/Cayenne-30/jdk/JDK 1.6 (latest)/label/Ubuntu/STABLE-3.0/framework/cayenne-server/target/cayenne-server-3.0-SNAPSHOT.jar
[INFO] [cayenne-build:aggregate-sources {execution: aggregate-all}]
[INFO] Expanding: /home/jenkins/.m2/repository/org/apache/cayenne/unpublished/cayenne-jdk1.5-unpublished/3.0-SNAPSHOT/cayenne-jdk1.5-unpublished-3.0-SNAPSHOT-sources.jar into /x1/jenkins/jenkins-slave/workspace/Cayenne-30/jdk/JDK 1.6 (latest)/label/Ubuntu/STABLE-3.0/framework/cayenne-server/target/aggregate/unpack-sources
[INFO] Expanding: /home/jenkins/.m2/repository/org/apache/cayenne/unpublished/cayenne-jdk1.6-unpublished/3.0-SNAPSHOT/cayenne-jdk1.6-unpublished-3.0-SNAPSHOT-sources.jar into /x1/jenkins/jenkins-slave/workspace/Cayenne-30/jdk/JDK 1.6 (latest)/label/Ubuntu/STABLE-3.0/framework/cayenne-server/target/aggregate/unpack-sources
[INFO] Expanding: /home/jenkins/.m2/repository/org/apache/cayenne/unpublished/cayenne-legal-unpublished/3.0-SNAPSHOT/cayenne-legal-unpublished-3.0-SNAPSHOT-sources.jar into /x1/jenkins/jenkins-slave/workspace/Cayenne-30/jdk/JDK 1.6 (latest)/label/Ubuntu/STABLE-3.0/framework/cayenne-server/target/aggregate/unpack-sources
[INFO] Building jar: /x1/jenkins/jenkins-slave/workspace/Cayenne-30/jdk/JDK 1.6 (latest)/label/Ubuntu/STABLE-3.0/framework/cayenne-server/target/cayenne-server-3.0-SNAPSHOT-sources.jar
[INFO] [install:install {execution: default-install}]
[INFO] Installing /x1/jenkins/jenkins-slave/workspace/Cayenne-30/jdk/JDK 1.6 (latest)/label/Ubuntu/STABLE-3.0/framework/cayenne-server/target/cayenne-server-3.0-SNAPSHOT.jar to /home/jenkins/.m2/repository/org/apache/cayenne/cayenne-server/3.0-SNAPSHOT/cayenne-server-3.0-SNAPSHOT.jar
[INFO] Installing /x1/jenkins/jenkins-slave/workspace/Cayenne-30/jdk/JDK 1.6 (latest)/label/Ubuntu/STABLE-3.0/framework/cayenne-server/target/cayenne-server-3.0-SNAPSHOT-sources.jar to /home/jenkins/.m2/repository/org/apache/cayenne/cayenne-server/3.0-SNAPSHOT/cayenne-server-3.0-SNAPSHOT-sources.jar
[INFO] ------------------------------------------------------------------------
[INFO] Building Cayenne Aggregated Client Jar
[INFO]    task-segment: [clean, install]
[INFO] ------------------------------------------------------------------------
[INFO] [clean:clean {execution: default-clean}]
[INFO] Deleting directory /x1/jenkins/jenkins-slave/workspace/Cayenne-30/jdk/JDK 1.6 (latest)/label/Ubuntu/STABLE-3.0/framework/cayenne-client/target
[INFO] [resources:resources {execution: default-resources}]
[INFO] Using 'UTF-8' encoding to copy filtered resources.
[INFO] skip non existing resourceDirectory /x1/jenkins/jenkins-slave/workspace/Cayenne-30/jdk/JDK 1.6 (latest)/label/Ubuntu/STABLE-3.0/framework/cayenne-client/src/main/resources
[INFO] [compiler:compile {execution: default-compile}]
[INFO] No sources to compile
[INFO] [resources:testResources {execution: default-testResources}]
[INFO] Using 'UTF-8' encoding to copy filtered resources.
[INFO] skip non existing resourceDirectory /x1/jenkins/jenkins-slave/workspace/Cayenne-30/jdk/JDK 1.6 (latest)/label/Ubuntu/STABLE-3.0/framework/cayenne-client/src/test/resources
[INFO] [compiler:testCompile {execution: default-testCompile}]
[INFO] No sources to compile
[INFO] [surefire:test {execution: default-test}]
[INFO] No tests to run.
[INFO] [jar:jar {execution: default-jar}]
[WARNING] JAR will be empty - no content was marked for inclusion!
[INFO] Building jar: /x1/jenkins/jenkins-slave/workspace/Cayenne-30/jdk/JDK 1.6 (latest)/label/Ubuntu/STABLE-3.0/framework/cayenne-client/target/cayenne-client-3.0-SNAPSHOT.jar
[INFO] [cayenne-build:aggregate-bin {execution: aggregate-all}]
[INFO] Expanding: /home/jenkins/.m2/repository/org/apache/cayenne/unpublished/cayenne-jdk1.5-unpublished/3.0-SNAPSHOT/cayenne-jdk1.5-unpublished-3.0-SNAPSHOT.jar into /x1/jenkins/jenkins-slave/workspace/Cayenne-30/jdk/JDK 1.6 (latest)/label/Ubuntu/STABLE-3.0/framework/cayenne-client/target/aggregate/unpack-bin
[INFO] Expanding: /home/jenkins/.m2/repository/org/apache/cayenne/unpublished/cayenne-jdk1.6-unpublished/3.0-SNAPSHOT/cayenne-jdk1.6-unpublished-3.0-SNAPSHOT.jar into /x1/jenkins/jenkins-slave/workspace/Cayenne-30/jdk/JDK 1.6 (latest)/label/Ubuntu/STABLE-3.0/framework/cayenne-client/target/aggregate/unpack-bin
[INFO] Expanding: /home/jenkins/.m2/repository/org/apache/cayenne/unpublished/cayenne-legal-unpublished/3.0-SNAPSHOT/cayenne-legal-unpublished-3.0-SNAPSHOT.jar into /x1/jenkins/jenkins-slave/workspace/Cayenne-30/jdk/JDK 1.6 (latest)/label/Ubuntu/STABLE-3.0/framework/cayenne-client/target/aggregate/unpack-bin
[INFO] Building jar: /x1/jenkins/jenkins-slave/workspace/Cayenne-30/jdk/JDK 1.6 (latest)/label/Ubuntu/STABLE-3.0/framework/cayenne-client/target/cayenne-client-3.0-SNAPSHOT.jar
[INFO] [cayenne-build:aggregate-sources {execution: aggregate-all}]
[INFO] Expanding: /home/jenkins/.m2/repository/org/apache/cayenne/unpublished/cayenne-jdk1.5-unpublished/3.0-SNAPSHOT/cayenne-jdk1.5-unpublished-3.0-SNAPSHOT-sources.jar into /x1/jenkins/jenkins-slave/workspace/Cayenne-30/jdk/JDK 1.6 (latest)/label/Ubuntu/STABLE-3.0/framework/cayenne-client/target/aggregate/unpack-sources
[INFO] Expanding: /home/jenkins/.m2/repository/org/apache/cayenne/unpublished/cayenne-jdk1.6-unpublished/3.0-SNAPSHOT/cayenne-jdk1.6-unpublished-3.0-SNAPSHOT-sources.jar into /x1/jenkins/jenkins-slave/workspace/Cayenne-30/jdk/JDK 1.6 (latest)/label/Ubuntu/STABLE-3.0/framework/cayenne-client/target/aggregate/unpack-sources
[INFO] Expanding: /home/jenkins/.m2/repository/org/apache/cayenne/unpublished/cayenne-legal-unpublished/3.0-SNAPSHOT/cayenne-legal-unpublished-3.0-SNAPSHOT-sources.jar into /x1/jenkins/jenkins-slave/workspace/Cayenne-30/jdk/JDK 1.6 (latest)/label/Ubuntu/STABLE-3.0/framework/cayenne-client/target/aggregate/unpack-sources
[INFO] Building jar: /x1/jenkins/jenkins-slave/workspace/Cayenne-30/jdk/JDK 1.6 (latest)/label/Ubuntu/STABLE-3.0/framework/cayenne-client/target/cayenne-client-3.0-SNAPSHOT-sources.jar
[INFO] [install:install {execution: default-install}]
[INFO] Installing /x1/jenkins/jenkins-slave/workspace/Cayenne-30/jdk/JDK 1.6 (latest)/label/Ubuntu/STABLE-3.0/framework/cayenne-client/target/cayenne-client-3.0-SNAPSHOT.jar to /home/jenkins/.m2/repository/org/apache/cayenne/cayenne-client/3.0-SNAPSHOT/cayenne-client-3.0-SNAPSHOT.jar
[INFO] Installing /x1/jenkins/jenkins-slave/workspace/Cayenne-30/jdk/JDK 1.6 (latest)/label/Ubuntu/STABLE-3.0/framework/cayenne-client/target/cayenne-client-3.0-SNAPSHOT-sources.jar to /home/jenkins/.m2/repository/org/apache/cayenne/cayenne-client/3.0-SNAPSHOT/cayenne-client-3.0-SNAPSHOT-sources.jar
[INFO] ------------------------------------------------------------------------
[INFO] Building Cayenne Tools
[INFO]    task-segment: [clean, install]
[INFO] ------------------------------------------------------------------------
[INFO] [clean:clean {execution: default-clean}]
[INFO] Deleting directory /x1/jenkins/jenkins-slave/workspace/Cayenne-30/jdk/JDK 1.6 (latest)/label/Ubuntu/STABLE-3.0/framework/cayenne-tools/target
[INFO] [resources:resources {execution: default-resources}]
[INFO] Using 'UTF-8' encoding to copy filtered resources.
[INFO] Copying 1 resource
[INFO] [remote-resources:process {execution: default}]
[INFO] [compiler:compile {execution: default-compile}]
[INFO] Compiling 36 source files to /x1/jenkins/jenkins-slave/workspace/Cayenne-30/jdk/JDK 1.6 (latest)/label/Ubuntu/STABLE-3.0/framework/cayenne-tools/target/classes
[INFO] [resources:testResources {execution: default-testResources}]
[INFO] Using 'UTF-8' encoding to copy filtered resources.
[INFO] Copying 7 resources
[INFO] Copying 47 resources
[INFO] [compiler:testCompile {execution: default-testCompile}]
[INFO] Compiling 18 source files to /x1/jenkins/jenkins-slave/workspace/Cayenne-30/jdk/JDK 1.6 (latest)/label/Ubuntu/STABLE-3.0/framework/cayenne-tools/target/test-classes
[INFO] [surefire:test {execution: default-test}]
[INFO] Surefire report directory: /x1/jenkins/jenkins-slave/workspace/Cayenne-30/jdk/JDK 1.6 (latest)/label/Ubuntu/STABLE-3.0/framework/cayenne-tools/target/surefire-reports

-------------------------------------------------------
 T E S T S
-------------------------------------------------------
Running org.apache.cayenne.tools.DeploymentConfiguratorTest
Tests run: 4, Failures: 0, Errors: 0, Skipped: 0, Time elapsed: 0.123 sec
Running org.apache.cayenne.tools.NamePatternMatcherTest
Tests run: 3, Failures: 0, Errors: 0, Skipped: 0, Time elapsed: 0.007 sec
Running org.apache.cayenne.map.naming.SmartNamingStrategyTest
Tests run: 1, Failures: 0, Errors: 0, Skipped: 0, Time elapsed: 0.045 sec
Running org.apache.cayenne.tools.DbGeneratorTaskTest
Tests run: 4, Failures: 0, Errors: 0, Skipped: 0, Time elapsed: 0.033 sec
Running org.apache.cayenne.access.AbstractDbLoaderDelegateTest
Tests run: 5, Failures: 0, Errors: 0, Skipped: 0, Time elapsed: 0.021 sec
Running org.apache.cayenne.tools.CayenneGeneratorTaskCrossMapRelationshipsTest
Tests run: 2, Failures: 0, Errors: 0, Skipped: 0, Time elapsed: 0.282 sec
Running org.apache.cayenne.gen.ClassGeneratorTest
Tests run: 6, Failures: 0, Errors: 0, Skipped: 0, Time elapsed: 0.004 sec
Running org.apache.cayenne.tools.CayenneGeneratorTaskTest
Tests run: 7, Failures: 0, Errors: 0, Skipped: 0, Time elapsed: 0.459 sec
Running org.apache.cayenne.tools.AntDataPortDelegateTest
Tests run: 1, Failures: 0, Errors: 0, Skipped: 0, Time elapsed: 0.003 sec
Running org.apache.cayenne.gen.EntityUtilsTest
Tests run: 1, Failures: 0, Errors: 0, Skipped: 0, Time elapsed: 0.001 sec
Running org.apache.cayenne.gen.ClassGenerationActionTest
Tests run: 7, Failures: 0, Errors: 0, Skipped: 0, Time elapsed: 0.104 sec
Running org.apache.cayenne.gen.ClassGeneratorSingleTemplateTest
Tests run: 5, Failures: 0, Errors: 0, Skipped: 0, Time elapsed: 0.027 sec
Running org.apache.cayenne.gen.ClassGenerationInfoTest
Tests run: 1, Failures: 0, Errors: 0, Skipped: 0, Time elapsed: 0.001 sec
Running org.apache.cayenne.gen.ClassGeneratorSuperTemplateTest
Tests run: 5, Failures: 0, Errors: 0, Skipped: 0, Time elapsed: 0.035 sec
Running org.apache.cayenne.gen.ImportUtilsTest
Tests run: 14, Failures: 0, Errors: 0, Skipped: 0, Time elapsed: 0.005 sec

Results :

Tests run: 66, Failures: 0, Errors: 0, Skipped: 0

[INFO] [jar:jar {execution: default-jar}]
[INFO] Building jar: /x1/jenkins/jenkins-slave/workspace/Cayenne-30/jdk/JDK 1.6 (latest)/label/Ubuntu/STABLE-3.0/framework/cayenne-tools/target/cayenne-tools-3.0-SNAPSHOT.jar
[INFO] Preparing source:jar
[WARNING] Removing: jar from forked lifecycle, to prevent recursive invocation.
[INFO] No goals needed for project - skipping
[INFO] [source:jar {execution: bundle-source-jar}]
[INFO] Building jar: /x1/jenkins/jenkins-slave/workspace/Cayenne-30/jdk/JDK 1.6 (latest)/label/Ubuntu/STABLE-3.0/framework/cayenne-tools/target/cayenne-tools-3.0-SNAPSHOT-sources.jar
[INFO] [install:install {execution: default-install}]
[INFO] Installing /x1/jenkins/jenkins-slave/workspace/Cayenne-30/jdk/JDK 1.6 (latest)/label/Ubuntu/STABLE-3.0/framework/cayenne-tools/target/cayenne-tools-3.0-SNAPSHOT.jar to /home/jenkins/.m2/repository/org/apache/cayenne/cayenne-tools/3.0-SNAPSHOT/cayenne-tools-3.0-SNAPSHOT.jar
[INFO] Installing /x1/jenkins/jenkins-slave/workspace/Cayenne-30/jdk/JDK 1.6 (latest)/label/Ubuntu/STABLE-3.0/framework/cayenne-tools/target/cayenne-tools-3.0-SNAPSHOT-sources.jar to /home/jenkins/.m2/repository/org/apache/cayenne/cayenne-tools/3.0-SNAPSHOT/cayenne-tools-3.0-SNAPSHOT-sources.jar
[INFO] ------------------------------------------------------------------------
[INFO] Building Cayenne Modeler
[INFO]    task-segment: [clean, install]
[INFO] ------------------------------------------------------------------------
[INFO] [clean:clean {execution: default-clean}]
[INFO] Deleting directory /x1/jenkins/jenkins-slave/workspace/Cayenne-30/jdk/JDK 1.6 (latest)/label/Ubuntu/STABLE-3.0/framework/cayenne-modeler/target
[INFO] [resources:resources {execution: default-resources}]
[INFO] Using 'UTF-8' encoding to copy filtered resources.
[INFO] Copying 54 resources
[INFO] [remote-resources:process {execution: default}]
[INFO] [compiler:compile {execution: default-compile}]
[INFO] Compiling 450 source files to /x1/jenkins/jenkins-slave/workspace/Cayenne-30/jdk/JDK 1.6 (latest)/label/Ubuntu/STABLE-3.0/framework/cayenne-modeler/target/classes
[INFO] [resources:testResources {execution: default-testResources}]
[INFO] Using 'UTF-8' encoding to copy filtered resources.
[INFO] skip non existing resourceDirectory /x1/jenkins/jenkins-slave/workspace/Cayenne-30/jdk/JDK 1.6 (latest)/label/Ubuntu/STABLE-3.0/framework/cayenne-modeler/src/test/resources
[INFO] Copying 834 resources
[INFO] [compiler:testCompile {execution: default-testCompile}]
[INFO] Compiling 17 source files to /x1/jenkins/jenkins-slave/workspace/Cayenne-30/jdk/JDK 1.6 (latest)/label/Ubuntu/STABLE-3.0/framework/cayenne-modeler/target/test-classes
[INFO] [surefire:test {execution: default-test}]
[INFO] Surefire report directory: /x1/jenkins/jenkins-slave/workspace/Cayenne-30/jdk/JDK 1.6 (latest)/label/Ubuntu/STABLE-3.0/framework/cayenne-modeler/target/surefire-reports
#
# A fatal error has been detected by the Java Runtime Environment:
#
#  SIGBUS (0x7) at pc=0xf77397a4, pid=22189, tid=4138224496
#
# JRE version: 6.0_20-b02
# Java VM: Java HotSpot(TM) Server VM (16.3-b01 mixed mode linux-x86 )
# Problematic frame:
# C  [libc.so.6+0x1117a4]
#
# An error report file with more information is saved as:
# /x1/jenkins/jenkins-slave/workspace/Cayenne-30/jdk/JDK 1.6 (latest)/label/Ubuntu/STABLE-3.0/framework/cayenne-modeler/hs_err_pid22189.log
#
# If you would like to submit a bug report, please visit:
#   http://java.sun.com/webapps/bugreport/crash.jsp
#
Aborted
[INFO] ------------------------------------------------------------------------
[ERROR] BUILD FAILURE
[INFO] ------------------------------------------------------------------------
[INFO] There are test failures.

Please refer to /x1/jenkins/jenkins-slave/workspace/Cayenne-30/jdk/JDK 1.6 (latest)/label/Ubuntu/STABLE-3.0/framework/cayenne-modeler/target/surefire-reports for the individual test results.
[INFO] ------------------------------------------------------------------------
[INFO] Trace
org.apache.maven.BuildFailureException: There are test failures.

Please refer to /x1/jenkins/jenkins-slave/workspace/Cayenne-30/jdk/JDK 1.6 (latest)/label/Ubuntu/STABLE-3.0/framework/cayenne-modeler/target/surefire-reports for the individual test results.
	at org.apache.maven.lifecycle.DefaultLifecycleExecutor.executeGoals(DefaultLifecycleExecutor.java:715)
	at org.apache.maven.lifecycle.DefaultLifecycleExecutor.executeGoalWithLifecycle(DefaultLifecycleExecutor.java:556)
	at org.apache.maven.lifecycle.DefaultLifecycleExecutor.executeGoal(DefaultLifecycleExecutor.java:535)
	at org.apache.maven.lifecycle.DefaultLifecycleExecutor.executeGoalAndHandleFailures(DefaultLifecycleExecutor.java:387)
	at org.apache.maven.lifecycle.DefaultLifecycleExecutor.executeTaskSegments(DefaultLifecycleExecutor.java:348)
	at org.apache.maven.lifecycle.DefaultLifecycleExecutor.execute(DefaultLifecycleExecutor.java:180)
	at org.apache.maven.DefaultMaven.doExecute(DefaultMaven.java:328)
	at org.apache.maven.DefaultMaven.execute(DefaultMaven.java:138)
	at org.apache.maven.cli.MavenCli.main(MavenCli.java:362)
	at org.apache.maven.cli.compat.CompatibleMain.main(CompatibleMain.java:60)
	at sun.reflect.NativeMethodAccessorImpl.invoke0(Native Method)
	at sun.reflect.NativeMethodAccessorImpl.invoke(NativeMethodAccessorImpl.java:39)
	at sun.reflect.DelegatingMethodAccessorImpl.invoke(DelegatingMethodAccessorImpl.java:25)
	at java.lang.reflect.Method.invoke(Method.java:597)
	at org.codehaus.classworlds.Launcher.launchEnhanced(Launcher.java:315)
	at org.codehaus.classworlds.Launcher.launch(Launcher.java:255)
	at org.codehaus.classworlds.Launcher.mainWithExitCode(Launcher.java:430)
	at org.codehaus.classworlds.Launcher.main(Launcher.java:375)
Caused by: org.apache.maven.plugin.MojoFailureException: There are test failures.

Please refer to /x1/jenkins/jenkins-slave/workspace/Cayenne-30/jdk/JDK 1.6 (latest)/label/Ubuntu/STABLE-3.0/framework/cayenne-modeler/target/surefire-reports for the individual test results.
	at org.apache.maven.plugin.surefire.SurefirePlugin.execute(SurefirePlugin.java:629)
	at org.apache.maven.plugin.DefaultPluginManager.executeMojo(DefaultPluginManager.java:490)
	at org.apache.maven.lifecycle.DefaultLifecycleExecutor.executeGoals(DefaultLifecycleExecutor.java:694)
	... 17 more
[INFO] ------------------------------------------------------------------------
[INFO] Total time: 1 minute 18 seconds
[INFO] Finished at: Wed Jul 20 12:22:32 UTC 2011
[INFO] Final Memory: 103M/448M
[INFO] ------------------------------------------------------------------------
Recording test results


Jenkins build is back to normal : Cayenne-30 » JDK 1.6 (latest),Ubuntu #137

Posted by Apache Jenkins Server <je...@builds.apache.org>.
See <https://builds.apache.org/job/Cayenne-30/./jdk=JDK%201.6%20(latest),label=Ubuntu/137/changes>



Build failed in Jenkins: Cayenne-30 » JDK 1.6 (latest),Ubuntu #136

Posted by Apache Jenkins Server <je...@builds.apache.org>.
See <https://builds.apache.org/job/Cayenne-30/./jdk=JDK%201.6%20(latest),label=Ubuntu/136/changes>

Changes:

[dkazimirchyk] CAY-1469 Modeler: dbRelationships renaming problem

we need to update dbAttributePaths of all flattened ObjAttributes on dbRelationshipChanged event

------------------------------------------
[...truncated 77851 lines...]
Jul 27, 2011 8:34:45 AM org.apache.cayenne.access.QueryLogger logSelectCount
INFO: === returned 1 row. - took 0 ms.
Jul 27, 2011 8:34:45 AM org.apache.cayenne.access.QueryLogger logCommitTransaction
INFO: +++ transaction committed.
Jul 27, 2011 8:34:45 AM org.apache.cayenne.remote.BaseConnection sendMessage
INFO: === Message 1: Query done - took 2 ms.
Jul 27, 2011 8:34:45 AM org.apache.cayenne.remote.BaseConnection sendMessage
INFO: --- Message 2: Query
Jul 27, 2011 8:34:45 AM org.apache.cayenne.access.QueryLogger logQueryStart
INFO: --- will run 1 query.
Jul 27, 2011 8:34:45 AM org.apache.cayenne.access.QueryLogger logBeginTransaction
INFO: --- transaction started.
Jul 27, 2011 8:34:45 AM org.apache.cayenne.access.QueryLogger logQuery
INFO: SELECT t0.name, t0.id FROM defaults_table3 t0 WHERE t0.id = ? [bind: 1->id:2]
Jul 27, 2011 8:34:45 AM org.apache.cayenne.access.QueryLogger logSelectCount
INFO: === returned 1 row. - took 0 ms.
Jul 27, 2011 8:34:45 AM org.apache.cayenne.access.QueryLogger logCommitTransaction
INFO: +++ transaction committed.
Jul 27, 2011 8:34:45 AM org.apache.cayenne.remote.BaseConnection sendMessage
INFO: === Message 2: Query done - took 2 ms.
Tests run: 1, Failures: 0, Errors: 0, Skipped: 0, Time elapsed: 0.044 sec

Results :

Tests run: 9, Failures: 0, Errors: 0, Skipped: 0

[INFO] [jar:jar {execution: default-jar}]
[INFO] Building jar: <https://builds.apache.org/job/Cayenne-30/./jdk=JDK%201.6%20(latest),label=Ubuntu/ws/STABLE-3.0/itests/cayenne-api/target/cayenne-api-3.0-SNAPSHOT.jar>
[INFO] [install:install {execution: default-install}]
[INFO] Installing <https://builds.apache.org/job/Cayenne-30/./jdk=JDK%201.6%20(latest),label=Ubuntu/ws/STABLE-3.0/itests/cayenne-api/target/cayenne-api-3.0-SNAPSHOT.jar> to /home/hudson/.m2/repository/org/apache/cayenne/itests/cayenne-api/3.0-SNAPSHOT/cayenne-api-3.0-SNAPSHOT.jar
[INFO] ------------------------------------------------------------------------
[INFO] Building Integration Tests - POJO
[INFO]    task-segment: [clean, install]
[INFO] ------------------------------------------------------------------------
[INFO] [clean:clean {execution: default-clean}]
[INFO] [resources:resources {execution: default-resources}]
[INFO] Using 'UTF-8' encoding to copy filtered resources.
[INFO] Copying 3 resources
[INFO] [compiler:compile {execution: default-compile}]
[INFO] Compiling 4 source files to <https://builds.apache.org/job/Cayenne-30/./jdk=JDK%201.6%20(latest),label=Ubuntu/ws/STABLE-3.0/itests/pojo/target/classes>
[INFO] [resources:testResources {execution: default-testResources}]
[INFO] Using 'UTF-8' encoding to copy filtered resources.
[INFO] skip non existing resourceDirectory <https://builds.apache.org/job/Cayenne-30/./jdk=JDK%201.6%20(latest),label=Ubuntu/ws/STABLE-3.0/itests/pojo/src/test/resources>
[INFO] [compiler:testCompile {execution: default-testCompile}]
[INFO] Compiling 4 source files to <https://builds.apache.org/job/Cayenne-30/./jdk=JDK%201.6%20(latest),label=Ubuntu/ws/STABLE-3.0/itests/pojo/target/test-classes>
[INFO] [surefire:test {execution: default-test}]
[INFO] Surefire report directory: <https://builds.apache.org/job/Cayenne-30/./jdk=JDK%201.6%20(latest),label=Ubuntu/ws/STABLE-3.0/itests/pojo/target/surefire-reports>
*** CayenneAgent starting...

-------------------------------------------------------
 T E S T S
-------------------------------------------------------
Running org.apache.cayenne.itest.pojo.ExposedPkTest
log4j:WARN No appenders could be found for logger (org.apache.cayenne.conf.DefaultConfiguration).
log4j:WARN Please initialize the log4j system properly.
Tests run: 1, Failures: 0, Errors: 0, Skipped: 0, Time elapsed: 0.687 sec
Running org.apache.cayenne.itest.pojo.ManyToOneObjectTest
Tests run: 2, Failures: 0, Errors: 0, Skipped: 0, Time elapsed: 0.067 sec
Running org.apache.cayenne.itest.pojo.OneToManyObjectTest
Tests run: 3, Failures: 0, Errors: 0, Skipped: 0, Time elapsed: 0.026 sec
Running org.apache.cayenne.itest.pojo.SimpleObjectTest
Tests run: 4, Failures: 0, Errors: 0, Skipped: 0, Time elapsed: 0.015 sec

Results :

Tests run: 10, Failures: 0, Errors: 0, Skipped: 0

[INFO] [jar:jar {execution: default-jar}]
[INFO] Building jar: <https://builds.apache.org/job/Cayenne-30/./jdk=JDK%201.6%20(latest),label=Ubuntu/ws/STABLE-3.0/itests/pojo/target/pojo-3.0-SNAPSHOT.jar>
[INFO] [install:install {execution: default-install}]
[INFO] Installing <https://builds.apache.org/job/Cayenne-30/./jdk=JDK%201.6%20(latest),label=Ubuntu/ws/STABLE-3.0/itests/pojo/target/pojo-3.0-SNAPSHOT.jar> to /home/hudson/.m2/repository/org/apache/cayenne/itests/pojo/3.0-SNAPSHOT/pojo-3.0-SNAPSHOT.jar
[INFO] ------------------------------------------------------------------------
[INFO] Building Integration Tests - JPA Chapter 2
[INFO]    task-segment: [clean, install]
[INFO] ------------------------------------------------------------------------
[INFO] [clean:clean {execution: default-clean}]
[INFO] [resources:resources {execution: default-resources}]
[INFO] Using 'UTF-8' encoding to copy filtered resources.
[INFO] Copying 1 resource
[INFO] [compiler:compile {execution: default-compile}]
[INFO] Compiling 35 source files to <https://builds.apache.org/job/Cayenne-30/./jdk=JDK%201.6%20(latest),label=Ubuntu/ws/STABLE-3.0/itests/jpa-chapter2/target/classes>
[INFO] [resources:testResources {execution: default-testResources}]
[INFO] Using 'UTF-8' encoding to copy filtered resources.
[INFO] Copying 1 resource
[INFO] [compiler:testCompile {execution: default-testCompile}]
[INFO] Compiling 8 source files to <https://builds.apache.org/job/Cayenne-30/./jdk=JDK%201.6%20(latest),label=Ubuntu/ws/STABLE-3.0/itests/jpa-chapter2/target/test-classes>
[INFO] [surefire:test {execution: default-test}]
[INFO] Surefire report directory: <https://builds.apache.org/job/Cayenne-30/./jdk=JDK%201.6%20(latest),label=Ubuntu/ws/STABLE-3.0/itests/jpa-chapter2/target/surefire-reports>
*** CayenneAgent starting...

-------------------------------------------------------
 T E S T S
-------------------------------------------------------
Running org.apache.cayenne.jpa.itest.ch2._2_1_8_2_BidiManyToOneRelationshipTest
log4j:WARN No appenders could be found for logger (org.apache.cayenne.jpa.Provider).
log4j:WARN Please initialize the log4j system properly.
Tests run: 1, Failures: 0, Errors: 0, Skipped: 0, Time elapsed: 0.79 sec
Running org.apache.cayenne.jpa.itest.ch2._2_1_8_1_BidiOneToOneRelationshipsTest
Tests run: 1, Failures: 0, Errors: 0, Skipped: 0, Time elapsed: 0.006 sec
Running org.apache.cayenne.jpa.itest.ch2._2_1_5_EmbeddableTest
Tests run: 3, Failures: 0, Errors: 0, Skipped: 0, Time elapsed: 0.128 sec
Running org.apache.cayenne.jpa.itest.ch2._2_1_1_PeristentFieldsAndPropertiesTest
Tests run: 5, Failures: 0, Errors: 0, Skipped: 0, Time elapsed: 0.015 sec
Running org.apache.cayenne.jpa.itest.ch2._2_1_10_1_SingleTablePerClassTest
Tests run: 2, Failures: 0, Errors: 0, Skipped: 0, Time elapsed: 0.086 sec
Running org.apache.cayenne.jpa.itest.ch2._2_1_4_PrimaryKeyAndIdentityTest
Tests run: 2, Failures: 0, Errors: 0, Skipped: 0, Time elapsed: 0.009 sec
Running org.apache.cayenne.jpa.itest.ch2._2_1_6_MappingDefaultsNonRelationshipTest
Tests run: 4, Failures: 0, Errors: 0, Skipped: 0, Time elapsed: 0.234 sec
Running org.apache.cayenne.jpa.itest.ch2._2_1_7_EntityRelationshipsTest
Tests run: 2, Failures: 0, Errors: 0, Skipped: 0, Time elapsed: 0.007 sec

Results :

Tests run: 20, Failures: 0, Errors: 0, Skipped: 0

[INFO] [jar:jar {execution: default-jar}]
[INFO] Building jar: <https://builds.apache.org/job/Cayenne-30/./jdk=JDK%201.6%20(latest),label=Ubuntu/ws/STABLE-3.0/itests/jpa-chapter2/target/jpa-chapter2-3.0-SNAPSHOT.jar>
[INFO] [install:install {execution: default-install}]
[INFO] Installing <https://builds.apache.org/job/Cayenne-30/./jdk=JDK%201.6%20(latest),label=Ubuntu/ws/STABLE-3.0/itests/jpa-chapter2/target/jpa-chapter2-3.0-SNAPSHOT.jar> to /home/hudson/.m2/repository/org/apache/cayenne/itests/jpa-chapter2/3.0-SNAPSHOT/jpa-chapter2-3.0-SNAPSHOT.jar
[INFO] ------------------------------------------------------------------------
[INFO] Building Integration Tests - JPA Chapter 3
[INFO]    task-segment: [clean, install]
[INFO] ------------------------------------------------------------------------
[INFO] [clean:clean {execution: default-clean}]
[INFO] [resources:resources {execution: default-resources}]
[INFO] Using 'UTF-8' encoding to copy filtered resources.
[INFO] Copying 1 resource
[INFO] [compiler:compile {execution: default-compile}]
[INFO] Compiling 9 source files to <https://builds.apache.org/job/Cayenne-30/./jdk=JDK%201.6%20(latest),label=Ubuntu/ws/STABLE-3.0/itests/jpa-chapter3/target/classes>
[INFO] [resources:testResources {execution: default-testResources}]
[INFO] Using 'UTF-8' encoding to copy filtered resources.
[INFO] Copying 1 resource
[INFO] [compiler:testCompile {execution: default-testCompile}]
[INFO] Compiling 5 source files to <https://builds.apache.org/job/Cayenne-30/./jdk=JDK%201.6%20(latest),label=Ubuntu/ws/STABLE-3.0/itests/jpa-chapter3/target/test-classes>
[WARNING] <https://builds.apache.org/job/Cayenne-30/./jdk=JDK%201.6%20(latest),label=Ubuntu/ws/STABLE-3.0/itests/jpa-chapter3/src/test/java/org/apache/cayenne/jpa/itest/ch3/_3_6_1_QueryAPITest.java>:[30,22] sun.java2d.pipe.SpanShapeRenderer is Sun proprietary API and may be removed in a future release

[WARNING] <https://builds.apache.org/job/Cayenne-30/./jdk=JDK%201.6%20(latest),label=Ubuntu/ws/STABLE-3.0/itests/jpa-chapter3/src/test/java/org/apache/cayenne/jpa/itest/ch3/_3_6_1_QueryAPITest.java>:[30,22] sun.java2d.pipe.SpanShapeRenderer is Sun proprietary API and may be removed in a future release

[INFO] [surefire:test {execution: default-test}]
[INFO] Surefire report directory: <https://builds.apache.org/job/Cayenne-30/./jdk=JDK%201.6%20(latest),label=Ubuntu/ws/STABLE-3.0/itests/jpa-chapter3/target/surefire-reports>
*** CayenneAgent starting...

-------------------------------------------------------
 T E S T S
-------------------------------------------------------
Running org.apache.cayenne.jpa.itest.ch3._3_1_1_EntityManagerTransactionTest
log4j:WARN No appenders could be found for logger (org.apache.cayenne.jpa.Provider).
log4j:WARN Please initialize the log4j system properly.
Tests run: 1, Failures: 0, Errors: 0, Skipped: 0, Time elapsed: 0.734 sec
Running org.apache.cayenne.jpa.itest.ch3._3_1_1_EntityManagerTest
Tests run: 12, Failures: 0, Errors: 0, Skipped: 0, Time elapsed: 0.13 sec
Running org.apache.cayenne.jpa.itest.ch3._3_6_1_QueryAPITest
Tests run: 8, Failures: 0, Errors: 0, Skipped: 0, Time elapsed: 0.036 sec
Running org.apache.cayenne.jpa.itest.ch3._3_6_6_SQLQueriesTest
Tests run: 2, Failures: 0, Errors: 0, Skipped: 0, Time elapsed: 0.005 sec
Running org.apache.cayenne.jpa.itest.ch3._3_5_1_LifecycleCallbackMethodsTest
Tests run: 2, Failures: 0, Errors: 0, Skipped: 0, Time elapsed: 0.009 sec

Results :

Tests run: 25, Failures: 0, Errors: 0, Skipped: 0

[INFO] [jar:jar {execution: default-jar}]
[INFO] Building jar: <https://builds.apache.org/job/Cayenne-30/./jdk=JDK%201.6%20(latest),label=Ubuntu/ws/STABLE-3.0/itests/jpa-chapter3/target/jpa-chapter3-3.0-SNAPSHOT.jar>
[INFO] [install:install {execution: default-install}]
[INFO] Installing <https://builds.apache.org/job/Cayenne-30/./jdk=JDK%201.6%20(latest),label=Ubuntu/ws/STABLE-3.0/itests/jpa-chapter3/target/jpa-chapter3-3.0-SNAPSHOT.jar> to /home/hudson/.m2/repository/org/apache/cayenne/itests/jpa-chapter3/3.0-SNAPSHOT/jpa-chapter3-3.0-SNAPSHOT.jar
[INFO] ------------------------------------------------------------------------
[INFO] Building Integration Tests - JPA Chapter 5
[INFO]    task-segment: [clean, install]
[INFO] ------------------------------------------------------------------------
[INFO] [clean:clean {execution: default-clean}]
[INFO] [resources:resources {execution: default-resources}]
[INFO] Using 'UTF-8' encoding to copy filtered resources.
[INFO] Copying 1 resource
[INFO] [compiler:compile {execution: default-compile}]
[INFO] Compiling 2 source files to <https://builds.apache.org/job/Cayenne-30/./jdk=JDK%201.6%20(latest),label=Ubuntu/ws/STABLE-3.0/itests/jpa-chapter5/target/classes>
[INFO] [resources:testResources {execution: default-testResources}]
[INFO] Using 'UTF-8' encoding to copy filtered resources.
[INFO] Copying 1 resource
[INFO] [compiler:testCompile {execution: default-testCompile}]
[INFO] Compiling 3 source files to <https://builds.apache.org/job/Cayenne-30/./jdk=JDK%201.6%20(latest),label=Ubuntu/ws/STABLE-3.0/itests/jpa-chapter5/target/test-classes>
[INFO] [surefire:test {execution: default-test}]
[INFO] Surefire report directory: <https://builds.apache.org/job/Cayenne-30/./jdk=JDK%201.6%20(latest),label=Ubuntu/ws/STABLE-3.0/itests/jpa-chapter5/target/surefire-reports>
*** CayenneAgent starting...

-------------------------------------------------------
 T E S T S
-------------------------------------------------------
Running org.apache.cayenne.jpa.itest.ch5._5_5_2_ResourceLocalEntityManagerTest
Tests run: 1, Failures: 0, Errors: 0, Skipped: 0, Time elapsed: 0.023 sec
Running org.apache.cayenne.jpa.itest.ch5._5_5_1_JtaEntityManagerTest
Apache OpenEJB 3.0    build: 20080408-04:13
http://openejb.apache.org/
log4j:WARN No appenders could be found for logger (org.apache.cayenne.jpa.Provider).
log4j:WARN Please initialize the log4j system properly.
Tests run: 2, Failures: 0, Errors: 1, Skipped: 0, Time elapsed: 1.902 sec <<< FAILURE!
Running org.apache.cayenne.jpa.itest.ch5._5_4_EntityMangerFactoryTest
Tests run: 2, Failures: 0, Errors: 0, Skipped: 0, Time elapsed: 0.056 sec

Results :

Tests in error: 
  testPersist(org.apache.cayenne.jpa.itest.ch5._5_5_1_JtaEntityManagerTest)

Tests run: 5, Failures: 0, Errors: 1, Skipped: 0

[INFO] ------------------------------------------------------------------------
[ERROR] BUILD FAILURE
[INFO] ------------------------------------------------------------------------
[INFO] There are test failures.

Please refer to <https://builds.apache.org/job/Cayenne-30/./jdk=JDK%201.6%20(latest),label=Ubuntu/ws/STABLE-3.0/itests/jpa-chapter5/target/surefire-reports> for the individual test results.
[INFO] ------------------------------------------------------------------------
[INFO] Trace
org.apache.maven.BuildFailureException: There are test failures.

Please refer to <https://builds.apache.org/job/Cayenne-30/./jdk=JDK%201.6%20(latest),label=Ubuntu/ws/STABLE-3.0/itests/jpa-chapter5/target/surefire-reports> for the individual test results.
	at org.apache.maven.lifecycle.DefaultLifecycleExecutor.executeGoals(DefaultLifecycleExecutor.java:715)
	at org.apache.maven.lifecycle.DefaultLifecycleExecutor.executeGoalWithLifecycle(DefaultLifecycleExecutor.java:556)
	at org.apache.maven.lifecycle.DefaultLifecycleExecutor.executeGoal(DefaultLifecycleExecutor.java:535)
	at org.apache.maven.lifecycle.DefaultLifecycleExecutor.executeGoalAndHandleFailures(DefaultLifecycleExecutor.java:387)
	at org.apache.maven.lifecycle.DefaultLifecycleExecutor.executeTaskSegments(DefaultLifecycleExecutor.java:348)
	at org.apache.maven.lifecycle.DefaultLifecycleExecutor.execute(DefaultLifecycleExecutor.java:180)
	at org.apache.maven.DefaultMaven.doExecute(DefaultMaven.java:328)
	at org.apache.maven.DefaultMaven.execute(DefaultMaven.java:138)
	at org.apache.maven.cli.MavenCli.main(MavenCli.java:362)
	at org.apache.maven.cli.compat.CompatibleMain.main(CompatibleMain.java:60)
	at sun.reflect.NativeMethodAccessorImpl.invoke0(Native Method)
	at sun.reflect.NativeMethodAccessorImpl.invoke(NativeMethodAccessorImpl.java:39)
	at sun.reflect.DelegatingMethodAccessorImpl.invoke(DelegatingMethodAccessorImpl.java:25)
	at java.lang.reflect.Method.invoke(Method.java:597)
	at org.codehaus.classworlds.Launcher.launchEnhanced(Launcher.java:315)
	at org.codehaus.classworlds.Launcher.launch(Launcher.java:255)
	at org.codehaus.classworlds.Launcher.mainWithExitCode(Launcher.java:430)
	at org.codehaus.classworlds.Launcher.main(Launcher.java:375)
Caused by: org.apache.maven.plugin.MojoFailureException: There are test failures.

Please refer to <https://builds.apache.org/job/Cayenne-30/./jdk=JDK%201.6%20(latest),label=Ubuntu/ws/STABLE-3.0/itests/jpa-chapter5/target/surefire-reports> for the individual test results.
	at org.apache.maven.plugin.surefire.SurefirePlugin.execute(SurefirePlugin.java:629)
	at org.apache.maven.plugin.DefaultPluginManager.executeMojo(DefaultPluginManager.java:490)
	at org.apache.maven.lifecycle.DefaultLifecycleExecutor.executeGoals(DefaultLifecycleExecutor.java:694)
	... 17 more
[INFO] ------------------------------------------------------------------------
[INFO] Total time: 1 minute 56 seconds
[INFO] Finished at: Wed Jul 27 08:34:57 UTC 2011
[INFO] Final Memory: 149M/473M
[INFO] ------------------------------------------------------------------------
Recording test results