You are viewing a plain text version of this content. The canonical link for it is here.
Posted to dev@nutch.apache.org by Apache Jenkins Server <je...@builds.apache.org> on 2011/10/31 05:26:04 UTC

Build failed in Jenkins: Nutch-nutchgora-ant #8

See <https://builds.apache.org/job/Nutch-nutchgora-ant/8/>

------------------------------------------
[...truncated 1009 lines...]
A         src/plugin/index-more/src/java/org/apache/nutch/indexer/more
A         src/plugin/index-more/src/java/org/apache/nutch/indexer/more/MoreIndexingFilter.java
A         src/plugin/index-more/src/java/org/apache/nutch/indexer/more/package.html
A         src/plugin/index-more/plugin.xml
A         src/plugin/index-more/build.xml
AU        src/plugin/plugin.dtd
A         src/plugin/parse-ext
A         src/plugin/parse-ext/ivy.xml
A         src/plugin/parse-ext/src
A         src/plugin/parse-ext/src/test
A         src/plugin/parse-ext/src/test/org
A         src/plugin/parse-ext/src/test/org/apache
A         src/plugin/parse-ext/src/test/org/apache/nutch
A         src/plugin/parse-ext/src/test/org/apache/nutch/parse
A         src/plugin/parse-ext/src/test/org/apache/nutch/parse/ext
A         src/plugin/parse-ext/src/test/org/apache/nutch/parse/ext/TestExtParser.java
A         src/plugin/parse-ext/src/java
A         src/plugin/parse-ext/src/java/org
A         src/plugin/parse-ext/src/java/org/apache
A         src/plugin/parse-ext/src/java/org/apache/nutch
A         src/plugin/parse-ext/src/java/org/apache/nutch/parse
A         src/plugin/parse-ext/src/java/org/apache/nutch/parse/ext
A         src/plugin/parse-ext/src/java/org/apache/nutch/parse/ext/ExtParser.java
A         src/plugin/parse-ext/plugin.xml
A         src/plugin/parse-ext/build.xml
A         src/plugin/parse-ext/command
A         src/plugin/urlnormalizer-pass
A         src/plugin/urlnormalizer-pass/ivy.xml
A         src/plugin/urlnormalizer-pass/src
A         src/plugin/urlnormalizer-pass/src/test
A         src/plugin/urlnormalizer-pass/src/test/org
A         src/plugin/urlnormalizer-pass/src/test/org/apache
A         src/plugin/urlnormalizer-pass/src/test/org/apache/nutch
A         src/plugin/urlnormalizer-pass/src/test/org/apache/nutch/net
A         src/plugin/urlnormalizer-pass/src/test/org/apache/nutch/net/urlnormalizer
A         src/plugin/urlnormalizer-pass/src/test/org/apache/nutch/net/urlnormalizer/pass
AU        src/plugin/urlnormalizer-pass/src/test/org/apache/nutch/net/urlnormalizer/pass/TestPassURLNormalizer.java
A         src/plugin/urlnormalizer-pass/src/java
A         src/plugin/urlnormalizer-pass/src/java/org
A         src/plugin/urlnormalizer-pass/src/java/org/apache
A         src/plugin/urlnormalizer-pass/src/java/org/apache/nutch
A         src/plugin/urlnormalizer-pass/src/java/org/apache/nutch/net
A         src/plugin/urlnormalizer-pass/src/java/org/apache/nutch/net/urlnormalizer
A         src/plugin/urlnormalizer-pass/src/java/org/apache/nutch/net/urlnormalizer/pass
AU        src/plugin/urlnormalizer-pass/src/java/org/apache/nutch/net/urlnormalizer/pass/PassURLNormalizer.java
AU        src/plugin/urlnormalizer-pass/plugin.xml
AU        src/plugin/urlnormalizer-pass/build.xml
A         src/plugin/parse-html
A         src/plugin/parse-html/ivy.xml
A         src/plugin/parse-html/lib
A         src/plugin/parse-html/lib/tagsoup.LICENSE.txt
A         src/plugin/parse-html/src
A         src/plugin/parse-html/src/test
A         src/plugin/parse-html/src/test/org
A         src/plugin/parse-html/src/test/org/apache
A         src/plugin/parse-html/src/test/org/apache/nutch
A         src/plugin/parse-html/src/test/org/apache/nutch/parse
A         src/plugin/parse-html/src/test/org/apache/nutch/parse/html
A         src/plugin/parse-html/src/test/org/apache/nutch/parse/html/TestRobotsMetaProcessor.java
A         src/plugin/parse-html/src/test/org/apache/nutch/parse/html/TestDOMContentUtils.java
A         src/plugin/parse-html/src/java
A         src/plugin/parse-html/src/java/org
A         src/plugin/parse-html/src/java/org/apache
A         src/plugin/parse-html/src/java/org/apache/nutch
A         src/plugin/parse-html/src/java/org/apache/nutch/parse
A         src/plugin/parse-html/src/java/org/apache/nutch/parse/html
A         src/plugin/parse-html/src/java/org/apache/nutch/parse/html/HtmlParser.java
A         src/plugin/parse-html/src/java/org/apache/nutch/parse/html/XMLCharacterRecognizer.java
A         src/plugin/parse-html/src/java/org/apache/nutch/parse/html/DOMBuilder.java
A         src/plugin/parse-html/src/java/org/apache/nutch/parse/html/DOMContentUtils.java
A         src/plugin/parse-html/src/java/org/apache/nutch/parse/html/HTMLMetaProcessor.java
A         src/plugin/parse-html/src/java/org/apache/nutch/parse/html/package.html
AU        src/plugin/parse-html/plugin.xml
AU        src/plugin/parse-html/build.xml
A         src/plugin/urlfilter-domain
A         src/plugin/urlfilter-domain/ivy.xml
A         src/plugin/urlfilter-domain/src
A         src/plugin/urlfilter-domain/src/test
A         src/plugin/urlfilter-domain/src/test/org
A         src/plugin/urlfilter-domain/src/test/org/apache
A         src/plugin/urlfilter-domain/src/test/org/apache/nutch
A         src/plugin/urlfilter-domain/src/test/org/apache/nutch/urlfilter
A         src/plugin/urlfilter-domain/src/test/org/apache/nutch/urlfilter/domain
A         src/plugin/urlfilter-domain/src/test/org/apache/nutch/urlfilter/domain/TestDomainURLFilter.java
A         src/plugin/urlfilter-domain/src/java
A         src/plugin/urlfilter-domain/src/java/org
A         src/plugin/urlfilter-domain/src/java/org/apache
A         src/plugin/urlfilter-domain/src/java/org/apache/nutch
A         src/plugin/urlfilter-domain/src/java/org/apache/nutch/urlfilter
A         src/plugin/urlfilter-domain/src/java/org/apache/nutch/urlfilter/domain
A         src/plugin/urlfilter-domain/src/java/org/apache/nutch/urlfilter/domain/DomainURLFilter.java
A         src/plugin/urlfilter-domain/src/java/org/apache/nutch/urlfilter/domain/package.html
A         src/plugin/urlfilter-domain/data
A         src/plugin/urlfilter-domain/data/hosts.txt
A         src/plugin/urlfilter-domain/plugin.xml
A         src/plugin/urlfilter-domain/build.xml
A         src/plugin/protocol-httpclient
A         src/plugin/protocol-httpclient/ivy.xml
A         src/plugin/protocol-httpclient/src
A         src/plugin/protocol-httpclient/src/test
A         src/plugin/protocol-httpclient/src/test/conf
A         src/plugin/protocol-httpclient/src/test/conf/nutch-site-test.xml
A         src/plugin/protocol-httpclient/src/test/conf/httpclient-auth-test.xml
A         src/plugin/protocol-httpclient/src/test/org
A         src/plugin/protocol-httpclient/src/test/org/apache
A         src/plugin/protocol-httpclient/src/test/org/apache/nutch
A         src/plugin/protocol-httpclient/src/test/org/apache/nutch/protocol
A         src/plugin/protocol-httpclient/src/test/org/apache/nutch/protocol/httpclient
A         src/plugin/protocol-httpclient/src/test/org/apache/nutch/protocol/httpclient/TestProtocolHttpClient.java
A         src/plugin/protocol-httpclient/src/java
A         src/plugin/protocol-httpclient/src/java/org
A         src/plugin/protocol-httpclient/src/java/org/apache
A         src/plugin/protocol-httpclient/src/java/org/apache/nutch
A         src/plugin/protocol-httpclient/src/java/org/apache/nutch/protocol
A         src/plugin/protocol-httpclient/src/java/org/apache/nutch/protocol/httpclient
AU        src/plugin/protocol-httpclient/src/java/org/apache/nutch/protocol/httpclient/Http.java
AU        src/plugin/protocol-httpclient/src/java/org/apache/nutch/protocol/httpclient/HttpAuthentication.java
AU        src/plugin/protocol-httpclient/src/java/org/apache/nutch/protocol/httpclient/DummySSLProtocolSocketFactory.java
AU        src/plugin/protocol-httpclient/src/java/org/apache/nutch/protocol/httpclient/HttpBasicAuthentication.java
AU        src/plugin/protocol-httpclient/src/java/org/apache/nutch/protocol/httpclient/HttpAuthenticationFactory.java
AU        src/plugin/protocol-httpclient/src/java/org/apache/nutch/protocol/httpclient/DummyX509TrustManager.java
AU        src/plugin/protocol-httpclient/src/java/org/apache/nutch/protocol/httpclient/HttpAuthenticationException.java
AU        src/plugin/protocol-httpclient/src/java/org/apache/nutch/protocol/httpclient/HttpResponse.java
AU        src/plugin/protocol-httpclient/src/java/org/apache/nutch/protocol/httpclient/package.html
A         src/plugin/protocol-httpclient/jsp
A         src/plugin/protocol-httpclient/jsp/ntlm.jsp
A         src/plugin/protocol-httpclient/jsp/cookies.jsp
A         src/plugin/protocol-httpclient/jsp/noauth.jsp
A         src/plugin/protocol-httpclient/jsp/digest.jsp
A         src/plugin/protocol-httpclient/jsp/basic.jsp
AU        src/plugin/protocol-httpclient/plugin.xml
AU        src/plugin/protocol-httpclient/build.xml
A         src/plugin/protocol-http
A         src/plugin/protocol-http/ivy.xml
A         src/plugin/protocol-http/src
A         src/plugin/protocol-http/src/java
A         src/plugin/protocol-http/src/java/org
A         src/plugin/protocol-http/src/java/org/apache
A         src/plugin/protocol-http/src/java/org/apache/nutch
A         src/plugin/protocol-http/src/java/org/apache/nutch/protocol
A         src/plugin/protocol-http/src/java/org/apache/nutch/protocol/http
AU        src/plugin/protocol-http/src/java/org/apache/nutch/protocol/http/Http.java
A         src/plugin/protocol-http/src/java/org/apache/nutch/protocol/http/HttpResponse.java
A         src/plugin/protocol-http/src/java/org/apache/nutch/protocol/http/package.html
AU        src/plugin/protocol-http/plugin.xml
AU        src/plugin/protocol-http/build.xml
A         pom.xml
A         KEYS
A         README.txt
A         doap.rdf
A         build.xml
 U        .
At revision 1195327
no change for https://svn.apache.org/repos/asf/nutch/branches/nutchgora since the previous build
[nutchgora] $ /home/hudson/tools/ant/apache-ant-1.8.2/bin/ant nightly
Buildfile: /zonestorage/hudson_solaris/home/hudson/hudson-slave/workspace/Nutch-nutchgora-ant/nutchgora/build.xml
  [taskdef] Could not load definitions from resource org/sonar/ant/antlib.xml. It could not be found.

ivy-probe-antlib:

ivy-download:
  [taskdef] Could not load definitions from resource org/sonar/ant/antlib.xml. It could not be found.

-ivy-download-unchecked:

ivy-init-antlib:

ivy-init:

init:
    [mkdir] Created dir: /zonestorage/hudson_solaris/home/hudson/hudson-slave/workspace/Nutch-nutchgora-ant/nutchgora/build
    [mkdir] Created dir: /zonestorage/hudson_solaris/home/hudson/hudson-slave/workspace/Nutch-nutchgora-ant/nutchgora/build/classes
    [mkdir] Created dir: /zonestorage/hudson_solaris/home/hudson/hudson-slave/workspace/Nutch-nutchgora-ant/nutchgora/build/release
    [mkdir] Created dir: /zonestorage/hudson_solaris/home/hudson/hudson-slave/workspace/Nutch-nutchgora-ant/nutchgora/build/test
    [mkdir] Created dir: /zonestorage/hudson_solaris/home/hudson/hudson-slave/workspace/Nutch-nutchgora-ant/nutchgora/build/test/classes
     [copy] Copying 9 files to /zonestorage/hudson_solaris/home/hudson/hudson-slave/workspace/Nutch-nutchgora-ant/nutchgora/conf
     [copy] Copying /zonestorage/hudson_solaris/home/hudson/hudson-slave/workspace/Nutch-nutchgora-ant/nutchgora/conf/automaton-urlfilter.txt.template to /zonestorage/hudson_solaris/home/hudson/hudson-slave/workspace/Nutch-nutchgora-ant/nutchgora/conf/automaton-urlfilter.txt
     [copy] Copying /zonestorage/hudson_solaris/home/hudson/hudson-slave/workspace/Nutch-nutchgora-ant/nutchgora/conf/hbase-site.xml.template to /zonestorage/hudson_solaris/home/hudson/hudson-slave/workspace/Nutch-nutchgora-ant/nutchgora/conf/hbase-site.xml
     [copy] Copying /zonestorage/hudson_solaris/home/hudson/hudson-slave/workspace/Nutch-nutchgora-ant/nutchgora/conf/httpclient-auth.xml.template to /zonestorage/hudson_solaris/home/hudson/hudson-slave/workspace/Nutch-nutchgora-ant/nutchgora/conf/httpclient-auth.xml
     [copy] Copying /zonestorage/hudson_solaris/home/hudson/hudson-slave/workspace/Nutch-nutchgora-ant/nutchgora/conf/nutch-site.xml.template to /zonestorage/hudson_solaris/home/hudson/hudson-slave/workspace/Nutch-nutchgora-ant/nutchgora/conf/nutch-site.xml
     [copy] Copying /zonestorage/hudson_solaris/home/hudson/hudson-slave/workspace/Nutch-nutchgora-ant/nutchgora/conf/prefix-urlfilter.txt.template to /zonestorage/hudson_solaris/home/hudson/hudson-slave/workspace/Nutch-nutchgora-ant/nutchgora/conf/prefix-urlfilter.txt
     [copy] Copying /zonestorage/hudson_solaris/home/hudson/hudson-slave/workspace/Nutch-nutchgora-ant/nutchgora/conf/regex-normalize.xml.template to /zonestorage/hudson_solaris/home/hudson/hudson-slave/workspace/Nutch-nutchgora-ant/nutchgora/conf/regex-normalize.xml
     [copy] Copying /zonestorage/hudson_solaris/home/hudson/hudson-slave/workspace/Nutch-nutchgora-ant/nutchgora/conf/regex-urlfilter.txt.template to /zonestorage/hudson_solaris/home/hudson/hudson-slave/workspace/Nutch-nutchgora-ant/nutchgora/conf/regex-urlfilter.txt
     [copy] Copying /zonestorage/hudson_solaris/home/hudson/hudson-slave/workspace/Nutch-nutchgora-ant/nutchgora/conf/subcollections.xml.template to /zonestorage/hudson_solaris/home/hudson/hudson-slave/workspace/Nutch-nutchgora-ant/nutchgora/conf/subcollections.xml
     [copy] Copying /zonestorage/hudson_solaris/home/hudson/hudson-slave/workspace/Nutch-nutchgora-ant/nutchgora/conf/suffix-urlfilter.txt.template to /zonestorage/hudson_solaris/home/hudson/hudson-slave/workspace/Nutch-nutchgora-ant/nutchgora/conf/suffix-urlfilter.txt

clean-lib:

resolve-default:
[ivy:resolve] :: Ivy 2.2.0 - 20100923230623 :: http://ant.apache.org/ivy/ ::
[ivy:resolve] :: loading settings :: file = /zonestorage/hudson_solaris/home/hudson/hudson-slave/workspace/Nutch-nutchgora-ant/nutchgora/ivy/ivysettings.xml
[ivy:resolve] 
[ivy:resolve] :: problems summary ::
[ivy:resolve] :::: ERRORS
[ivy:resolve] 	unknown resolver null
[ivy:resolve] 	unknown resolver null
[ivy:resolve] 
[ivy:resolve] :: USE VERBOSE OR DEBUG MESSAGE LEVEL FOR MORE DETAILS

BUILD FAILED
/zonestorage/hudson_solaris/home/hudson/hudson-slave/workspace/Nutch-nutchgora-ant/nutchgora/build.xml:419: impossible to ivy retrieve: java.lang.RuntimeException: problem during retrieve of org.apache.nutch#nutch: java.text.ParseException: failed to parse report: /export/home/hudson/.ivy2/cache/org.apache.nutch-nutch-default.xml: Element type "revision" must be followed by either attribute specifications, ">" or "/>".
	at org.apache.ivy.core.retrieve.RetrieveEngine.retrieve(RetrieveEngine.java:206)
	at org.apache.ivy.Ivy.retrieve(Ivy.java:540)
	at org.apache.ivy.ant.IvyRetrieve.doExecute(IvyRetrieve.java:67)
	at org.apache.ivy.ant.IvyTask.execute(IvyTask.java:277)
	at org.apache.tools.ant.UnknownElement.execute(UnknownElement.java:291)
	at sun.reflect.GeneratedMethodAccessor4.invoke(Unknown Source)
	at sun.reflect.DelegatingMethodAccessorImpl.invoke(DelegatingMethodAccessorImpl.java:25)
	at java.lang.reflect.Method.invoke(Method.java:597)
	at org.apache.tools.ant.dispatch.DispatchUtils.execute(DispatchUtils.java:106)
	at org.apache.tools.ant.Task.perform(Task.java:348)
	at org.apache.tools.ant.Target.execute(Target.java:390)
	at org.apache.tools.ant.Target.performTasks(Target.java:411)
	at org.apache.tools.ant.Project.executeSortedTargets(Project.java:1399)
	at org.apache.tools.ant.Project.executeTarget(Project.java:1368)
	at org.apache.tools.ant.helper.DefaultExecutor.executeTargets(DefaultExecutor.java:41)
	at org.apache.tools.ant.Project.executeTargets(Project.java:1251)
	at org.apache.tools.ant.Main.runBuild(Main.java:809)
	at org.apache.tools.ant.Main.startAnt(Main.java:217)
	at org.apache.tools.ant.launch.Launcher.run(Launcher.java:280)
	at org.apache.tools.ant.launch.Launcher.main(Launcher.java:109)
Caused by: java.text.ParseException: failed to parse report: /export/home/hudson/.ivy2/cache/org.apache.nutch-nutch-default.xml: Element type "revision" must be followed by either attribute specifications, ">" or "/>".
	at org.apache.ivy.plugins.report.XmlReportParser.parse(XmlReportParser.java:302)
	at org.apache.ivy.core.retrieve.RetrieveEngine.determineArtifactsToCopy(RetrieveEngine.java:288)
	at org.apache.ivy.core.retrieve.RetrieveEngine.retrieve(RetrieveEngine.java:104)
	... 19 more
Caused by: org.xml.sax.SAXParseException: Element type "revision" must be followed by either attribute specifications, ">" or "/>".
	at com.sun.org.apache.xerces.internal.util.ErrorHandlerWrapper.createSAXParseException(ErrorHandlerWrapper.java:195)
	at com.sun.org.apache.xerces.internal.util.ErrorHandlerWrapper.fatalError(ErrorHandlerWrapper.java:174)
	at com.sun.org.apache.xerces.internal.impl.XMLErrorReporter.reportError(XMLErrorReporter.java:388)
	at com.sun.org.apache.xerces.internal.impl.XMLScanner.reportFatalError(XMLScanner.java:1414)
	at com.sun.org.apache.xerces.internal.impl.XMLDocumentFragmentScannerImpl.seekCloseOfStartTag(XMLDocumentFragmentScannerImpl.java:1395)
	at com.sun.org.apache.xerces.internal.impl.XMLDocumentFragmentScannerImpl.scanStartElement(XMLDocumentFragmentScannerImpl.java:1328)
	at com.sun.org.apache.xerces.internal.impl.XMLDocumentFragmentScannerImpl$FragmentContentDriver.next(XMLDocumentFragmentScannerImpl.java:2755)
	at com.sun.org.apache.xerces.internal.impl.XMLDocumentScannerImpl.next(XMLDocumentScannerImpl.java:648)
	at com.sun.org.apache.xerces.internal.impl.XMLDocumentFragmentScannerImpl.scanDocument(XMLDocumentFragmentScannerImpl.java:511)
	at com.sun.org.apache.xerces.internal.parsers.XML11Configuration.parse(XML11Configuration.java:808)
	at com.sun.org.apache.xerces.internal.parsers.XML11Configuration.parse(XML11Configuration.java:737)
	at com.sun.org.apache.xerces.internal.parsers.XMLParser.parse(XMLParser.java:119)
	at com.sun.org.apache.xerces.internal.parsers.AbstractSAXParser.parse(AbstractSAXParser.java:1205)
	at com.sun.org.apache.xerces.internal.jaxp.SAXParserImpl$JAXPSAXParser.parse(SAXParserImpl.java:522)
	at javax.xml.parsers.SAXParser.parse(SAXParser.java:395)
	at javax.xml.parsers.SAXParser.parse(SAXParser.java:331)
	at org.apache.ivy.plugins.report.XmlReportParser$SaxXmlReportParser.parse(XmlReportParser.java:258)
	at org.apache.ivy.plugins.report.XmlReportParser.parse(XmlReportParser.java:300)
	... 21 more

Total time: 23 seconds
Build step 'Invoke Ant' marked build as failure


Jenkins build is back to normal : Nutch-nutchgora-ant #10

Posted by Apache Jenkins Server <je...@builds.apache.org>.
See <https://builds.apache.org/job/Nutch-nutchgora-ant/10/changes>



Build failed in Jenkins: Nutch-nutchgora-ant #9

Posted by Apache Jenkins Server <je...@builds.apache.org>.
See <https://builds.apache.org/job/Nutch-nutchgora-ant/9/changes>

Changes:

[ferdy] NUTCH-1191 Port NUTCH-1102 to nutchgora - consistent use of fetcher.parse

[ferdy] NUTCH-1187 Port NUTCH-1028 to nutchgora - log parser keys

[ferdy] NUTCH-1156 building errors with gora-hbase - exclude thrift

[lewismc] commit to address NUTCH-902 and update to changes.txt

------------------------------------------
[...truncated 2408 lines...]
     [echo] Compiling plugin: urlfilter-regex
    [javac] /zonestorage/hudson_solaris/home/hudson/hudson-slave/workspace/Nutch-nutchgora-ant/nutchgora/src/plugin/build-plugin.xml:117: warning: 'includeantruntime' was not set, defaulting to build.sysclasspath=last; set to false for repeatable builds
    [javac] Compiling 1 source file to /zonestorage/hudson_solaris/home/hudson/hudson-slave/workspace/Nutch-nutchgora-ant/nutchgora/build/urlfilter-regex/classes

jar:
      [jar] Building jar: /zonestorage/hudson_solaris/home/hudson/hudson-slave/workspace/Nutch-nutchgora-ant/nutchgora/build/urlfilter-regex/urlfilter-regex.jar

deps-test:

init:

init-plugin:

deps-jar:

clean-lib:

resolve-default:
[ivy:resolve] :: loading settings :: file = /zonestorage/hudson_solaris/home/hudson/hudson-slave/workspace/Nutch-nutchgora-ant/nutchgora/ivy/ivysettings.xml

compile:
     [echo] Compiling plugin: lib-regex-filter
    [javac] /zonestorage/hudson_solaris/home/hudson/hudson-slave/workspace/Nutch-nutchgora-ant/nutchgora/src/plugin/build-plugin.xml:117: warning: 'includeantruntime' was not set, defaulting to build.sysclasspath=last; set to false for repeatable builds

jar:

deps-test:

deploy:

copy-generated-lib:

deploy:
     [copy] Copying 1 file to /zonestorage/hudson_solaris/home/hudson/hudson-slave/workspace/Nutch-nutchgora-ant/nutchgora/build/plugins/urlfilter-regex

copy-generated-lib:
     [copy] Copying 1 file to /zonestorage/hudson_solaris/home/hudson/hudson-slave/workspace/Nutch-nutchgora-ant/nutchgora/build/plugins/urlfilter-regex

init:
    [mkdir] Created dir: /zonestorage/hudson_solaris/home/hudson/hudson-slave/workspace/Nutch-nutchgora-ant/nutchgora/build/urlfilter-suffix
    [mkdir] Created dir: /zonestorage/hudson_solaris/home/hudson/hudson-slave/workspace/Nutch-nutchgora-ant/nutchgora/build/urlfilter-suffix/classes
    [mkdir] Created dir: /zonestorage/hudson_solaris/home/hudson/hudson-slave/workspace/Nutch-nutchgora-ant/nutchgora/build/urlfilter-suffix/test
    [mkdir] Created dir: /zonestorage/hudson_solaris/home/hudson/hudson-slave/workspace/Nutch-nutchgora-ant/nutchgora/build/plugins/urlfilter-suffix

init-plugin:

deps-jar:

clean-lib:

resolve-default:
[ivy:resolve] :: loading settings :: file = /zonestorage/hudson_solaris/home/hudson/hudson-slave/workspace/Nutch-nutchgora-ant/nutchgora/ivy/ivysettings.xml

compile:
     [echo] Compiling plugin: urlfilter-suffix
    [javac] /zonestorage/hudson_solaris/home/hudson/hudson-slave/workspace/Nutch-nutchgora-ant/nutchgora/src/plugin/build-plugin.xml:117: warning: 'includeantruntime' was not set, defaulting to build.sysclasspath=last; set to false for repeatable builds
    [javac] Compiling 1 source file to /zonestorage/hudson_solaris/home/hudson/hudson-slave/workspace/Nutch-nutchgora-ant/nutchgora/build/urlfilter-suffix/classes
    [javac] Note: /zonestorage/hudson_solaris/home/hudson/hudson-slave/workspace/Nutch-nutchgora-ant/nutchgora/src/plugin/urlfilter-suffix/src/java/org/apache/nutch/urlfilter/suffix/SuffixURLFilter.java uses unchecked or unsafe operations.
    [javac] Note: Recompile with -Xlint:unchecked for details.

jar:
      [jar] Building jar: /zonestorage/hudson_solaris/home/hudson/hudson-slave/workspace/Nutch-nutchgora-ant/nutchgora/build/urlfilter-suffix/urlfilter-suffix.jar

deps-test:

deploy:
     [copy] Copying 1 file to /zonestorage/hudson_solaris/home/hudson/hudson-slave/workspace/Nutch-nutchgora-ant/nutchgora/build/plugins/urlfilter-suffix

copy-generated-lib:
     [copy] Copying 1 file to /zonestorage/hudson_solaris/home/hudson/hudson-slave/workspace/Nutch-nutchgora-ant/nutchgora/build/plugins/urlfilter-suffix

init:
    [mkdir] Created dir: /zonestorage/hudson_solaris/home/hudson/hudson-slave/workspace/Nutch-nutchgora-ant/nutchgora/build/urlfilter-validator
    [mkdir] Created dir: /zonestorage/hudson_solaris/home/hudson/hudson-slave/workspace/Nutch-nutchgora-ant/nutchgora/build/urlfilter-validator/classes
    [mkdir] Created dir: /zonestorage/hudson_solaris/home/hudson/hudson-slave/workspace/Nutch-nutchgora-ant/nutchgora/build/urlfilter-validator/test
    [mkdir] Created dir: /zonestorage/hudson_solaris/home/hudson/hudson-slave/workspace/Nutch-nutchgora-ant/nutchgora/build/plugins/urlfilter-validator

init-plugin:

deps-jar:

clean-lib:

resolve-default:
[ivy:resolve] :: loading settings :: file = /zonestorage/hudson_solaris/home/hudson/hudson-slave/workspace/Nutch-nutchgora-ant/nutchgora/ivy/ivysettings.xml

compile:
     [echo] Compiling plugin: urlfilter-validator
    [javac] /zonestorage/hudson_solaris/home/hudson/hudson-slave/workspace/Nutch-nutchgora-ant/nutchgora/src/plugin/build-plugin.xml:117: warning: 'includeantruntime' was not set, defaulting to build.sysclasspath=last; set to false for repeatable builds
    [javac] Compiling 1 source file to /zonestorage/hudson_solaris/home/hudson/hudson-slave/workspace/Nutch-nutchgora-ant/nutchgora/build/urlfilter-validator/classes

jar:
      [jar] Building jar: /zonestorage/hudson_solaris/home/hudson/hudson-slave/workspace/Nutch-nutchgora-ant/nutchgora/build/urlfilter-validator/urlfilter-validator.jar

deps-test:

deploy:
     [copy] Copying 1 file to /zonestorage/hudson_solaris/home/hudson/hudson-slave/workspace/Nutch-nutchgora-ant/nutchgora/build/plugins/urlfilter-validator

copy-generated-lib:
     [copy] Copying 1 file to /zonestorage/hudson_solaris/home/hudson/hudson-slave/workspace/Nutch-nutchgora-ant/nutchgora/build/plugins/urlfilter-validator

init:
    [mkdir] Created dir: /zonestorage/hudson_solaris/home/hudson/hudson-slave/workspace/Nutch-nutchgora-ant/nutchgora/build/urlnormalizer-basic
    [mkdir] Created dir: /zonestorage/hudson_solaris/home/hudson/hudson-slave/workspace/Nutch-nutchgora-ant/nutchgora/build/urlnormalizer-basic/classes
    [mkdir] Created dir: /zonestorage/hudson_solaris/home/hudson/hudson-slave/workspace/Nutch-nutchgora-ant/nutchgora/build/urlnormalizer-basic/test
    [mkdir] Created dir: /zonestorage/hudson_solaris/home/hudson/hudson-slave/workspace/Nutch-nutchgora-ant/nutchgora/build/plugins/urlnormalizer-basic

init-plugin:

deps-jar:

clean-lib:

resolve-default:
[ivy:resolve] :: loading settings :: file = /zonestorage/hudson_solaris/home/hudson/hudson-slave/workspace/Nutch-nutchgora-ant/nutchgora/ivy/ivysettings.xml

compile:
     [echo] Compiling plugin: urlnormalizer-basic
    [javac] /zonestorage/hudson_solaris/home/hudson/hudson-slave/workspace/Nutch-nutchgora-ant/nutchgora/src/plugin/build-plugin.xml:117: warning: 'includeantruntime' was not set, defaulting to build.sysclasspath=last; set to false for repeatable builds
    [javac] Compiling 1 source file to /zonestorage/hudson_solaris/home/hudson/hudson-slave/workspace/Nutch-nutchgora-ant/nutchgora/build/urlnormalizer-basic/classes

jar:
      [jar] Building jar: /zonestorage/hudson_solaris/home/hudson/hudson-slave/workspace/Nutch-nutchgora-ant/nutchgora/build/urlnormalizer-basic/urlnormalizer-basic.jar

deps-test:

deploy:
     [copy] Copying 1 file to /zonestorage/hudson_solaris/home/hudson/hudson-slave/workspace/Nutch-nutchgora-ant/nutchgora/build/plugins/urlnormalizer-basic

copy-generated-lib:
     [copy] Copying 1 file to /zonestorage/hudson_solaris/home/hudson/hudson-slave/workspace/Nutch-nutchgora-ant/nutchgora/build/plugins/urlnormalizer-basic

init:
    [mkdir] Created dir: /zonestorage/hudson_solaris/home/hudson/hudson-slave/workspace/Nutch-nutchgora-ant/nutchgora/build/urlnormalizer-pass
    [mkdir] Created dir: /zonestorage/hudson_solaris/home/hudson/hudson-slave/workspace/Nutch-nutchgora-ant/nutchgora/build/urlnormalizer-pass/classes
    [mkdir] Created dir: /zonestorage/hudson_solaris/home/hudson/hudson-slave/workspace/Nutch-nutchgora-ant/nutchgora/build/urlnormalizer-pass/test
    [mkdir] Created dir: /zonestorage/hudson_solaris/home/hudson/hudson-slave/workspace/Nutch-nutchgora-ant/nutchgora/build/plugins/urlnormalizer-pass

init-plugin:

deps-jar:

clean-lib:

resolve-default:
[ivy:resolve] :: loading settings :: file = /zonestorage/hudson_solaris/home/hudson/hudson-slave/workspace/Nutch-nutchgora-ant/nutchgora/ivy/ivysettings.xml

compile:
     [echo] Compiling plugin: urlnormalizer-pass
    [javac] /zonestorage/hudson_solaris/home/hudson/hudson-slave/workspace/Nutch-nutchgora-ant/nutchgora/src/plugin/build-plugin.xml:117: warning: 'includeantruntime' was not set, defaulting to build.sysclasspath=last; set to false for repeatable builds
    [javac] Compiling 1 source file to /zonestorage/hudson_solaris/home/hudson/hudson-slave/workspace/Nutch-nutchgora-ant/nutchgora/build/urlnormalizer-pass/classes

jar:
      [jar] Building jar: /zonestorage/hudson_solaris/home/hudson/hudson-slave/workspace/Nutch-nutchgora-ant/nutchgora/build/urlnormalizer-pass/urlnormalizer-pass.jar

deps-test:

deploy:
     [copy] Copying 1 file to /zonestorage/hudson_solaris/home/hudson/hudson-slave/workspace/Nutch-nutchgora-ant/nutchgora/build/plugins/urlnormalizer-pass

copy-generated-lib:
     [copy] Copying 1 file to /zonestorage/hudson_solaris/home/hudson/hudson-slave/workspace/Nutch-nutchgora-ant/nutchgora/build/plugins/urlnormalizer-pass
    [mkdir] Created dir: /zonestorage/hudson_solaris/home/hudson/hudson-slave/workspace/Nutch-nutchgora-ant/nutchgora/build/urlnormalizer-regex/test/data
     [copy] Copying 4 files to /zonestorage/hudson_solaris/home/hudson/hudson-slave/workspace/Nutch-nutchgora-ant/nutchgora/build/urlnormalizer-regex/test/data

init:
    [mkdir] Created dir: /zonestorage/hudson_solaris/home/hudson/hudson-slave/workspace/Nutch-nutchgora-ant/nutchgora/build/urlnormalizer-regex/classes
    [mkdir] Created dir: /zonestorage/hudson_solaris/home/hudson/hudson-slave/workspace/Nutch-nutchgora-ant/nutchgora/build/plugins/urlnormalizer-regex

init-plugin:

deps-jar:

clean-lib:

resolve-default:
[ivy:resolve] :: loading settings :: file = /zonestorage/hudson_solaris/home/hudson/hudson-slave/workspace/Nutch-nutchgora-ant/nutchgora/ivy/ivysettings.xml

compile:
     [echo] Compiling plugin: urlnormalizer-regex
    [javac] /zonestorage/hudson_solaris/home/hudson/hudson-slave/workspace/Nutch-nutchgora-ant/nutchgora/src/plugin/build-plugin.xml:117: warning: 'includeantruntime' was not set, defaulting to build.sysclasspath=last; set to false for repeatable builds
    [javac] Compiling 1 source file to /zonestorage/hudson_solaris/home/hudson/hudson-slave/workspace/Nutch-nutchgora-ant/nutchgora/build/urlnormalizer-regex/classes
    [javac] Note: /zonestorage/hudson_solaris/home/hudson/hudson-slave/workspace/Nutch-nutchgora-ant/nutchgora/src/plugin/urlnormalizer-regex/src/java/org/apache/nutch/net/urlnormalizer/regex/RegexURLNormalizer.java uses unchecked or unsafe operations.
    [javac] Note: Recompile with -Xlint:unchecked for details.

jar:
      [jar] Building jar: /zonestorage/hudson_solaris/home/hudson/hudson-slave/workspace/Nutch-nutchgora-ant/nutchgora/build/urlnormalizer-regex/urlnormalizer-regex.jar

deps-test:

init:

init-plugin:

clean-lib:

resolve-default:
[ivy:resolve] :: loading settings :: file = /zonestorage/hudson_solaris/home/hudson/hudson-slave/workspace/Nutch-nutchgora-ant/nutchgora/ivy/ivysettings.xml

compile:

jar:

deps-test:

deploy:

copy-generated-lib:

deploy:
     [copy] Copying 1 file to /zonestorage/hudson_solaris/home/hudson/hudson-slave/workspace/Nutch-nutchgora-ant/nutchgora/build/plugins/urlnormalizer-regex

copy-generated-lib:
     [copy] Copying 1 file to /zonestorage/hudson_solaris/home/hudson/hudson-slave/workspace/Nutch-nutchgora-ant/nutchgora/build/plugins/urlnormalizer-regex

compile:

job:
      [jar] Building jar: /zonestorage/hudson_solaris/home/hudson/hudson-slave/workspace/Nutch-nutchgora-ant/nutchgora/build/nutch-2.0-dev.job

resolve-test:
  [taskdef] Could not load definitions from resource org/sonar/ant/antlib.xml. It could not be found.

copy-libs:

compile-core-test:
    [javac] /zonestorage/hudson_solaris/home/hudson/hudson-slave/workspace/Nutch-nutchgora-ant/nutchgora/build.xml:325: warning: 'includeantruntime' was not set, defaulting to build.sysclasspath=last; set to false for repeatable builds
    [javac] Compiling 31 source files to /zonestorage/hudson_solaris/home/hudson/hudson-slave/workspace/Nutch-nutchgora-ant/nutchgora/build/test/classes
    [javac] /zonestorage/hudson_solaris/home/hudson/hudson-slave/workspace/Nutch-nutchgora-ant/nutchgora/src/test/org/apache/nutch/fetcher/TestFetcher.java:90: fetch(java.lang.String,int,boolean,int) in org.apache.nutch.fetcher.FetcherJob cannot be applied to (java.lang.String,int,boolean,boolean,int)
    [javac]     fetcher.fetch(batchId, 1, false, true, -1);
    [javac]            ^
    [javac] Note: /zonestorage/hudson_solaris/home/hudson/hudson-slave/workspace/Nutch-nutchgora-ant/nutchgora/src/test/org/apache/nutch/plugin/TestPluginSystem.java uses or overrides a deprecated API.
    [javac] Note: Recompile with -Xlint:deprecation for details.
    [javac] Note: /zonestorage/hudson_solaris/home/hudson/hudson-slave/workspace/Nutch-nutchgora-ant/nutchgora/src/test/org/apache/nutch/plugin/TestPluginSystem.java uses unchecked or unsafe operations.
    [javac] Note: Recompile with -Xlint:unchecked for details.
    [javac] 1 error

BUILD FAILED
/zonestorage/hudson_solaris/home/hudson/hudson-slave/workspace/Nutch-nutchgora-ant/nutchgora/build.xml:325: Compile failed; see the compiler error output for details.

Total time: 1 minute 38 seconds
Build step 'Invoke Ant' marked build as failure
Updating NUTCH-1028
Updating NUTCH-1191
Updating NUTCH-1102
Updating NUTCH-1156
Updating NUTCH-1187
Updating NUTCH-902