You are viewing a plain text version of this content. The canonical link for it is here.
Posted to builds@beam.apache.org by Apache Jenkins Server <je...@builds.apache.org> on 2022/02/02 00:05:42 UTC
Build failed in Jenkins: beam_PostCommit_Java_Nexmark_Dataflow_V2_Java11 #1014
See <https://ci-beam.apache.org/job/beam_PostCommit_Java_Nexmark_Dataflow_V2_Java11/1014/display/redirect?page=changes>
Changes:
[career] [BEAM-13734] Support cache directories that use GCS buckets
[noreply] Merge pull request #16655 from [BEAM-12164]: Add retry protection to
[noreply] Merge pull request #16586 from [BEAM-13731] FhirIO: Add support for
[noreply] [BEAM-13011] Adds a link to Multi-language Pipelines Tips wiki page
[noreply] [BEAM-12572] Run python examples on multiple runners (#16154)
------------------------------------------
[...truncated 65.00 KB...]
File "/usr/lib/python3.8/urllib/request.py", line 531, in open
response = meth(req, response)
File "/usr/lib/python3.8/urllib/request.py", line 640, in http_response
response = self.parent.error(
File "/usr/lib/python3.8/urllib/request.py", line 569, in error
return self._call_chain(*args)
File "/usr/lib/python3.8/urllib/request.py", line 502, in _call_chain
result = func(*args)
File "/usr/lib/python3.8/urllib/request.py", line 649, in http_error_default
raise HTTPError(req.full_url, code, msg, hdrs, fp)
urllib.error.HTTPError: HTTP Error 502: Bad Gateway
ERROR:root:Invalid url for slf4j-api-1.7.30: http://www.opensource.org/licenses/mit-license.php. Retrying...
Traceback (most recent call last):
File "<https://ci-beam.apache.org/job/beam_PostCommit_Java_Nexmark_Dataflow_V2_Java11/ws/src/sdks/java/container/license_scripts/pull_licenses_java.py",> line 53, in pull_from_url
url_read = urlopen(url)
File "/usr/lib/python3.8/urllib/request.py", line 222, in urlopen
return opener.open(url, data, timeout)
File "/usr/lib/python3.8/urllib/request.py", line 531, in open
response = meth(req, response)
File "/usr/lib/python3.8/urllib/request.py", line 640, in http_response
response = self.parent.error(
File "/usr/lib/python3.8/urllib/request.py", line 569, in error
return self._call_chain(*args)
File "/usr/lib/python3.8/urllib/request.py", line 502, in _call_chain
result = func(*args)
File "/usr/lib/python3.8/urllib/request.py", line 649, in http_error_default
raise HTTPError(req.full_url, code, msg, hdrs, fp)
urllib.error.HTTPError: HTTP Error 500: Internal Server Error
ERROR:root:Invalid url for xz-1.5: https://git.tukaani.org/?p=xz-java.git;a=blob;f=COPYING;h=c1d404dc7a6f06a0437bf1055fedaa4a4c89d728;hb=9f1f97a26f090ffec6568c004a38c6534aa82b94. Retrying...
Traceback (most recent call last):
File "<https://ci-beam.apache.org/job/beam_PostCommit_Java_Nexmark_Dataflow_V2_Java11/ws/src/sdks/java/container/license_scripts/pull_licenses_java.py",> line 53, in pull_from_url
url_read = urlopen(url)
File "/usr/lib/python3.8/urllib/request.py", line 222, in urlopen
return opener.open(url, data, timeout)
File "/usr/lib/python3.8/urllib/request.py", line 531, in open
response = meth(req, response)
File "/usr/lib/python3.8/urllib/request.py", line 640, in http_response
response = self.parent.error(
File "/usr/lib/python3.8/urllib/request.py", line 569, in error
return self._call_chain(*args)
File "/usr/lib/python3.8/urllib/request.py", line 502, in _call_chain
result = func(*args)
File "/usr/lib/python3.8/urllib/request.py", line 649, in http_error_default
raise HTTPError(req.full_url, code, msg, hdrs, fp)
urllib.error.HTTPError: HTTP Error 500: Internal Server Error
ERROR:root:Invalid url for xz-1.5: https://git.tukaani.org/?p=xz-java.git;a=blob;f=COPYING;h=c1d404dc7a6f06a0437bf1055fedaa4a4c89d728;hb=9f1f97a26f090ffec6568c004a38c6534aa82b94. Retrying...
Traceback (most recent call last):
File "<https://ci-beam.apache.org/job/beam_PostCommit_Java_Nexmark_Dataflow_V2_Java11/ws/src/sdks/java/container/license_scripts/pull_licenses_java.py",> line 53, in pull_from_url
url_read = urlopen(url)
File "/usr/lib/python3.8/urllib/request.py", line 222, in urlopen
return opener.open(url, data, timeout)
File "/usr/lib/python3.8/urllib/request.py", line 531, in open
response = meth(req, response)
File "/usr/lib/python3.8/urllib/request.py", line 640, in http_response
response = self.parent.error(
File "/usr/lib/python3.8/urllib/request.py", line 569, in error
return self._call_chain(*args)
File "/usr/lib/python3.8/urllib/request.py", line 502, in _call_chain
result = func(*args)
File "/usr/lib/python3.8/urllib/request.py", line 649, in http_error_default
raise HTTPError(req.full_url, code, msg, hdrs, fp)
urllib.error.HTTPError: HTTP Error 500: Internal Server Error
ERROR:root:Invalid url for xz-1.5: https://git.tukaani.org/?p=xz-java.git;a=blob;f=COPYING;h=c1d404dc7a6f06a0437bf1055fedaa4a4c89d728;hb=9f1f97a26f090ffec6568c004a38c6534aa82b94. Retrying...
Traceback (most recent call last):
File "<https://ci-beam.apache.org/job/beam_PostCommit_Java_Nexmark_Dataflow_V2_Java11/ws/src/sdks/java/container/license_scripts/pull_licenses_java.py",> line 53, in pull_from_url
url_read = urlopen(url)
File "/usr/lib/python3.8/urllib/request.py", line 222, in urlopen
return opener.open(url, data, timeout)
File "/usr/lib/python3.8/urllib/request.py", line 531, in open
response = meth(req, response)
File "/usr/lib/python3.8/urllib/request.py", line 640, in http_response
response = self.parent.error(
File "/usr/lib/python3.8/urllib/request.py", line 569, in error
return self._call_chain(*args)
File "/usr/lib/python3.8/urllib/request.py", line 502, in _call_chain
result = func(*args)
File "/usr/lib/python3.8/urllib/request.py", line 649, in http_error_default
raise HTTPError(req.full_url, code, msg, hdrs, fp)
urllib.error.HTTPError: HTTP Error 500: Internal Server Error
ERROR:root:Invalid url for xz-1.5: https://git.tukaani.org/?p=xz-java.git;a=blob;f=COPYING;h=c1d404dc7a6f06a0437bf1055fedaa4a4c89d728;hb=9f1f97a26f090ffec6568c004a38c6534aa82b94. Retrying...
> Task :runners:direct-java:compileJava
Note: Some input files use or override a deprecated API.
Note: Recompile with -Xlint:deprecation for details.
Note: Some input files use unchecked or unsafe operations.
Note: Recompile with -Xlint:unchecked for details.
> Task :release:go-licenses:java:dockerRun
+ go-licenses save github.com/apache/beam/sdks/java/container --save_path=/output/licenses
> Task :runners:direct-java:classes
> Task :runners:direct-java:shadowJar
> Task :sdks:java:container:pullLicenses
Traceback (most recent call last):
File "<https://ci-beam.apache.org/job/beam_PostCommit_Java_Nexmark_Dataflow_V2_Java11/ws/src/sdks/java/container/license_scripts/pull_licenses_java.py",> line 53, in pull_from_url
url_read = urlopen(url)
File "/usr/lib/python3.8/urllib/request.py", line 222, in urlopen
return opener.open(url, data, timeout)
File "/usr/lib/python3.8/urllib/request.py", line 531, in open
response = meth(req, response)
File "/usr/lib/python3.8/urllib/request.py", line 640, in http_response
response = self.parent.error(
File "/usr/lib/python3.8/urllib/request.py", line 569, in error
return self._call_chain(*args)
File "/usr/lib/python3.8/urllib/request.py", line 502, in _call_chain
result = func(*args)
File "/usr/lib/python3.8/urllib/request.py", line 649, in http_error_default
raise HTTPError(req.full_url, code, msg, hdrs, fp)
urllib.error.HTTPError: HTTP Error 500: Internal Server Error
ERROR:root:Invalid url for xz-1.5: https://git.tukaani.org/?p=xz-java.git;a=blob;f=COPYING;h=c1d404dc7a6f06a0437bf1055fedaa4a4c89d728;hb=9f1f97a26f090ffec6568c004a38c6534aa82b94. Retrying...
Traceback (most recent call last):
File "<https://ci-beam.apache.org/job/beam_PostCommit_Java_Nexmark_Dataflow_V2_Java11/ws/src/sdks/java/container/license_scripts/pull_licenses_java.py",> line 53, in pull_from_url
url_read = urlopen(url)
File "/usr/lib/python3.8/urllib/request.py", line 222, in urlopen
return opener.open(url, data, timeout)
File "/usr/lib/python3.8/urllib/request.py", line 531, in open
response = meth(req, response)
File "/usr/lib/python3.8/urllib/request.py", line 640, in http_response
response = self.parent.error(
File "/usr/lib/python3.8/urllib/request.py", line 569, in error
return self._call_chain(*args)
File "/usr/lib/python3.8/urllib/request.py", line 502, in _call_chain
result = func(*args)
File "/usr/lib/python3.8/urllib/request.py", line 649, in http_error_default
raise HTTPError(req.full_url, code, msg, hdrs, fp)
urllib.error.HTTPError: HTTP Error 500: Internal Server Error
ERROR:root:Invalid url for xz-1.5: https://git.tukaani.org/?p=xz-java.git;a=blob;f=COPYING;h=c1d404dc7a6f06a0437bf1055fedaa4a4c89d728;hb=9f1f97a26f090ffec6568c004a38c6534aa82b94. Retrying...
Traceback (most recent call last):
File "<https://ci-beam.apache.org/job/beam_PostCommit_Java_Nexmark_Dataflow_V2_Java11/ws/src/sdks/java/container/license_scripts/pull_licenses_java.py",> line 53, in pull_from_url
url_read = urlopen(url)
File "/usr/lib/python3.8/urllib/request.py", line 222, in urlopen
return opener.open(url, data, timeout)
File "/usr/lib/python3.8/urllib/request.py", line 531, in open
response = meth(req, response)
File "/usr/lib/python3.8/urllib/request.py", line 640, in http_response
response = self.parent.error(
File "/usr/lib/python3.8/urllib/request.py", line 569, in error
return self._call_chain(*args)
File "/usr/lib/python3.8/urllib/request.py", line 502, in _call_chain
result = func(*args)
File "/usr/lib/python3.8/urllib/request.py", line 649, in http_error_default
raise HTTPError(req.full_url, code, msg, hdrs, fp)
urllib.error.HTTPError: HTTP Error 500: Internal Server Error
ERROR:root:Invalid url for xz-1.5: https://git.tukaani.org/?p=xz-java.git;a=blob;f=COPYING;h=c1d404dc7a6f06a0437bf1055fedaa4a4c89d728;hb=9f1f97a26f090ffec6568c004a38c6534aa82b94. Retrying...
> Task :release:go-licenses:java:dockerRun
+ go-licenses csv github.com/apache/beam/sdks/java/container
+ tee /output/licenses/list.csv
golang.org/x/text,https://go.googlesource.com/text/+/refs/heads/master/LICENSE,BSD-3-Clause
github.com/apache/beam/sdks/java/container,https://github.com/apache/beam/blob/master/LICENSE,Apache-2.0
google.golang.org/grpc,https://github.com/grpc/grpc-go/blob/master/LICENSE,Apache-2.0
golang.org/x/net,https://go.googlesource.com/net/+/refs/heads/master/LICENSE,BSD-3-Clause
golang.org/x/sys,https://go.googlesource.com/sys/+/refs/heads/master/LICENSE,BSD-3-Clause
github.com/apache/beam/sdks/go/pkg/beam,https://github.com/apache/beam/blob/master/sdks/go/README.md,Apache-2.0
github.com/golang/protobuf,https://github.com/golang/protobuf/blob/master/LICENSE,BSD-3-Clause
google.golang.org/protobuf,https://go.googlesource.com/protobuf/+/refs/heads/master/LICENSE,BSD-3-Clause
google.golang.org/genproto/googleapis/rpc/status,https://github.com/googleapis/go-genproto/blob/master/LICENSE,Apache-2.0
+ chmod -R a+w /output/licenses
> Task :release:go-licenses:java:createLicenses
> Task :sdks:java:container:java11:copyGolangLicenses
> Task :sdks:java:container:pullLicenses
Traceback (most recent call last):
File "<https://ci-beam.apache.org/job/beam_PostCommit_Java_Nexmark_Dataflow_V2_Java11/ws/src/sdks/java/container/license_scripts/pull_licenses_java.py",> line 53, in pull_from_url
url_read = urlopen(url)
File "/usr/lib/python3.8/urllib/request.py", line 222, in urlopen
return opener.open(url, data, timeout)
File "/usr/lib/python3.8/urllib/request.py", line 531, in open
response = meth(req, response)
File "/usr/lib/python3.8/urllib/request.py", line 640, in http_response
response = self.parent.error(
File "/usr/lib/python3.8/urllib/request.py", line 569, in error
return self._call_chain(*args)
File "/usr/lib/python3.8/urllib/request.py", line 502, in _call_chain
result = func(*args)
File "/usr/lib/python3.8/urllib/request.py", line 649, in http_error_default
raise HTTPError(req.full_url, code, msg, hdrs, fp)
urllib.error.HTTPError: HTTP Error 500: Internal Server Error
ERROR:root:Invalid url for xz-1.5: https://git.tukaani.org/?p=xz-java.git;a=blob;f=COPYING;h=c1d404dc7a6f06a0437bf1055fedaa4a4c89d728;hb=9f1f97a26f090ffec6568c004a38c6534aa82b94 after 9 retries.
> Task :sdks:java:extensions:sql:compileJava
> Task :sdks:java:container:pullLicenses FAILED
ERROR:root:['xz-1.5']
ERROR:root:**************************************** Licenses were not able to be pulled automatically for some dependencies. Please search source code of the dependencies on the internet and add "license" and "notice" (if available) field to <https://ci-beam.apache.org/job/beam_PostCommit_Java_Nexmark_Dataflow_V2_Java11/ws/src/sdks/java/container/license_scripts/dep_urls_java.yaml> for each missing license. Dependency List: [xz-1.5]
INFO:root:pull_licenses_java.py failed. It took 83.510241 seconds with 16 threads.
Traceback (most recent call last):
File "<https://ci-beam.apache.org/job/beam_PostCommit_Java_Nexmark_Dataflow_V2_Java11/ws/src/sdks/java/container/license_scripts/pull_licenses_java.py",> line 314, in <module>
raise RuntimeError('{n} error(s) occurred.'.format(n=len(error_msg)),
RuntimeError: ('1 error(s) occurred.', ['**************************************** Licenses were not able to be pulled automatically for some dependencies. Please search source code of the dependencies on the internet and add "license" and "notice" (if available) field to <https://ci-beam.apache.org/job/beam_PostCommit_Java_Nexmark_Dataflow_V2_Java11/ws/src/sdks/java/container/license_scripts/dep_urls_java.yaml> for each missing license. Dependency List: [xz-1.5]'])
> Task :sdks:java:extensions:sql:compileJava
Note: Some input files use or override a deprecated API.
Note: Recompile with -Xlint:deprecation for details.
Note: Some input files use unchecked or unsafe operations.
Note: Recompile with -Xlint:unchecked for details.
> Task :sdks:java:extensions:sql:classes
> Task :sdks:java:extensions:sql:jar
> Task :sdks:java:extensions:sql:zetasql:compileJava
Note: Some input files use or override a deprecated API.
Note: Recompile with -Xlint:deprecation for details.
Note: Some input files use unchecked or unsafe operations.
Note: Recompile with -Xlint:unchecked for details.
> Task :sdks:java:extensions:sql:zetasql:classes
> Task :sdks:java:extensions:sql:zetasql:jar
> Task :sdks:java:testing:nexmark:compileJava
Note: Some input files use or override a deprecated API.
Note: Recompile with -Xlint:deprecation for details.
Note: Some input files use unchecked or unsafe operations.
Note: Recompile with -Xlint:unchecked for details.
> Task :sdks:java:testing:nexmark:classes
> Task :sdks:java:testing:nexmark:jar
FAILURE: Build failed with an exception.
* What went wrong:
Execution failed for task ':sdks:java:container:pullLicenses'.
> Process 'command './license_scripts/license_script.sh'' finished with non-zero exit value 1
* Try:
> Run with --stacktrace option to get the stack trace.
> Run with --info or --debug option to get more log output.
> Run with --scan to get full insights.
* Get more help at https://help.gradle.org
Deprecated Gradle features were used in this build, making it incompatible with Gradle 8.0.
You can use '--warning-mode all' to show the individual deprecation warnings and determine if they come from your own scripts or plugins.
See https://docs.gradle.org/7.3.2/userguide/command_line_interface.html#sec:command_line_warnings
Execution optimizations have been disabled for 1 invalid unit(s) of work during this build to ensure correctness.
Please consult deprecation warnings for more details.
BUILD FAILED in 5m 14s
130 actionable tasks: 92 executed, 34 from cache, 4 up-to-date
Publishing build scan...
https://gradle.com/s/vrrfmyapysbxg
Build step 'Invoke Gradle script' changed build result to FAILURE
Build step 'Invoke Gradle script' marked build as failure
---------------------------------------------------------------------
To unsubscribe, e-mail: builds-unsubscribe@beam.apache.org
For additional commands, e-mail: builds-help@beam.apache.org
Jenkins build is back to normal : beam_PostCommit_Java_Nexmark_Dataflow_V2_Java11 #1016
Posted by Apache Jenkins Server <je...@builds.apache.org>.
See <https://ci-beam.apache.org/job/beam_PostCommit_Java_Nexmark_Dataflow_V2_Java11/1016/display/redirect?page=changes>
---------------------------------------------------------------------
To unsubscribe, e-mail: builds-unsubscribe@beam.apache.org
For additional commands, e-mail: builds-help@beam.apache.org
Build failed in Jenkins: beam_PostCommit_Java_Nexmark_Dataflow_V2_Java11 #1015
Posted by Apache Jenkins Server <je...@builds.apache.org>.
See <https://ci-beam.apache.org/job/beam_PostCommit_Java_Nexmark_Dataflow_V2_Java11/1015/display/redirect?page=changes>
Changes:
[noreply] [BEAM-13574] Large Wordcount (#16455)
[noreply] [BEAM-13293] Refactor JDBC IO Go Wrapper (#16686)
------------------------------------------
[...truncated 52.15 KB...]
Successfully uninstalled pip-20.0.2
> Task :sdks:java:extensions:sql:jar
> Task :sdks:java:extensions:sql:zetasql:compileJava FROM-CACHE
> Task :sdks:java:extensions:sql:zetasql:classes UP-TO-DATE
> Task :sdks:java:extensions:sql:zetasql:jar
> Task :release:go-licenses:java:dockerRun
+ rm -rf '/output/*'
+ export GO111MODULE=off
+ GO111MODULE=off
+ go get github.com/apache/beam/sdks/java/container
> Task :sdks:java:container:java11:copyDockerfileDependencies
> Task :sdks:java:testing:nexmark:compileJava FROM-CACHE
> Task :sdks:java:testing:nexmark:classes
> Task :sdks:java:testing:nexmark:jar
> Task :sdks:java:container:pullLicenses
Attempting uninstall: setuptools
Found existing installation: setuptools 44.0.0
Uninstalling setuptools-44.0.0:
Successfully uninstalled setuptools-44.0.0
Successfully installed pip-22.0.2 setuptools-60.6.0 wheel-0.37.1
Collecting beautifulsoup4<5.0,>=4.9.0
Using cached beautifulsoup4-4.10.0-py3-none-any.whl (97 kB)
Collecting pyyaml<6.0.0,>=3.12
Using cached PyYAML-5.4.1-cp38-cp38-manylinux1_x86_64.whl (662 kB)
Collecting tenacity<6.0,>=5.0.2
Using cached tenacity-5.1.5-py2.py3-none-any.whl (34 kB)
Collecting soupsieve>1.2
Using cached soupsieve-2.3.1-py3-none-any.whl (37 kB)
Collecting six>=1.9.0
Using cached six-1.16.0-py2.py3-none-any.whl (11 kB)
Installing collected packages: soupsieve, six, pyyaml, tenacity, beautifulsoup4
Successfully installed beautifulsoup4-4.10.0 pyyaml-5.4.1 six-1.16.0 soupsieve-2.3.1 tenacity-5.1.5
Executing <https://ci-beam.apache.org/job/beam_PostCommit_Java_Nexmark_Dataflow_V2_Java11/ws/src/sdks/java/container/build/virtualenv/bin/python> <https://ci-beam.apache.org/job/beam_PostCommit_Java_Nexmark_Dataflow_V2_Java11/ws/src/sdks/java/container/license_scripts/pull_licenses_java.py> --license_index=<https://ci-beam.apache.org/job/beam_PostCommit_Java_Nexmark_Dataflow_V2_Java11/ws/src/sdks/java/container/build/reports/dependency-license/index.json> --output_dir=<https://ci-beam.apache.org/job/beam_PostCommit_Java_Nexmark_Dataflow_V2_Java11/ws/src/sdks/java/container/build/target/java_third_party_licenses> --dep_url_yaml=<https://ci-beam.apache.org/job/beam_PostCommit_Java_Nexmark_Dataflow_V2_Java11/ws/src/sdks/java/container/license_scripts/dep_urls_java.yaml>
INFO:root:Pulling license for 217 dependencies using 16 threads.
Traceback (most recent call last):
File "<https://ci-beam.apache.org/job/beam_PostCommit_Java_Nexmark_Dataflow_V2_Java11/ws/src/sdks/java/container/license_scripts/pull_licenses_java.py",> line 53, in pull_from_url
url_read = urlopen(url)
File "/usr/lib/python3.8/urllib/request.py", line 222, in urlopen
return opener.open(url, data, timeout)
File "/usr/lib/python3.8/urllib/request.py", line 531, in open
response = meth(req, response)
File "/usr/lib/python3.8/urllib/request.py", line 640, in http_response
response = self.parent.error(
File "/usr/lib/python3.8/urllib/request.py", line 569, in error
return self._call_chain(*args)
File "/usr/lib/python3.8/urllib/request.py", line 502, in _call_chain
result = func(*args)
File "/usr/lib/python3.8/urllib/request.py", line 649, in http_error_default
raise HTTPError(req.full_url, code, msg, hdrs, fp)
urllib.error.HTTPError: HTTP Error 500: Internal Server Error
ERROR:root:Invalid url for xz-1.5: https://git.tukaani.org/?p=xz-java.git;a=blob;f=COPYING;h=c1d404dc7a6f06a0437bf1055fedaa4a4c89d728;hb=9f1f97a26f090ffec6568c004a38c6534aa82b94. Retrying...
Traceback (most recent call last):
File "<https://ci-beam.apache.org/job/beam_PostCommit_Java_Nexmark_Dataflow_V2_Java11/ws/src/sdks/java/container/license_scripts/pull_licenses_java.py",> line 53, in pull_from_url
url_read = urlopen(url)
File "/usr/lib/python3.8/urllib/request.py", line 222, in urlopen
return opener.open(url, data, timeout)
File "/usr/lib/python3.8/urllib/request.py", line 531, in open
response = meth(req, response)
File "/usr/lib/python3.8/urllib/request.py", line 640, in http_response
response = self.parent.error(
File "/usr/lib/python3.8/urllib/request.py", line 569, in error
return self._call_chain(*args)
File "/usr/lib/python3.8/urllib/request.py", line 502, in _call_chain
result = func(*args)
File "/usr/lib/python3.8/urllib/request.py", line 649, in http_error_default
raise HTTPError(req.full_url, code, msg, hdrs, fp)
urllib.error.HTTPError: HTTP Error 500: Internal Server Error
ERROR:root:Invalid url for xz-1.5: https://git.tukaani.org/?p=xz-java.git;a=blob;f=COPYING;h=c1d404dc7a6f06a0437bf1055fedaa4a4c89d728;hb=9f1f97a26f090ffec6568c004a38c6534aa82b94. Retrying...
Traceback (most recent call last):
File "<https://ci-beam.apache.org/job/beam_PostCommit_Java_Nexmark_Dataflow_V2_Java11/ws/src/sdks/java/container/license_scripts/pull_licenses_java.py",> line 53, in pull_from_url
url_read = urlopen(url)
File "/usr/lib/python3.8/urllib/request.py", line 222, in urlopen
return opener.open(url, data, timeout)
File "/usr/lib/python3.8/urllib/request.py", line 531, in open
response = meth(req, response)
File "/usr/lib/python3.8/urllib/request.py", line 640, in http_response
response = self.parent.error(
File "/usr/lib/python3.8/urllib/request.py", line 569, in error
return self._call_chain(*args)
File "/usr/lib/python3.8/urllib/request.py", line 502, in _call_chain
result = func(*args)
File "/usr/lib/python3.8/urllib/request.py", line 649, in http_error_default
raise HTTPError(req.full_url, code, msg, hdrs, fp)
urllib.error.HTTPError: HTTP Error 500: Internal Server Error
ERROR:root:Invalid url for xz-1.5: https://git.tukaani.org/?p=xz-java.git;a=blob;f=COPYING;h=c1d404dc7a6f06a0437bf1055fedaa4a4c89d728;hb=9f1f97a26f090ffec6568c004a38c6534aa82b94. Retrying...
Traceback (most recent call last):
File "<https://ci-beam.apache.org/job/beam_PostCommit_Java_Nexmark_Dataflow_V2_Java11/ws/src/sdks/java/container/license_scripts/pull_licenses_java.py",> line 53, in pull_from_url
url_read = urlopen(url)
File "/usr/lib/python3.8/urllib/request.py", line 222, in urlopen
return opener.open(url, data, timeout)
File "/usr/lib/python3.8/urllib/request.py", line 531, in open
response = meth(req, response)
File "/usr/lib/python3.8/urllib/request.py", line 640, in http_response
response = self.parent.error(
File "/usr/lib/python3.8/urllib/request.py", line 569, in error
return self._call_chain(*args)
File "/usr/lib/python3.8/urllib/request.py", line 502, in _call_chain
result = func(*args)
File "/usr/lib/python3.8/urllib/request.py", line 649, in http_error_default
raise HTTPError(req.full_url, code, msg, hdrs, fp)
urllib.error.HTTPError: HTTP Error 500: Internal Server Error
ERROR:root:Invalid url for xz-1.5: https://git.tukaani.org/?p=xz-java.git;a=blob;f=COPYING;h=c1d404dc7a6f06a0437bf1055fedaa4a4c89d728;hb=9f1f97a26f090ffec6568c004a38c6534aa82b94. Retrying...
Traceback (most recent call last):
File "<https://ci-beam.apache.org/job/beam_PostCommit_Java_Nexmark_Dataflow_V2_Java11/ws/src/sdks/java/container/license_scripts/pull_licenses_java.py",> line 53, in pull_from_url
url_read = urlopen(url)
File "/usr/lib/python3.8/urllib/request.py", line 222, in urlopen
return opener.open(url, data, timeout)
File "/usr/lib/python3.8/urllib/request.py", line 531, in open
response = meth(req, response)
File "/usr/lib/python3.8/urllib/request.py", line 640, in http_response
response = self.parent.error(
File "/usr/lib/python3.8/urllib/request.py", line 569, in error
return self._call_chain(*args)
File "/usr/lib/python3.8/urllib/request.py", line 502, in _call_chain
result = func(*args)
File "/usr/lib/python3.8/urllib/request.py", line 649, in http_error_default
raise HTTPError(req.full_url, code, msg, hdrs, fp)
urllib.error.HTTPError: HTTP Error 500: Internal Server Error
ERROR:root:Invalid url for xz-1.5: https://git.tukaani.org/?p=xz-java.git;a=blob;f=COPYING;h=c1d404dc7a6f06a0437bf1055fedaa4a4c89d728;hb=9f1f97a26f090ffec6568c004a38c6534aa82b94. Retrying...
Traceback (most recent call last):
File "<https://ci-beam.apache.org/job/beam_PostCommit_Java_Nexmark_Dataflow_V2_Java11/ws/src/sdks/java/container/license_scripts/pull_licenses_java.py",> line 53, in pull_from_url
url_read = urlopen(url)
File "/usr/lib/python3.8/urllib/request.py", line 222, in urlopen
return opener.open(url, data, timeout)
File "/usr/lib/python3.8/urllib/request.py", line 531, in open
response = meth(req, response)
File "/usr/lib/python3.8/urllib/request.py", line 640, in http_response
response = self.parent.error(
File "/usr/lib/python3.8/urllib/request.py", line 569, in error
return self._call_chain(*args)
File "/usr/lib/python3.8/urllib/request.py", line 502, in _call_chain
result = func(*args)
File "/usr/lib/python3.8/urllib/request.py", line 649, in http_error_default
raise HTTPError(req.full_url, code, msg, hdrs, fp)
urllib.error.HTTPError: HTTP Error 500: Internal Server Error
ERROR:root:Invalid url for xz-1.5: https://git.tukaani.org/?p=xz-java.git;a=blob;f=COPYING;h=c1d404dc7a6f06a0437bf1055fedaa4a4c89d728;hb=9f1f97a26f090ffec6568c004a38c6534aa82b94. Retrying...
Traceback (most recent call last):
File "<https://ci-beam.apache.org/job/beam_PostCommit_Java_Nexmark_Dataflow_V2_Java11/ws/src/sdks/java/container/license_scripts/pull_licenses_java.py",> line 53, in pull_from_url
url_read = urlopen(url)
File "/usr/lib/python3.8/urllib/request.py", line 222, in urlopen
return opener.open(url, data, timeout)
File "/usr/lib/python3.8/urllib/request.py", line 531, in open
response = meth(req, response)
File "/usr/lib/python3.8/urllib/request.py", line 640, in http_response
response = self.parent.error(
File "/usr/lib/python3.8/urllib/request.py", line 569, in error
return self._call_chain(*args)
File "/usr/lib/python3.8/urllib/request.py", line 502, in _call_chain
result = func(*args)
File "/usr/lib/python3.8/urllib/request.py", line 649, in http_error_default
raise HTTPError(req.full_url, code, msg, hdrs, fp)
urllib.error.HTTPError: HTTP Error 500: Internal Server Error
ERROR:root:Invalid url for xz-1.5: https://git.tukaani.org/?p=xz-java.git;a=blob;f=COPYING;h=c1d404dc7a6f06a0437bf1055fedaa4a4c89d728;hb=9f1f97a26f090ffec6568c004a38c6534aa82b94. Retrying...
Traceback (most recent call last):
File "<https://ci-beam.apache.org/job/beam_PostCommit_Java_Nexmark_Dataflow_V2_Java11/ws/src/sdks/java/container/license_scripts/pull_licenses_java.py",> line 53, in pull_from_url
url_read = urlopen(url)
File "/usr/lib/python3.8/urllib/request.py", line 222, in urlopen
return opener.open(url, data, timeout)
File "/usr/lib/python3.8/urllib/request.py", line 531, in open
response = meth(req, response)
File "/usr/lib/python3.8/urllib/request.py", line 640, in http_response
response = self.parent.error(
File "/usr/lib/python3.8/urllib/request.py", line 569, in error
return self._call_chain(*args)
File "/usr/lib/python3.8/urllib/request.py", line 502, in _call_chain
result = func(*args)
File "/usr/lib/python3.8/urllib/request.py", line 649, in http_error_default
raise HTTPError(req.full_url, code, msg, hdrs, fp)
urllib.error.HTTPError: HTTP Error 500: Internal Server Error
ERROR:root:Invalid url for xz-1.5: https://git.tukaani.org/?p=xz-java.git;a=blob;f=COPYING;h=c1d404dc7a6f06a0437bf1055fedaa4a4c89d728;hb=9f1f97a26f090ffec6568c004a38c6534aa82b94. Retrying...
Traceback (most recent call last):
File "<https://ci-beam.apache.org/job/beam_PostCommit_Java_Nexmark_Dataflow_V2_Java11/ws/src/sdks/java/container/license_scripts/pull_licenses_java.py",> line 53, in pull_from_url
url_read = urlopen(url)
File "/usr/lib/python3.8/urllib/request.py", line 222, in urlopen
return opener.open(url, data, timeout)
File "/usr/lib/python3.8/urllib/request.py", line 531, in open
response = meth(req, response)
File "/usr/lib/python3.8/urllib/request.py", line 640, in http_response
response = self.parent.error(
File "/usr/lib/python3.8/urllib/request.py", line 569, in error
return self._call_chain(*args)
File "/usr/lib/python3.8/urllib/request.py", line 502, in _call_chain
result = func(*args)
File "/usr/lib/python3.8/urllib/request.py", line 649, in http_error_default
raise HTTPError(req.full_url, code, msg, hdrs, fp)
urllib.error.HTTPError: HTTP Error 500: Internal Server Error
ERROR:root:Invalid url for xz-1.5: https://git.tukaani.org/?p=xz-java.git;a=blob;f=COPYING;h=c1d404dc7a6f06a0437bf1055fedaa4a4c89d728;hb=9f1f97a26f090ffec6568c004a38c6534aa82b94 after 9 retries.
ERROR:root:['xz-1.5']
ERROR:root:**************************************** Licenses were not able to be pulled automatically for some dependencies. Please search source code of the dependencies on the internet and add "license" and "notice" (if available) field to <https://ci-beam.apache.org/job/beam_PostCommit_Java_Nexmark_Dataflow_V2_Java11/ws/src/sdks/java/container/license_scripts/dep_urls_java.yaml> for each missing license. Dependency List: [xz-1.5]
INFO:root:pull_licenses_java.py failed. It took 49.313159 seconds with 16 threads.
Traceback (most recent call last):
File "<https://ci-beam.apache.org/job/beam_PostCommit_Java_Nexmark_Dataflow_V2_Java11/ws/src/sdks/java/container/license_scripts/pull_licenses_java.py",> line 314, in <module>
raise RuntimeError('{n} error(s) occurred.'.format(n=len(error_msg)),
RuntimeError: ('1 error(s) occurred.', ['**************************************** Licenses were not able to be pulled automatically for some dependencies. Please search source code of the dependencies on the internet and add "license" and "notice" (if available) field to <https://ci-beam.apache.org/job/beam_PostCommit_Java_Nexmark_Dataflow_V2_Java11/ws/src/sdks/java/container/license_scripts/dep_urls_java.yaml> for each missing license. Dependency List: [xz-1.5]'])
> Task :sdks:java:container:pullLicenses FAILED
> Task :release:go-licenses:java:dockerRun
+ go-licenses save github.com/apache/beam/sdks/java/container --save_path=/output/licenses
+ go-licenses csv github.com/apache/beam/sdks/java/container
+ tee /output/licenses/list.csv
github.com/apache/beam/sdks/go/pkg/beam,https://github.com/apache/beam/blob/master/sdks/go/README.md,Apache-2.0
google.golang.org/grpc,https://github.com/grpc/grpc-go/blob/master/LICENSE,Apache-2.0
golang.org/x/net,https://go.googlesource.com/net/+/refs/heads/master/LICENSE,BSD-3-Clause
github.com/golang/protobuf,https://github.com/golang/protobuf/blob/master/LICENSE,BSD-3-Clause
google.golang.org/protobuf,https://go.googlesource.com/protobuf/+/refs/heads/master/LICENSE,BSD-3-Clause
google.golang.org/genproto/googleapis/rpc/status,https://github.com/googleapis/go-genproto/blob/master/LICENSE,Apache-2.0
github.com/apache/beam/sdks/java/container,https://github.com/apache/beam/blob/master/LICENSE,Apache-2.0
golang.org/x/sys,https://go.googlesource.com/sys/+/refs/heads/master/LICENSE,BSD-3-Clause
golang.org/x/text,https://go.googlesource.com/text/+/refs/heads/master/LICENSE,BSD-3-Clause
+ chmod -R a+w /output/licenses
> Task :release:go-licenses:java:createLicenses
> Task :sdks:java:container:java11:copyGolangLicenses
FAILURE: Build failed with an exception.
* What went wrong:
Execution failed for task ':sdks:java:container:pullLicenses'.
> Process 'command './license_scripts/license_script.sh'' finished with non-zero exit value 1
* Try:
> Run with --stacktrace option to get the stack trace.
> Run with --info or --debug option to get more log output.
> Run with --scan to get full insights.
* Get more help at https://help.gradle.org
Deprecated Gradle features were used in this build, making it incompatible with Gradle 8.0.
You can use '--warning-mode all' to show the individual deprecation warnings and determine if they come from your own scripts or plugins.
See https://docs.gradle.org/7.3.2/userguide/command_line_interface.html#sec:command_line_warnings
Execution optimizations have been disabled for 1 invalid unit(s) of work during this build to ensure correctness.
Please consult deprecation warnings for more details.
BUILD FAILED in 2m 18s
130 actionable tasks: 85 executed, 41 from cache, 4 up-to-date
Publishing build scan...
https://gradle.com/s/2gehcimzqqwgq
Build step 'Invoke Gradle script' changed build result to FAILURE
Build step 'Invoke Gradle script' marked build as failure
---------------------------------------------------------------------
To unsubscribe, e-mail: builds-unsubscribe@beam.apache.org
For additional commands, e-mail: builds-help@beam.apache.org