You are viewing a plain text version of this content. The canonical link for it is here.
Posted to builds@beam.apache.org by Apache Jenkins Server <je...@builds.apache.org> on 2020/08/19 01:04:53 UTC

Build failed in Jenkins: beam_PostCommit_Py_VR_Dataflow_V2 #939

See <https://ci-beam.apache.org/job/beam_PostCommit_Py_VR_Dataflow_V2/939/display/redirect?page=changes>

Changes:

[Kyle Weaver] [BEAM-9956] Remove unbalanced code markup.

[zyichi] Bump up advanceProcessingTime duration in ParDoTest

[tobiasz.kedzierski] [BEAM-10623] Add workflow to run python tests on Linux/Windows/Mac

[tobiasz.kedzierski] [BEAM-10624] dtype explicit for the numpy arrays

[Steve Niemitz] [BEAM-10523] Add support for custom DatumWriters to AvroIO.Write

[Luke Cwik] [BEAM-10040, BEAM-6804] Increase wait times to reduce flakiness.

[noreply] [BEAM-10752] add use_deprecated_read experiment for testSimpleInsert,


------------------------------------------
[...truncated 5.83 MB...]
                      "pipeline_proto_coder_id": "ref_Coder_FastPrimitivesCoder_4"
                    }
                  ], 
                  "is_pair_like": true, 
                  "pipeline_proto_coder_id": "ref_Coder_FastPrimitivesCoder_4"
                }, 
                {
                  "@type": "kind:global_window"
                }
              ], 
              "is_wrapper": true
            }, 
            "output_name": "None", 
            "user_name": "assert_that/Group/Map(_merge_tagged_vals_under_key).out"
          }
        ], 
        "parallel_input": {
          "@type": "OutputReference", 
          "output_name": "out", 
          "step_name": "s18"
        }, 
        "serialized_fn": "ref_AppliedPTransform_assert_that/Group/Map(_merge_tagged_vals_under_key)_26", 
        "user_name": "assert_that/Group/Map(_merge_tagged_vals_under_key)"
      }
    }, 
    {
      "kind": "ParallelDo", 
      "name": "s20", 
      "properties": {
        "display_data": [
          {
            "key": "fn", 
            "label": "Transform Function", 
            "namespace": "apache_beam.transforms.core.CallableWrapperDoFn", 
            "type": "STRING", 
            "value": "<lambda>"
          }, 
          {
            "key": "fn", 
            "label": "Transform Function", 
            "namespace": "apache_beam.transforms.core.ParDo", 
            "shortValue": "CallableWrapperDoFn", 
            "type": "STRING", 
            "value": "apache_beam.transforms.core.CallableWrapperDoFn"
          }
        ], 
        "non_parallel_inputs": {}, 
        "output_info": [
          {
            "encoding": {
              "@type": "kind:windowed_value", 
              "component_encodings": [
                {
                  "@type": "FastPrimitivesCoder$<string of 176 bytes>", 
                  "component_encodings": [
                    {
                      "@type": "FastPrimitivesCoder$<string of 176 bytes>", 
                      "component_encodings": [], 
                      "pipeline_proto_coder_id": "ref_Coder_FastPrimitivesCoder_4"
                    }, 
                    {
                      "@type": "FastPrimitivesCoder$<string of 176 bytes>", 
                      "component_encodings": [], 
                      "pipeline_proto_coder_id": "ref_Coder_FastPrimitivesCoder_4"
                    }
                  ], 
                  "is_pair_like": true, 
                  "pipeline_proto_coder_id": "ref_Coder_FastPrimitivesCoder_4"
                }, 
                {
                  "@type": "kind:global_window"
                }
              ], 
              "is_wrapper": true
            }, 
            "output_name": "None", 
            "user_name": "assert_that/Unkey.out"
          }
        ], 
        "parallel_input": {
          "@type": "OutputReference", 
          "output_name": "None", 
          "step_name": "s19"
        }, 
        "serialized_fn": "ref_AppliedPTransform_assert_that/Unkey_27", 
        "user_name": "assert_that/Unkey"
      }
    }, 
    {
      "kind": "ParallelDo", 
      "name": "s21", 
      "properties": {
        "display_data": [
          {
            "key": "fn", 
            "label": "Transform Function", 
            "namespace": "apache_beam.transforms.core.CallableWrapperDoFn", 
            "type": "STRING", 
            "value": "match"
          }, 
          {
            "key": "fn", 
            "label": "Transform Function", 
            "namespace": "apache_beam.transforms.core.ParDo", 
            "shortValue": "CallableWrapperDoFn", 
            "type": "STRING", 
            "value": "apache_beam.transforms.core.CallableWrapperDoFn"
          }
        ], 
        "non_parallel_inputs": {}, 
        "output_info": [
          {
            "encoding": {
              "@type": "kind:windowed_value", 
              "component_encodings": [
                {
                  "@type": "FastPrimitivesCoder$<string of 176 bytes>", 
                  "component_encodings": [
                    {
                      "@type": "FastPrimitivesCoder$<string of 176 bytes>", 
                      "component_encodings": [], 
                      "pipeline_proto_coder_id": "ref_Coder_FastPrimitivesCoder_4"
                    }, 
                    {
                      "@type": "FastPrimitivesCoder$<string of 176 bytes>", 
                      "component_encodings": [], 
                      "pipeline_proto_coder_id": "ref_Coder_FastPrimitivesCoder_4"
                    }
                  ], 
                  "is_pair_like": true, 
                  "pipeline_proto_coder_id": "ref_Coder_FastPrimitivesCoder_4"
                }, 
                {
                  "@type": "kind:global_window"
                }
              ], 
              "is_wrapper": true
            }, 
            "output_name": "None", 
            "user_name": "assert_that/Match.out"
          }
        ], 
        "parallel_input": {
          "@type": "OutputReference", 
          "output_name": "None", 
          "step_name": "s20"
        }, 
        "serialized_fn": "ref_AppliedPTransform_assert_that/Match_28", 
        "user_name": "assert_that/Match"
      }
    }
  ], 
  "type": "JOB_TYPE_STREAMING"
}
apache_beam.runners.dataflow.internal.apiclient: INFO: Create job: <Job
 createTime: u'2020-08-19T00:41:24.055040Z'
 currentStateTime: u'1970-01-01T00:00:00Z'
 id: u'2020-08-18_17_41_22-7749860310712071693'
 location: u'us-central1'
 name: u'beamapp-jenkins-0819004112-944448'
 projectId: u'apache-beam-testing'
 stageStates: []
 startTime: u'2020-08-19T00:41:24.055040Z'
 steps: []
 tempFiles: []
 type: TypeValueValuesEnum(JOB_TYPE_STREAMING, 2)>
apache_beam.runners.dataflow.internal.apiclient: INFO: Created job with id: [2020-08-18_17_41_22-7749860310712071693]
apache_beam.runners.dataflow.internal.apiclient: INFO: Submitted job: 2020-08-18_17_41_22-7749860310712071693
apache_beam.runners.dataflow.internal.apiclient: INFO: To access the Dataflow monitoring console, please navigate to https://console.cloud.google.com/dataflow/jobs/us-central1/2020-08-18_17_41_22-7749860310712071693?project=apache-beam-testing
apache_beam.runners.dataflow.test_dataflow_runner: WARNING: Waiting indefinitely for streaming job.
--------------------- >> end captured logging << ---------------------

----------------------------------------------------------------------
XML: nosetests-validatesRunnerStreamingTests-df-py27.xml
----------------------------------------------------------------------
XML: <https://ci-beam.apache.org/job/beam_PostCommit_Py_VR_Dataflow_V2/ws/src/sdks/python/nosetests.xml>
----------------------------------------------------------------------
Ran 27 tests in 2031.729s

FAILED (failures=1)
Worker logs: https://console.cloud.google.com/dataflow/jobs/us-central1/2020-08-18_17_31_20-13375505293495676903?project=apache-beam-testing
Worker logs: https://console.cloud.google.com/dataflow/jobs/us-central1/2020-08-18_17_38_49-18272369231615809712?project=apache-beam-testing
Worker logs: https://console.cloud.google.com/dataflow/jobs/us-central1/2020-08-18_17_48_43-131836404194719875?project=apache-beam-testing
Worker logs: https://console.cloud.google.com/dataflow/jobs/us-central1/2020-08-18_17_56_07-16520002674638479229?project=apache-beam-testing
Worker logs: https://console.cloud.google.com/dataflow/jobs/us-central1/2020-08-18_17_31_19-12009984459289982771?project=apache-beam-testing
Worker logs: https://console.cloud.google.com/dataflow/jobs/us-central1/2020-08-18_17_40_03-5716990343147650813?project=apache-beam-testing
Worker logs: https://console.cloud.google.com/dataflow/jobs/us-central1/2020-08-18_17_48_33-8426694832863841034?project=apache-beam-testing
Worker logs: https://console.cloud.google.com/dataflow/jobs/us-central1/2020-08-18_17_31_19-11145349664712026617?project=apache-beam-testing
Worker logs: https://console.cloud.google.com/dataflow/jobs/us-central1/2020-08-18_17_38_50-521791433643823750?project=apache-beam-testing
Worker logs: https://console.cloud.google.com/dataflow/jobs/us-central1/2020-08-18_17_47_25-3074562326891397848?project=apache-beam-testing
Worker logs: https://console.cloud.google.com/dataflow/jobs/us-central1/2020-08-18_17_31_22-959007327232252547?project=apache-beam-testing
Worker logs: https://console.cloud.google.com/dataflow/jobs/us-central1/2020-08-18_17_40_09-14835903051989506046?project=apache-beam-testing
Worker logs: https://console.cloud.google.com/dataflow/jobs/us-central1/2020-08-18_17_47_39-6691841861252472804?project=apache-beam-testing
Worker logs: https://console.cloud.google.com/dataflow/jobs/us-central1/2020-08-18_17_31_21-15815465635012532232?project=apache-beam-testing
Worker logs: https://console.cloud.google.com/dataflow/jobs/us-central1/2020-08-18_17_40_04-12995896397286746555?project=apache-beam-testing
Worker logs: https://console.cloud.google.com/dataflow/jobs/us-central1/2020-08-18_17_47_33-808101852787903863?project=apache-beam-testing
Worker logs: https://console.cloud.google.com/dataflow/jobs/us-central1/2020-08-18_17_31_21-2266227814359428423?project=apache-beam-testing
Worker logs: https://console.cloud.google.com/dataflow/jobs/us-central1/2020-08-18_17_41_22-7749860310712071693?project=apache-beam-testing
Worker logs: https://console.cloud.google.com/dataflow/jobs/us-central1/2020-08-18_17_41_48-4023090775538870149?project=apache-beam-testing
Worker logs: https://console.cloud.google.com/dataflow/jobs/us-central1/2020-08-18_17_31_21-17595099902863069433?project=apache-beam-testing
Worker logs: https://console.cloud.google.com/dataflow/jobs/us-central1/2020-08-18_17_40_02-5123748337803345924?project=apache-beam-testing
Worker logs: https://console.cloud.google.com/dataflow/jobs/us-central1/2020-08-18_17_31_21-8027491230093012562?project=apache-beam-testing
Worker logs: https://console.cloud.google.com/dataflow/jobs/us-central1/2020-08-18_17_39_59-13185299229219028655?project=apache-beam-testing
Worker logs: https://console.cloud.google.com/dataflow/jobs/us-central1/2020-08-18_17_48_23-5781558155474004944?project=apache-beam-testing

> Task :sdks:python:test-suites:dataflow:py2:validatesRunnerStreamingTests FAILED

FAILURE: Build completed with 2 failures.

1: Task failed with an exception.
-----------
* Where:
Script '<https://ci-beam.apache.org/job/beam_PostCommit_Py_VR_Dataflow_V2/ws/src/sdks/python/test-suites/dataflow/common.gradle'> line: 146

* What went wrong:
Execution failed for task ':sdks:python:test-suites:dataflow:py2:validatesRunnerBatchTests'.
> Process 'command 'sh'' finished with non-zero exit value 1

* Try:
Run with --stacktrace option to get the stack trace. Run with --info or --debug option to get more log output. Run with --scan to get full insights.
==============================================================================

2: Task failed with an exception.
-----------
* Where:
Script '<https://ci-beam.apache.org/job/beam_PostCommit_Py_VR_Dataflow_V2/ws/src/sdks/python/test-suites/dataflow/common.gradle'> line: 175

* What went wrong:
Execution failed for task ':sdks:python:test-suites:dataflow:py2:validatesRunnerStreamingTests'.
> Process 'command 'sh'' finished with non-zero exit value 1

* Try:
Run with --stacktrace option to get the stack trace. Run with --info or --debug option to get more log output. Run with --scan to get full insights.
==============================================================================

* Get more help at https://help.gradle.org

Deprecated Gradle features were used in this build, making it incompatible with Gradle 6.0.
Use '--warning-mode all' to show the individual deprecation warnings.
See https://docs.gradle.org/5.2.1/userguide/command_line_interface.html#sec:command_line_warnings

BUILD FAILED in 1h 4m 28s
65 actionable tasks: 47 executed, 18 from cache

Publishing build scan...
https://gradle.com/s/5rrvvidwp555c

Build step 'Invoke Gradle script' changed build result to FAILURE
Build step 'Invoke Gradle script' marked build as failure

---------------------------------------------------------------------
To unsubscribe, e-mail: builds-unsubscribe@beam.apache.org
For additional commands, e-mail: builds-help@beam.apache.org


Jenkins build is back to normal : beam_PostCommit_Py_VR_Dataflow_V2 #951

Posted by Apache Jenkins Server <je...@builds.apache.org>.
See <https://ci-beam.apache.org/job/beam_PostCommit_Py_VR_Dataflow_V2/951/display/redirect?page=changes>


---------------------------------------------------------------------
To unsubscribe, e-mail: builds-unsubscribe@beam.apache.org
For additional commands, e-mail: builds-help@beam.apache.org


Build failed in Jenkins: beam_PostCommit_Py_VR_Dataflow_V2 #950

Posted by Apache Jenkins Server <je...@builds.apache.org>.
See <https://ci-beam.apache.org/job/beam_PostCommit_Py_VR_Dataflow_V2/950/display/redirect?page=changes>

Changes:

[Udi Meiri] Color Jenkins logs support

[ningk] Added a whitespace lint precommit job.

[ningk] Removed trailing whitespaces from all markdown and gradle build files.

[ningk] Updated jenkins precommit job README, added comments of what needs to be

[ningk] Removed trailing whitespaces from HEAD changes

[Alan Myrvold] [BEAM-10049] Add licenses for go dependencies in python, java, and go

[noreply] Propagate BigQuery streaming insert throttled time to Dataflow worker in


------------------------------------------
[...truncated 5.77 MB...]
                      "pipeline_proto_coder_id": "ref_Coder_FastPrimitivesCoder_4"
                    }
                  ], 
                  "is_pair_like": true, 
                  "pipeline_proto_coder_id": "ref_Coder_FastPrimitivesCoder_4"
                }, 
                {
                  "@type": "kind:global_window"
                }
              ], 
              "is_wrapper": true
            }, 
            "output_name": "None", 
            "user_name": "assert_that/Group/Map(_merge_tagged_vals_under_key).out"
          }
        ], 
        "parallel_input": {
          "@type": "OutputReference", 
          "output_name": "out", 
          "step_name": "s18"
        }, 
        "serialized_fn": "ref_AppliedPTransform_assert_that/Group/Map(_merge_tagged_vals_under_key)_26", 
        "user_name": "assert_that/Group/Map(_merge_tagged_vals_under_key)"
      }
    }, 
    {
      "kind": "ParallelDo", 
      "name": "s20", 
      "properties": {
        "display_data": [
          {
            "key": "fn", 
            "label": "Transform Function", 
            "namespace": "apache_beam.transforms.core.CallableWrapperDoFn", 
            "type": "STRING", 
            "value": "<lambda>"
          }, 
          {
            "key": "fn", 
            "label": "Transform Function", 
            "namespace": "apache_beam.transforms.core.ParDo", 
            "shortValue": "CallableWrapperDoFn", 
            "type": "STRING", 
            "value": "apache_beam.transforms.core.CallableWrapperDoFn"
          }
        ], 
        "non_parallel_inputs": {}, 
        "output_info": [
          {
            "encoding": {
              "@type": "kind:windowed_value", 
              "component_encodings": [
                {
                  "@type": "FastPrimitivesCoder$<string of 176 bytes>", 
                  "component_encodings": [
                    {
                      "@type": "FastPrimitivesCoder$<string of 176 bytes>", 
                      "component_encodings": [], 
                      "pipeline_proto_coder_id": "ref_Coder_FastPrimitivesCoder_4"
                    }, 
                    {
                      "@type": "FastPrimitivesCoder$<string of 176 bytes>", 
                      "component_encodings": [], 
                      "pipeline_proto_coder_id": "ref_Coder_FastPrimitivesCoder_4"
                    }
                  ], 
                  "is_pair_like": true, 
                  "pipeline_proto_coder_id": "ref_Coder_FastPrimitivesCoder_4"
                }, 
                {
                  "@type": "kind:global_window"
                }
              ], 
              "is_wrapper": true
            }, 
            "output_name": "None", 
            "user_name": "assert_that/Unkey.out"
          }
        ], 
        "parallel_input": {
          "@type": "OutputReference", 
          "output_name": "None", 
          "step_name": "s19"
        }, 
        "serialized_fn": "ref_AppliedPTransform_assert_that/Unkey_27", 
        "user_name": "assert_that/Unkey"
      }
    }, 
    {
      "kind": "ParallelDo", 
      "name": "s21", 
      "properties": {
        "display_data": [
          {
            "key": "fn", 
            "label": "Transform Function", 
            "namespace": "apache_beam.transforms.core.CallableWrapperDoFn", 
            "type": "STRING", 
            "value": "match"
          }, 
          {
            "key": "fn", 
            "label": "Transform Function", 
            "namespace": "apache_beam.transforms.core.ParDo", 
            "shortValue": "CallableWrapperDoFn", 
            "type": "STRING", 
            "value": "apache_beam.transforms.core.CallableWrapperDoFn"
          }
        ], 
        "non_parallel_inputs": {}, 
        "output_info": [
          {
            "encoding": {
              "@type": "kind:windowed_value", 
              "component_encodings": [
                {
                  "@type": "FastPrimitivesCoder$<string of 176 bytes>", 
                  "component_encodings": [
                    {
                      "@type": "FastPrimitivesCoder$<string of 176 bytes>", 
                      "component_encodings": [], 
                      "pipeline_proto_coder_id": "ref_Coder_FastPrimitivesCoder_4"
                    }, 
                    {
                      "@type": "FastPrimitivesCoder$<string of 176 bytes>", 
                      "component_encodings": [], 
                      "pipeline_proto_coder_id": "ref_Coder_FastPrimitivesCoder_4"
                    }
                  ], 
                  "is_pair_like": true, 
                  "pipeline_proto_coder_id": "ref_Coder_FastPrimitivesCoder_4"
                }, 
                {
                  "@type": "kind:global_window"
                }
              ], 
              "is_wrapper": true
            }, 
            "output_name": "None", 
            "user_name": "assert_that/Match.out"
          }
        ], 
        "parallel_input": {
          "@type": "OutputReference", 
          "output_name": "None", 
          "step_name": "s20"
        }, 
        "serialized_fn": "ref_AppliedPTransform_assert_that/Match_28", 
        "user_name": "assert_that/Match"
      }
    }
  ], 
  "type": "JOB_TYPE_STREAMING"
}
apache_beam.runners.dataflow.internal.apiclient: INFO: Create job: <Job
 createTime: u'2020-08-21T18:34:27.639164Z'
 currentStateTime: u'1970-01-01T00:00:00Z'
 id: u'2020-08-21_11_34_26-16324668767225275029'
 location: u'us-central1'
 name: u'beamapp-jenkins-0821183415-258282'
 projectId: u'apache-beam-testing'
 stageStates: []
 startTime: u'2020-08-21T18:34:27.639164Z'
 steps: []
 tempFiles: []
 type: TypeValueValuesEnum(JOB_TYPE_STREAMING, 2)>
apache_beam.runners.dataflow.internal.apiclient: INFO: Created job with id: [2020-08-21_11_34_26-16324668767225275029]
apache_beam.runners.dataflow.internal.apiclient: INFO: Submitted job: 2020-08-21_11_34_26-16324668767225275029
apache_beam.runners.dataflow.internal.apiclient: INFO: To access the Dataflow monitoring console, please navigate to https://console.cloud.google.com/dataflow/jobs/us-central1/2020-08-21_11_34_26-16324668767225275029?project=apache-beam-testing
apache_beam.runners.dataflow.test_dataflow_runner: WARNING: Waiting indefinitely for streaming job.
--------------------- >> end captured logging << ---------------------

----------------------------------------------------------------------
XML: nosetests-validatesRunnerStreamingTests-df-py27.xml
----------------------------------------------------------------------
XML: <https://ci-beam.apache.org/job/beam_PostCommit_Py_VR_Dataflow_V2/ws/src/sdks/python/nosetests.xml>
----------------------------------------------------------------------
Ran 27 tests in 2083.350s

FAILED (failures=1)
Worker logs: https://console.cloud.google.com/dataflow/jobs/us-central1/2020-08-21_11_25_34-695183393083332971?project=apache-beam-testing
Worker logs: https://console.cloud.google.com/dataflow/jobs/us-central1/2020-08-21_11_34_21-5274610954966680176?project=apache-beam-testing
Worker logs: https://console.cloud.google.com/dataflow/jobs/us-central1/2020-08-21_11_42_51-13006024719503308895?project=apache-beam-testing
Worker logs: https://console.cloud.google.com/dataflow/jobs/us-central1/2020-08-21_11_51_33-511337379043119159?project=apache-beam-testing
Worker logs: https://console.cloud.google.com/dataflow/jobs/us-central1/2020-08-21_11_25_31-14522272663744589924?project=apache-beam-testing
Worker logs: https://console.cloud.google.com/dataflow/jobs/us-central1/2020-08-21_11_34_18-8751612513754157441?project=apache-beam-testing
Worker logs: https://console.cloud.google.com/dataflow/jobs/us-central1/2020-08-21_11_42_49-16269255867688638441?project=apache-beam-testing
Worker logs: https://console.cloud.google.com/dataflow/jobs/us-central1/2020-08-21_11_25_31-7227308326562037465?project=apache-beam-testing
Worker logs: https://console.cloud.google.com/dataflow/jobs/us-central1/2020-08-21_11_33_02-14989422001831852468?project=apache-beam-testing
Worker logs: https://console.cloud.google.com/dataflow/jobs/us-central1/2020-08-21_11_40_26-17907591837233739234?project=apache-beam-testing
Worker logs: https://console.cloud.google.com/dataflow/jobs/us-central1/2020-08-21_11_25_33-3200171537583395043?project=apache-beam-testing
Worker logs: https://console.cloud.google.com/dataflow/jobs/us-central1/2020-08-21_11_34_15-10827121264618778846?project=apache-beam-testing
Worker logs: https://console.cloud.google.com/dataflow/jobs/us-central1/2020-08-21_11_42_45-12845612913759507292?project=apache-beam-testing
Worker logs: https://console.cloud.google.com/dataflow/jobs/us-central1/2020-08-21_11_25_29-1246924681971573292?project=apache-beam-testing
Worker logs: https://console.cloud.google.com/dataflow/jobs/us-central1/2020-08-21_11_34_22-9304742119864252484?project=apache-beam-testing
Worker logs: https://console.cloud.google.com/dataflow/jobs/us-central1/2020-08-21_11_25_35-6503342796731394641?project=apache-beam-testing
Worker logs: https://console.cloud.google.com/dataflow/jobs/us-central1/2020-08-21_11_33_26-8556328630840327625?project=apache-beam-testing
Worker logs: https://console.cloud.google.com/dataflow/jobs/us-central1/2020-08-21_11_41_50-765678531689232707?project=apache-beam-testing
Worker logs: https://console.cloud.google.com/dataflow/jobs/us-central1/2020-08-21_11_25_37-15551888633477716501?project=apache-beam-testing
Worker logs: https://console.cloud.google.com/dataflow/jobs/us-central1/2020-08-21_11_34_26-16324668767225275029?project=apache-beam-testing
Worker logs: https://console.cloud.google.com/dataflow/jobs/us-central1/2020-08-21_11_35_02-1082180112348075734?project=apache-beam-testing
Worker logs: https://console.cloud.google.com/dataflow/jobs/us-central1/2020-08-21_11_25_29-8639948315132085861?project=apache-beam-testing
Worker logs: https://console.cloud.google.com/dataflow/jobs/us-central1/2020-08-21_11_34_18-15147267432130124557?project=apache-beam-testing
Worker logs: https://console.cloud.google.com/dataflow/jobs/us-central1/2020-08-21_11_41_38-7504267566703773340?project=apache-beam-testing

> Task :sdks:python:test-suites:dataflow:py2:validatesRunnerStreamingTests FAILED

FAILURE: Build completed with 2 failures.

1: Task failed with an exception.
-----------
* Where:
Script '<https://ci-beam.apache.org/job/beam_PostCommit_Py_VR_Dataflow_V2/ws/src/sdks/python/test-suites/dataflow/common.gradle'> line: 146

* What went wrong:
Execution failed for task ':sdks:python:test-suites:dataflow:py2:validatesRunnerBatchTests'.
> Process 'command 'sh'' finished with non-zero exit value 1

* Try:
Run with --stacktrace option to get the stack trace. Run with --info or --debug option to get more log output. Run with --scan to get full insights.
==============================================================================

2: Task failed with an exception.
-----------
* Where:
Script '<https://ci-beam.apache.org/job/beam_PostCommit_Py_VR_Dataflow_V2/ws/src/sdks/python/test-suites/dataflow/common.gradle'> line: 175

* What went wrong:
Execution failed for task ':sdks:python:test-suites:dataflow:py2:validatesRunnerStreamingTests'.
> Process 'command 'sh'' finished with non-zero exit value 1

* Try:
Run with --stacktrace option to get the stack trace. Run with --info or --debug option to get more log output. Run with --scan to get full insights.
==============================================================================

* Get more help at https://help.gradle.org

Deprecated Gradle features were used in this build, making it incompatible with Gradle 6.0.
Use '--warning-mode all' to show the individual deprecation warnings.
See https://docs.gradle.org/5.2.1/userguide/command_line_interface.html#sec:command_line_warnings

BUILD FAILED in 59m 21s
65 actionable tasks: 47 executed, 18 from cache

Publishing build scan...
https://gradle.com/s/ezqwpqzw555nm

Build step 'Invoke Gradle script' changed build result to FAILURE
Build step 'Invoke Gradle script' marked build as failure

---------------------------------------------------------------------
To unsubscribe, e-mail: builds-unsubscribe@beam.apache.org
For additional commands, e-mail: builds-help@beam.apache.org


Build failed in Jenkins: beam_PostCommit_Py_VR_Dataflow_V2 #949

Posted by Apache Jenkins Server <je...@builds.apache.org>.
See <https://ci-beam.apache.org/job/beam_PostCommit_Py_VR_Dataflow_V2/949/display/redirect>

Changes:


------------------------------------------
[...truncated 5.76 MB...]
        ], 
        "non_parallel_inputs": {}, 
        "output_info": [
          {
            "encoding": {
              "@type": "kind:windowed_value", 
              "component_encodings": [
                {
                  "@type": "FastPrimitivesCoder$<string of 176 bytes>", 
                  "component_encodings": [
                    {
                      "@type": "FastPrimitivesCoder$<string of 176 bytes>", 
                      "component_encodings": [], 
                      "pipeline_proto_coder_id": "ref_Coder_FastPrimitivesCoder_4"
                    }, 
                    {
                      "@type": "FastPrimitivesCoder$<string of 176 bytes>", 
                      "component_encodings": [], 
                      "pipeline_proto_coder_id": "ref_Coder_FastPrimitivesCoder_4"
                    }
                  ], 
                  "is_pair_like": true, 
                  "pipeline_proto_coder_id": "ref_Coder_FastPrimitivesCoder_4"
                }, 
                {
                  "@type": "kind:global_window"
                }
              ], 
              "is_wrapper": true
            }, 
            "output_name": "None", 
            "user_name": "assert_that/Unkey.out"
          }
        ], 
        "parallel_input": {
          "@type": "OutputReference", 
          "output_name": "None", 
          "step_name": "s19"
        }, 
        "serialized_fn": "ref_AppliedPTransform_assert_that/Unkey_29", 
        "user_name": "assert_that/Unkey"
      }
    }, 
    {
      "kind": "ParallelDo", 
      "name": "s21", 
      "properties": {
        "display_data": [
          {
            "key": "fn", 
            "label": "Transform Function", 
            "namespace": "apache_beam.transforms.core.CallableWrapperDoFn", 
            "type": "STRING", 
            "value": "_equal"
          }, 
          {
            "key": "fn", 
            "label": "Transform Function", 
            "namespace": "apache_beam.transforms.core.ParDo", 
            "shortValue": "CallableWrapperDoFn", 
            "type": "STRING", 
            "value": "apache_beam.transforms.core.CallableWrapperDoFn"
          }
        ], 
        "non_parallel_inputs": {}, 
        "output_info": [
          {
            "encoding": {
              "@type": "kind:windowed_value", 
              "component_encodings": [
                {
                  "@type": "FastPrimitivesCoder$<string of 176 bytes>", 
                  "component_encodings": [
                    {
                      "@type": "FastPrimitivesCoder$<string of 176 bytes>", 
                      "component_encodings": [], 
                      "pipeline_proto_coder_id": "ref_Coder_FastPrimitivesCoder_4"
                    }, 
                    {
                      "@type": "FastPrimitivesCoder$<string of 176 bytes>", 
                      "component_encodings": [], 
                      "pipeline_proto_coder_id": "ref_Coder_FastPrimitivesCoder_4"
                    }
                  ], 
                  "is_pair_like": true, 
                  "pipeline_proto_coder_id": "ref_Coder_FastPrimitivesCoder_4"
                }, 
                {
                  "@type": "kind:global_window"
                }
              ], 
              "is_wrapper": true
            }, 
            "output_name": "None", 
            "user_name": "assert_that/Match.out"
          }
        ], 
        "parallel_input": {
          "@type": "OutputReference", 
          "output_name": "None", 
          "step_name": "s20"
        }, 
        "serialized_fn": "ref_AppliedPTransform_assert_that/Match_30", 
        "user_name": "assert_that/Match"
      }
    }
  ], 
  "type": "JOB_TYPE_STREAMING"
}
INFO:apache_beam.runners.dataflow.internal.apiclient:Create job: <Job
 createTime: u'2020-08-21T12:57:09.272819Z'
 currentStateTime: u'1970-01-01T00:00:00Z'
 id: u'2020-08-21_05_57_08-10312864123147351113'
 location: u'us-central1'
 name: u'beamapp-jenkins-0821125656-505638'
 projectId: u'apache-beam-testing'
 stageStates: []
 startTime: u'2020-08-21T12:57:09.272819Z'
 steps: []
 tempFiles: []
 type: TypeValueValuesEnum(JOB_TYPE_STREAMING, 2)>
INFO:apache_beam.runners.dataflow.internal.apiclient:Created job with id: [2020-08-21_05_57_08-10312864123147351113]
INFO:apache_beam.runners.dataflow.internal.apiclient:Submitted job: 2020-08-21_05_57_08-10312864123147351113
INFO:apache_beam.runners.dataflow.internal.apiclient:To access the Dataflow monitoring console, please navigate to https://console.cloud.google.com/dataflow/jobs/us-central1/2020-08-21_05_57_08-10312864123147351113?project=apache-beam-testing
WARNING:apache_beam.runners.dataflow.test_dataflow_runner:Waiting indefinitely for streaming job.
INFO:apache_beam.runners.dataflow.dataflow_runner:Job 2020-08-21_05_57_08-10312864123147351113 is in state JOB_STATE_RUNNING
INFO:apache_beam.runners.dataflow.dataflow_runner:2020-08-21T12:57:08.387Z: JOB_MESSAGE_WARNING: Autoscaling is enabled for Dataflow Streaming Engine. Workers will scale between 1 and 100 unless maxNumWorkers is specified.
INFO:apache_beam.runners.dataflow.dataflow_runner:2020-08-21T12:57:08.387Z: JOB_MESSAGE_DETAILED: Autoscaling is enabled for job 2020-08-21_05_57_08-10312864123147351113. The number of workers will be between 1 and 100.
INFO:apache_beam.runners.dataflow.dataflow_runner:2020-08-21T12:57:08.387Z: JOB_MESSAGE_DETAILED: Autoscaling was automatically enabled for job 2020-08-21_05_57_08-10312864123147351113.
INFO:apache_beam.runners.dataflow.dataflow_runner:2020-08-21T12:57:12.340Z: JOB_MESSAGE_BASIC: Worker configuration: n1-standard-2 in us-central1-f.
INFO:apache_beam.runners.dataflow.dataflow_runner:2020-08-21T12:57:13.075Z: JOB_MESSAGE_DETAILED: Expanding SplittableParDo operations into optimizable parts.
INFO:apache_beam.runners.dataflow.dataflow_runner:2020-08-21T12:57:13.109Z: JOB_MESSAGE_DETAILED: Expanding CollectionToSingleton operations into optimizable parts.
INFO:apache_beam.runners.dataflow.dataflow_runner:2020-08-21T12:57:13.193Z: JOB_MESSAGE_DETAILED: Expanding CoGroupByKey operations into optimizable parts.
INFO:apache_beam.runners.dataflow.dataflow_runner:2020-08-21T12:57:13.229Z: JOB_MESSAGE_DEBUG: Combiner lifting skipped for step assert_that/Group/GroupByKey: GroupByKey not followed by a combiner.
INFO:apache_beam.runners.dataflow.dataflow_runner:2020-08-21T12:57:13.330Z: JOB_MESSAGE_DEBUG: Combiner lifting skipped for step Create/MaybeReshuffle/Reshuffle/ReshufflePerKey/GroupByKey: GroupByKey not followed by a combiner.
INFO:apache_beam.runners.dataflow.dataflow_runner:2020-08-21T12:57:13.381Z: JOB_MESSAGE_DETAILED: Expanding SplittableProcessKeyed operations into optimizable parts.
INFO:apache_beam.runners.dataflow.dataflow_runner:2020-08-21T12:57:13.412Z: JOB_MESSAGE_DETAILED: Expanding GroupByKey operations into streaming Read/Write steps
INFO:apache_beam.runners.dataflow.dataflow_runner:2020-08-21T12:57:13.531Z: JOB_MESSAGE_DETAILED: Lifting ValueCombiningMappingFns into MergeBucketsMappingFns
INFO:apache_beam.runners.dataflow.dataflow_runner:2020-08-21T12:57:13.637Z: JOB_MESSAGE_DEBUG: Annotating graph with Autotuner information.
INFO:apache_beam.runners.dataflow.dataflow_runner:2020-08-21T12:57:13.692Z: JOB_MESSAGE_DETAILED: Fusing adjacent ParDo, Read, Write, and Flatten operations
INFO:apache_beam.runners.dataflow.dataflow_runner:2020-08-21T12:57:13.729Z: JOB_MESSAGE_DETAILED: Unzipping flatten s17 for input s15.None
INFO:apache_beam.runners.dataflow.dataflow_runner:2020-08-21T12:57:13.764Z: JOB_MESSAGE_DETAILED: Fusing unzipped copy of assert_that/Group/GroupByKey/WriteStream, through flatten assert_that/Group/Flatten, into producer assert_that/Group/pair_with_0
INFO:apache_beam.runners.dataflow.dataflow_runner:2020-08-21T12:57:13.799Z: JOB_MESSAGE_DETAILED: Fusing consumer assert_that/Group/GroupByKey/WriteStream into assert_that/Group/pair_with_1
INFO:apache_beam.runners.dataflow.dataflow_runner:2020-08-21T12:57:13.823Z: JOB_MESSAGE_DETAILED: Fusing consumer Create/MaybeReshuffle/Reshuffle/ReshufflePerKey/GroupByKey/MergeBuckets into Create/MaybeReshuffle/Reshuffle/ReshufflePerKey/GroupByKey/ReadStream
INFO:apache_beam.runners.dataflow.dataflow_runner:2020-08-21T12:57:13.845Z: JOB_MESSAGE_DETAILED: Fusing consumer Create/MaybeReshuffle/Reshuffle/ReshufflePerKey/FlatMap(restore_timestamps) into Create/MaybeReshuffle/Reshuffle/ReshufflePerKey/GroupByKey/MergeBuckets
INFO:apache_beam.runners.dataflow.dataflow_runner:2020-08-21T12:57:13.880Z: JOB_MESSAGE_DETAILED: Fusing consumer Create/MaybeReshuffle/Reshuffle/RemoveRandomKeys into Create/MaybeReshuffle/Reshuffle/ReshufflePerKey/FlatMap(restore_timestamps)
INFO:apache_beam.runners.dataflow.dataflow_runner:2020-08-21T12:57:13.919Z: JOB_MESSAGE_DETAILED: Fusing consumer Create/Map(decode) into Create/MaybeReshuffle/Reshuffle/RemoveRandomKeys
INFO:apache_beam.runners.dataflow.dataflow_runner:2020-08-21T12:57:13.947Z: JOB_MESSAGE_DETAILED: Fusing consumer Key param into Create/Map(decode)
INFO:apache_beam.runners.dataflow.dataflow_runner:2020-08-21T12:57:13.985Z: JOB_MESSAGE_DETAILED: Fusing consumer assert_that/WindowInto(WindowIntoFn) into Key param
INFO:apache_beam.runners.dataflow.dataflow_runner:2020-08-21T12:57:14.023Z: JOB_MESSAGE_DETAILED: Fusing consumer assert_that/ToVoidKey into assert_that/WindowInto(WindowIntoFn)
INFO:apache_beam.runners.dataflow.dataflow_runner:2020-08-21T12:57:14.062Z: JOB_MESSAGE_DETAILED: Fusing consumer assert_that/Group/pair_with_1 into assert_that/ToVoidKey
INFO:apache_beam.runners.dataflow.dataflow_runner:2020-08-21T12:57:14.089Z: JOB_MESSAGE_DETAILED: Fusing consumer assert_that/Group/GroupByKey/MergeBuckets into assert_that/Group/GroupByKey/ReadStream
INFO:apache_beam.runners.dataflow.dataflow_runner:2020-08-21T12:57:14.113Z: JOB_MESSAGE_DETAILED: Fusing consumer assert_that/Group/Map(_merge_tagged_vals_under_key) into assert_that/Group/GroupByKey/MergeBuckets
INFO:apache_beam.runners.dataflow.dataflow_runner:2020-08-21T12:57:14.144Z: JOB_MESSAGE_DETAILED: Fusing consumer assert_that/Unkey into assert_that/Group/Map(_merge_tagged_vals_under_key)
INFO:apache_beam.runners.dataflow.dataflow_runner:2020-08-21T12:57:14.179Z: JOB_MESSAGE_DETAILED: Fusing consumer assert_that/Match into assert_that/Unkey
INFO:apache_beam.runners.dataflow.dataflow_runner:2020-08-21T12:57:14.214Z: JOB_MESSAGE_DETAILED: Fusing consumer Create/FlatMap(<lambda at core.py:2833>) into Create/Impulse
INFO:apache_beam.runners.dataflow.dataflow_runner:2020-08-21T12:57:14.253Z: JOB_MESSAGE_DETAILED: Fusing consumer assert_that/Create/FlatMap(<lambda at core.py:2833>) into assert_that/Create/Impulse
INFO:apache_beam.runners.dataflow.dataflow_runner:2020-08-21T12:57:14.282Z: JOB_MESSAGE_DETAILED: Fusing consumer assert_that/Create/Map(decode) into assert_that/Create/FlatMap(<lambda at core.py:2833>)
INFO:apache_beam.runners.dataflow.dataflow_runner:2020-08-21T12:57:14.315Z: JOB_MESSAGE_DETAILED: Fusing consumer assert_that/Group/pair_with_0 into assert_that/Create/Map(decode)
INFO:apache_beam.runners.dataflow.dataflow_runner:2020-08-21T12:57:14.350Z: JOB_MESSAGE_DETAILED: Fusing consumer Create/MaybeReshuffle/Reshuffle/AddRandomKeys into Create/FlatMap(<lambda at core.py:2833>)
INFO:apache_beam.runners.dataflow.dataflow_runner:2020-08-21T12:57:14.394Z: JOB_MESSAGE_DETAILED: Fusing consumer Create/MaybeReshuffle/Reshuffle/ReshufflePerKey/Map(reify_timestamps) into Create/MaybeReshuffle/Reshuffle/AddRandomKeys
INFO:apache_beam.runners.dataflow.dataflow_runner:2020-08-21T12:57:14.426Z: JOB_MESSAGE_DETAILED: Fusing consumer Create/MaybeReshuffle/Reshuffle/ReshufflePerKey/GroupByKey/WriteStream into Create/MaybeReshuffle/Reshuffle/ReshufflePerKey/Map(reify_timestamps)
INFO:apache_beam.runners.dataflow.dataflow_runner:2020-08-21T12:57:14.466Z: JOB_MESSAGE_DEBUG: Workflow config is missing a default resource spec.
INFO:apache_beam.runners.dataflow.dataflow_runner:2020-08-21T12:57:14.491Z: JOB_MESSAGE_DEBUG: Adding StepResource setup and teardown to workflow graph.
INFO:apache_beam.runners.dataflow.dataflow_runner:2020-08-21T12:57:14.524Z: JOB_MESSAGE_DEBUG: Adding workflow start and stop steps.
INFO:apache_beam.runners.dataflow.dataflow_runner:2020-08-21T12:57:14.554Z: JOB_MESSAGE_DEBUG: Assigning stage ids.
INFO:apache_beam.runners.dataflow.dataflow_runner:2020-08-21T12:57:18.949Z: JOB_MESSAGE_DEBUG: Starting worker pool setup.
INFO:apache_beam.runners.dataflow.dataflow_runner:2020-08-21T12:57:18.985Z: JOB_MESSAGE_DEBUG: Starting worker pool setup.
INFO:apache_beam.runners.dataflow.dataflow_runner:2020-08-21T12:57:19.028Z: JOB_MESSAGE_BASIC: Starting 1 workers in us-central1-f...
INFO:apache_beam.runners.dataflow.dataflow_runner:2020-08-21T12:57:20.532Z: JOB_MESSAGE_DETAILED: Autoscaling: Reduced the number of workers to 0 based on low average worker CPU utilization, and the pipeline having sufficiently low backlog and keeping up with input rate.
INFO:apache_beam.runners.dataflow.dataflow_runner:2020-08-21T12:57:20.576Z: JOB_MESSAGE_BASIC: Worker pool stopped.
INFO:apache_beam.runners.dataflow.dataflow_runner:2020-08-21T12:57:20.604Z: JOB_MESSAGE_DEBUG: Tearing down pending resources...
INFO:apache_beam.runners.dataflow.dataflow_runner:Job 2020-08-21_05_47_32-18427808714567088474 is in state JOB_STATE_DONE
test_default_value_singleton_side_input (apache_beam.transforms.sideinputs_test.SideInputsTest) ... ok
INFO:apache_beam.runners.dataflow.dataflow_runner:2020-08-21T12:57:44.171Z: JOB_MESSAGE_WARNING: Your project already contains 100 Dataflow-created metric descriptors and Stackdriver will not create new Dataflow custom metrics for this job. Each unique user-defined metric name (independent of the DoFn in which it is defined) produces a new metric descriptor. To delete old / unused metric descriptors see https://developers.google.com/apis-explorer/#p/monitoring/v3/monitoring.projects.metricDescriptors.list and https://developers.google.com/apis-explorer/#p/monitoring/v3/monitoring.projects.metricDescriptors.delete
INFO:apache_beam.runners.dataflow.dataflow_runner:2020-08-21T12:57:48.755Z: JOB_MESSAGE_DETAILED: Autoscaling: Raised the number of workers to 1 so that the pipeline can catch up with its backlog and keep up with its input rate.
INFO:apache_beam.runners.dataflow.dataflow_runner:2020-08-21T12:58:30.981Z: JOB_MESSAGE_DETAILED: Workers have started successfully.
INFO:apache_beam.runners.dataflow.dataflow_runner:2020-08-21T12:58:31.025Z: JOB_MESSAGE_DETAILED: Workers have started successfully.
INFO:apache_beam.runners.dataflow.dataflow_runner:2020-08-21T13:04:20.575Z: JOB_MESSAGE_DETAILED: Cleaning up.
INFO:apache_beam.runners.dataflow.dataflow_runner:2020-08-21T13:04:20.626Z: JOB_MESSAGE_DEBUG: Starting worker pool teardown.
INFO:apache_beam.runners.dataflow.dataflow_runner:2020-08-21T13:04:20.665Z: JOB_MESSAGE_BASIC: Stopping worker pool...
INFO:apache_beam.runners.dataflow.dataflow_runner:2020-08-21T13:04:20.708Z: JOB_MESSAGE_DEBUG: Starting worker pool teardown.
INFO:apache_beam.runners.dataflow.dataflow_runner:2020-08-21T13:04:20.731Z: JOB_MESSAGE_BASIC: Stopping worker pool...
INFO:apache_beam.runners.dataflow.dataflow_runner:2020-08-21T13:05:15.048Z: JOB_MESSAGE_DETAILED: Autoscaling: Reduced the number of workers to 0 based on low average worker CPU utilization, and the pipeline having sufficiently low backlog and keeping up with input rate.
INFO:apache_beam.runners.dataflow.dataflow_runner:2020-08-21T13:05:15.093Z: JOB_MESSAGE_BASIC: Worker pool stopped.
INFO:apache_beam.runners.dataflow.dataflow_runner:2020-08-21T13:05:15.132Z: JOB_MESSAGE_DEBUG: Tearing down pending resources...
INFO:apache_beam.runners.dataflow.dataflow_runner:Job 2020-08-21_05_57_08-10312864123147351113 is in state JOB_STATE_DONE
test_element_param (apache_beam.pipeline_test.DoFnTest) ... ok
test_key_param (apache_beam.pipeline_test.DoFnTest) ... ok

----------------------------------------------------------------------
XML: nosetests-validatesRunnerStreamingTests-df-py27.xml
----------------------------------------------------------------------
XML: <https://ci-beam.apache.org/job/beam_PostCommit_Py_VR_Dataflow_V2/ws/src/sdks/python/nosetests.xml>
----------------------------------------------------------------------
Ran 27 tests in 2056.141s

OK
Worker logs: https://console.cloud.google.com/dataflow/jobs/us-central1/2020-08-21_05_31_30-15204012665230037301?project=apache-beam-testing
Worker logs: https://console.cloud.google.com/dataflow/jobs/us-central1/2020-08-21_05_40_08-4548734801226173568?project=apache-beam-testing
Worker logs: https://console.cloud.google.com/dataflow/jobs/us-central1/2020-08-21_05_48_34-3507310713189797049?project=apache-beam-testing
Worker logs: https://console.cloud.google.com/dataflow/jobs/us-central1/2020-08-21_05_57_08-10312864123147351113?project=apache-beam-testing
Worker logs: https://console.cloud.google.com/dataflow/jobs/us-central1/2020-08-21_05_31_29-3154555827492252034?project=apache-beam-testing
Worker logs: https://console.cloud.google.com/dataflow/jobs/us-central1/2020-08-21_05_38_52-4844559788962660304?project=apache-beam-testing
Worker logs: https://console.cloud.google.com/dataflow/jobs/us-central1/2020-08-21_05_47_24-17643420753938427321?project=apache-beam-testing
Worker logs: https://console.cloud.google.com/dataflow/jobs/us-central1/2020-08-21_05_31_31-2020812458812102854?project=apache-beam-testing
Worker logs: https://console.cloud.google.com/dataflow/jobs/us-central1/2020-08-21_05_40_06-6395398500310077689?project=apache-beam-testing
Worker logs: https://console.cloud.google.com/dataflow/jobs/us-central1/2020-08-21_05_48_35-5864306541223578216?project=apache-beam-testing
Worker logs: https://console.cloud.google.com/dataflow/jobs/us-central1/2020-08-21_05_31_32-6045523445187612345?project=apache-beam-testing
Worker logs: https://console.cloud.google.com/dataflow/jobs/us-central1/2020-08-21_05_40_05-12772738058387210991?project=apache-beam-testing
Worker logs: https://console.cloud.google.com/dataflow/jobs/us-central1/2020-08-21_05_31_29-3218648108341176662?project=apache-beam-testing
Worker logs: https://console.cloud.google.com/dataflow/jobs/us-central1/2020-08-21_05_39_53-8497507539594147029?project=apache-beam-testing
Worker logs: https://console.cloud.google.com/dataflow/jobs/us-central1/2020-08-21_05_48_31-9850396734633965568?project=apache-beam-testing
Worker logs: https://console.cloud.google.com/dataflow/jobs/us-central1/2020-08-21_05_31_31-18263098066554485281?project=apache-beam-testing
Worker logs: https://console.cloud.google.com/dataflow/jobs/us-central1/2020-08-21_05_39_10-17169612562666810457?project=apache-beam-testing
Worker logs: https://console.cloud.google.com/dataflow/jobs/us-central1/2020-08-21_05_47_47-1105994114373444158?project=apache-beam-testing
Worker logs: https://console.cloud.google.com/dataflow/jobs/us-central1/2020-08-21_05_31_31-6899741842650360734?project=apache-beam-testing
Worker logs: https://console.cloud.google.com/dataflow/jobs/us-central1/2020-08-21_05_39_59-11116100983806270449?project=apache-beam-testing
Worker logs: https://console.cloud.google.com/dataflow/jobs/us-central1/2020-08-21_05_47_32-18427808714567088474?project=apache-beam-testing
Worker logs: https://console.cloud.google.com/dataflow/jobs/us-central1/2020-08-21_05_31_29-6506985064383922600?project=apache-beam-testing
Worker logs: https://console.cloud.google.com/dataflow/jobs/us-central1/2020-08-21_05_39_59-11596918532017954193?project=apache-beam-testing
Worker logs: https://console.cloud.google.com/dataflow/jobs/us-central1/2020-08-21_05_48_21-9201832632744062617?project=apache-beam-testing

FAILURE: Build failed with an exception.

* Where:
Script '<https://ci-beam.apache.org/job/beam_PostCommit_Py_VR_Dataflow_V2/ws/src/sdks/python/test-suites/dataflow/common.gradle'> line: 146

* What went wrong:
Execution failed for task ':sdks:python:test-suites:dataflow:py2:validatesRunnerBatchTests'.
> Process 'command 'sh'' finished with non-zero exit value 1

* Try:
Run with --stacktrace option to get the stack trace. Run with --info or --debug option to get more log output. Run with --scan to get full insights.

* Get more help at https://help.gradle.org

Deprecated Gradle features were used in this build, making it incompatible with Gradle 6.0.
Use '--warning-mode all' to show the individual deprecation warnings.
See https://docs.gradle.org/5.2.1/userguide/command_line_interface.html#sec:command_line_warnings

BUILD FAILED in 1h 5m 3s
65 actionable tasks: 47 executed, 18 from cache

Publishing build scan...
https://gradle.com/s/bwpnvua4oogbe

Build step 'Invoke Gradle script' changed build result to FAILURE
Build step 'Invoke Gradle script' marked build as failure

---------------------------------------------------------------------
To unsubscribe, e-mail: builds-unsubscribe@beam.apache.org
For additional commands, e-mail: builds-help@beam.apache.org


Build failed in Jenkins: beam_PostCommit_Py_VR_Dataflow_V2 #948

Posted by Apache Jenkins Server <je...@builds.apache.org>.
See <https://ci-beam.apache.org/job/beam_PostCommit_Py_VR_Dataflow_V2/948/display/redirect>

Changes:


------------------------------------------
[...truncated 5.47 MB...]
            "shortValue": "CallableWrapperDoFn", 
            "type": "STRING", 
            "value": "apache_beam.transforms.core.CallableWrapperDoFn"
          }
        ], 
        "non_parallel_inputs": {}, 
        "output_info": [
          {
            "encoding": {
              "@type": "kind:windowed_value", 
              "component_encodings": [
                {
                  "@type": "FastPrimitivesCoder$<string of 176 bytes>", 
                  "component_encodings": [
                    {
                      "@type": "FastPrimitivesCoder$<string of 176 bytes>", 
                      "component_encodings": [], 
                      "pipeline_proto_coder_id": "ref_Coder_FastPrimitivesCoder_4"
                    }, 
                    {
                      "@type": "FastPrimitivesCoder$<string of 176 bytes>", 
                      "component_encodings": [], 
                      "pipeline_proto_coder_id": "ref_Coder_FastPrimitivesCoder_4"
                    }
                  ], 
                  "is_pair_like": true, 
                  "pipeline_proto_coder_id": "ref_Coder_FastPrimitivesCoder_4"
                }, 
                {
                  "@type": "kind:global_window"
                }
              ], 
              "is_wrapper": true
            }, 
            "output_name": "None", 
            "user_name": "assert_that/Unkey.out"
          }
        ], 
        "parallel_input": {
          "@type": "OutputReference", 
          "output_name": "None", 
          "step_name": "s19"
        }, 
        "serialized_fn": "ref_AppliedPTransform_assert_that/Unkey_29", 
        "user_name": "assert_that/Unkey"
      }
    }, 
    {
      "kind": "ParallelDo", 
      "name": "s21", 
      "properties": {
        "display_data": [
          {
            "key": "fn", 
            "label": "Transform Function", 
            "namespace": "apache_beam.transforms.core.CallableWrapperDoFn", 
            "type": "STRING", 
            "value": "_equal"
          }, 
          {
            "key": "fn", 
            "label": "Transform Function", 
            "namespace": "apache_beam.transforms.core.ParDo", 
            "shortValue": "CallableWrapperDoFn", 
            "type": "STRING", 
            "value": "apache_beam.transforms.core.CallableWrapperDoFn"
          }
        ], 
        "non_parallel_inputs": {}, 
        "output_info": [
          {
            "encoding": {
              "@type": "kind:windowed_value", 
              "component_encodings": [
                {
                  "@type": "FastPrimitivesCoder$<string of 176 bytes>", 
                  "component_encodings": [
                    {
                      "@type": "FastPrimitivesCoder$<string of 176 bytes>", 
                      "component_encodings": [], 
                      "pipeline_proto_coder_id": "ref_Coder_FastPrimitivesCoder_4"
                    }, 
                    {
                      "@type": "FastPrimitivesCoder$<string of 176 bytes>", 
                      "component_encodings": [], 
                      "pipeline_proto_coder_id": "ref_Coder_FastPrimitivesCoder_4"
                    }
                  ], 
                  "is_pair_like": true, 
                  "pipeline_proto_coder_id": "ref_Coder_FastPrimitivesCoder_4"
                }, 
                {
                  "@type": "kind:global_window"
                }
              ], 
              "is_wrapper": true
            }, 
            "output_name": "None", 
            "user_name": "assert_that/Match.out"
          }
        ], 
        "parallel_input": {
          "@type": "OutputReference", 
          "output_name": "None", 
          "step_name": "s20"
        }, 
        "serialized_fn": "ref_AppliedPTransform_assert_that/Match_30", 
        "user_name": "assert_that/Match"
      }
    }
  ], 
  "type": "JOB_TYPE_STREAMING"
}
INFO:apache_beam.runners.dataflow.internal.apiclient:Create job: <Job
 createTime: u'2020-08-21T06:58:27.283204Z'
 currentStateTime: u'1970-01-01T00:00:00Z'
 id: u'2020-08-20_23_58_26-2408556687225993915'
 location: u'us-central1'
 name: u'beamapp-jenkins-0821065815-216629'
 projectId: u'apache-beam-testing'
 stageStates: []
 startTime: u'2020-08-21T06:58:27.283204Z'
 steps: []
 tempFiles: []
 type: TypeValueValuesEnum(JOB_TYPE_STREAMING, 2)>
INFO:apache_beam.runners.dataflow.internal.apiclient:Created job with id: [2020-08-20_23_58_26-2408556687225993915]
INFO:apache_beam.runners.dataflow.internal.apiclient:Submitted job: 2020-08-20_23_58_26-2408556687225993915
INFO:apache_beam.runners.dataflow.internal.apiclient:To access the Dataflow monitoring console, please navigate to https://console.cloud.google.com/dataflow/jobs/us-central1/2020-08-20_23_58_26-2408556687225993915?project=apache-beam-testing
WARNING:apache_beam.runners.dataflow.test_dataflow_runner:Waiting indefinitely for streaming job.
INFO:apache_beam.runners.dataflow.dataflow_runner:Job 2020-08-20_23_58_26-2408556687225993915 is in state JOB_STATE_RUNNING
INFO:apache_beam.runners.dataflow.dataflow_runner:2020-08-21T06:58:26.264Z: JOB_MESSAGE_DETAILED: Autoscaling is enabled for job 2020-08-20_23_58_26-2408556687225993915. The number of workers will be between 1 and 100.
INFO:apache_beam.runners.dataflow.dataflow_runner:2020-08-21T06:58:26.264Z: JOB_MESSAGE_DETAILED: Autoscaling was automatically enabled for job 2020-08-20_23_58_26-2408556687225993915.
INFO:apache_beam.runners.dataflow.dataflow_runner:2020-08-21T06:58:26.264Z: JOB_MESSAGE_WARNING: Autoscaling is enabled for Dataflow Streaming Engine. Workers will scale between 1 and 100 unless maxNumWorkers is specified.
INFO:apache_beam.runners.dataflow.dataflow_runner:2020-08-21T06:58:31.609Z: JOB_MESSAGE_BASIC: Worker configuration: n1-standard-2 in us-central1-f.
INFO:apache_beam.runners.dataflow.dataflow_runner:2020-08-21T06:58:32.350Z: JOB_MESSAGE_DETAILED: Expanding SplittableParDo operations into optimizable parts.
INFO:apache_beam.runners.dataflow.dataflow_runner:2020-08-21T06:58:32.370Z: JOB_MESSAGE_DETAILED: Expanding CollectionToSingleton operations into optimizable parts.
INFO:apache_beam.runners.dataflow.dataflow_runner:2020-08-21T06:58:32.445Z: JOB_MESSAGE_DETAILED: Expanding CoGroupByKey operations into optimizable parts.
INFO:apache_beam.runners.dataflow.dataflow_runner:2020-08-21T06:58:32.482Z: JOB_MESSAGE_DEBUG: Combiner lifting skipped for step assert_that/Group/GroupByKey: GroupByKey not followed by a combiner.
INFO:apache_beam.runners.dataflow.dataflow_runner:2020-08-21T06:58:32.505Z: JOB_MESSAGE_DEBUG: Combiner lifting skipped for step Create/MaybeReshuffle/Reshuffle/ReshufflePerKey/GroupByKey: GroupByKey not followed by a combiner.
INFO:apache_beam.runners.dataflow.dataflow_runner:2020-08-21T06:58:32.532Z: JOB_MESSAGE_DETAILED: Expanding SplittableProcessKeyed operations into optimizable parts.
INFO:apache_beam.runners.dataflow.dataflow_runner:2020-08-21T06:58:32.564Z: JOB_MESSAGE_DETAILED: Expanding GroupByKey operations into streaming Read/Write steps
INFO:apache_beam.runners.dataflow.dataflow_runner:2020-08-21T06:58:32.668Z: JOB_MESSAGE_DETAILED: Lifting ValueCombiningMappingFns into MergeBucketsMappingFns
INFO:apache_beam.runners.dataflow.dataflow_runner:2020-08-21T06:58:32.750Z: JOB_MESSAGE_DEBUG: Annotating graph with Autotuner information.
INFO:apache_beam.runners.dataflow.dataflow_runner:2020-08-21T06:58:32.791Z: JOB_MESSAGE_DETAILED: Fusing adjacent ParDo, Read, Write, and Flatten operations
INFO:apache_beam.runners.dataflow.dataflow_runner:2020-08-21T06:58:32.821Z: JOB_MESSAGE_DETAILED: Unzipping flatten s17 for input s15.None
INFO:apache_beam.runners.dataflow.dataflow_runner:2020-08-21T06:58:32.857Z: JOB_MESSAGE_DETAILED: Fusing unzipped copy of assert_that/Group/GroupByKey/WriteStream, through flatten assert_that/Group/Flatten, into producer assert_that/Group/pair_with_0
INFO:apache_beam.runners.dataflow.dataflow_runner:2020-08-21T06:58:32.892Z: JOB_MESSAGE_DETAILED: Fusing consumer assert_that/Group/GroupByKey/WriteStream into assert_that/Group/pair_with_1
INFO:apache_beam.runners.dataflow.dataflow_runner:2020-08-21T06:58:32.927Z: JOB_MESSAGE_DETAILED: Fusing consumer Create/MaybeReshuffle/Reshuffle/ReshufflePerKey/GroupByKey/MergeBuckets into Create/MaybeReshuffle/Reshuffle/ReshufflePerKey/GroupByKey/ReadStream
INFO:apache_beam.runners.dataflow.dataflow_runner:2020-08-21T06:58:32.964Z: JOB_MESSAGE_DETAILED: Fusing consumer Create/MaybeReshuffle/Reshuffle/ReshufflePerKey/FlatMap(restore_timestamps) into Create/MaybeReshuffle/Reshuffle/ReshufflePerKey/GroupByKey/MergeBuckets
INFO:apache_beam.runners.dataflow.dataflow_runner:2020-08-21T06:58:32.989Z: JOB_MESSAGE_DETAILED: Fusing consumer Create/MaybeReshuffle/Reshuffle/RemoveRandomKeys into Create/MaybeReshuffle/Reshuffle/ReshufflePerKey/FlatMap(restore_timestamps)
INFO:apache_beam.runners.dataflow.dataflow_runner:2020-08-21T06:58:33.025Z: JOB_MESSAGE_DETAILED: Fusing consumer Create/Map(decode) into Create/MaybeReshuffle/Reshuffle/RemoveRandomKeys
INFO:apache_beam.runners.dataflow.dataflow_runner:2020-08-21T06:58:33.057Z: JOB_MESSAGE_DETAILED: Fusing consumer Key param into Create/Map(decode)
INFO:apache_beam.runners.dataflow.dataflow_runner:2020-08-21T06:58:33.159Z: JOB_MESSAGE_DETAILED: Fusing consumer assert_that/WindowInto(WindowIntoFn) into Key param
INFO:apache_beam.runners.dataflow.dataflow_runner:2020-08-21T06:58:33.217Z: JOB_MESSAGE_DETAILED: Fusing consumer assert_that/ToVoidKey into assert_that/WindowInto(WindowIntoFn)
INFO:apache_beam.runners.dataflow.dataflow_runner:2020-08-21T06:58:33.326Z: JOB_MESSAGE_DETAILED: Fusing consumer assert_that/Group/pair_with_1 into assert_that/ToVoidKey
INFO:apache_beam.runners.dataflow.dataflow_runner:2020-08-21T06:58:33.429Z: JOB_MESSAGE_DETAILED: Fusing consumer assert_that/Group/GroupByKey/MergeBuckets into assert_that/Group/GroupByKey/ReadStream
INFO:apache_beam.runners.dataflow.dataflow_runner:2020-08-21T06:58:33.458Z: JOB_MESSAGE_DETAILED: Fusing consumer assert_that/Group/Map(_merge_tagged_vals_under_key) into assert_that/Group/GroupByKey/MergeBuckets
INFO:apache_beam.runners.dataflow.dataflow_runner:2020-08-21T06:58:33.500Z: JOB_MESSAGE_DETAILED: Fusing consumer assert_that/Unkey into assert_that/Group/Map(_merge_tagged_vals_under_key)
INFO:apache_beam.runners.dataflow.dataflow_runner:2020-08-21T06:58:33.567Z: JOB_MESSAGE_DETAILED: Fusing consumer assert_that/Match into assert_that/Unkey
INFO:apache_beam.runners.dataflow.dataflow_runner:2020-08-21T06:58:33.620Z: JOB_MESSAGE_DETAILED: Fusing consumer Create/FlatMap(<lambda at core.py:2833>) into Create/Impulse
INFO:apache_beam.runners.dataflow.dataflow_runner:2020-08-21T06:58:33.676Z: JOB_MESSAGE_DETAILED: Fusing consumer assert_that/Create/FlatMap(<lambda at core.py:2833>) into assert_that/Create/Impulse
INFO:apache_beam.runners.dataflow.dataflow_runner:2020-08-21T06:58:33.723Z: JOB_MESSAGE_DETAILED: Fusing consumer assert_that/Create/Map(decode) into assert_that/Create/FlatMap(<lambda at core.py:2833>)
INFO:apache_beam.runners.dataflow.dataflow_runner:2020-08-21T06:58:33.765Z: JOB_MESSAGE_DETAILED: Fusing consumer assert_that/Group/pair_with_0 into assert_that/Create/Map(decode)
INFO:apache_beam.runners.dataflow.dataflow_runner:2020-08-21T06:58:33.814Z: JOB_MESSAGE_DETAILED: Fusing consumer Create/MaybeReshuffle/Reshuffle/AddRandomKeys into Create/FlatMap(<lambda at core.py:2833>)
INFO:apache_beam.runners.dataflow.dataflow_runner:2020-08-21T06:58:33.858Z: JOB_MESSAGE_DETAILED: Fusing consumer Create/MaybeReshuffle/Reshuffle/ReshufflePerKey/Map(reify_timestamps) into Create/MaybeReshuffle/Reshuffle/AddRandomKeys
INFO:apache_beam.runners.dataflow.dataflow_runner:2020-08-21T06:58:33.918Z: JOB_MESSAGE_DETAILED: Fusing consumer Create/MaybeReshuffle/Reshuffle/ReshufflePerKey/GroupByKey/WriteStream into Create/MaybeReshuffle/Reshuffle/ReshufflePerKey/Map(reify_timestamps)
INFO:apache_beam.runners.dataflow.dataflow_runner:2020-08-21T06:58:34.069Z: JOB_MESSAGE_DEBUG: Workflow config is missing a default resource spec.
INFO:apache_beam.runners.dataflow.dataflow_runner:2020-08-21T06:58:34.107Z: JOB_MESSAGE_DEBUG: Adding StepResource setup and teardown to workflow graph.
INFO:apache_beam.runners.dataflow.dataflow_runner:2020-08-21T06:58:34.132Z: JOB_MESSAGE_DEBUG: Adding workflow start and stop steps.
INFO:apache_beam.runners.dataflow.dataflow_runner:2020-08-21T06:58:34.165Z: JOB_MESSAGE_DEBUG: Assigning stage ids.
INFO:apache_beam.runners.dataflow.dataflow_runner:2020-08-21T06:58:36.451Z: JOB_MESSAGE_DEBUG: Starting worker pool setup.
INFO:apache_beam.runners.dataflow.dataflow_runner:2020-08-21T06:58:36.492Z: JOB_MESSAGE_DEBUG: Starting worker pool setup.
INFO:apache_beam.runners.dataflow.dataflow_runner:2020-08-21T06:58:36.528Z: JOB_MESSAGE_BASIC: Starting 1 workers in us-central1-f...
INFO:apache_beam.runners.dataflow.dataflow_runner:2020-08-21T06:58:43.478Z: JOB_MESSAGE_WARNING: Your project already contains 100 Dataflow-created metric descriptors and Stackdriver will not create new Dataflow custom metrics for this job. Each unique user-defined metric name (independent of the DoFn in which it is defined) produces a new metric descriptor. To delete old / unused metric descriptors see https://developers.google.com/apis-explorer/#p/monitoring/v3/monitoring.projects.metricDescriptors.list and https://developers.google.com/apis-explorer/#p/monitoring/v3/monitoring.projects.metricDescriptors.delete
INFO:apache_beam.runners.dataflow.dataflow_runner:2020-08-21T06:59:04.611Z: JOB_MESSAGE_DETAILED: Autoscaling: Raised the number of workers to 1 so that the pipeline can catch up with its backlog and keep up with its input rate.
INFO:apache_beam.runners.dataflow.dataflow_runner:2020-08-21T06:59:42.584Z: JOB_MESSAGE_DETAILED: Workers have started successfully.
INFO:apache_beam.runners.dataflow.dataflow_runner:2020-08-21T06:59:42.613Z: JOB_MESSAGE_DETAILED: Workers have started successfully.
INFO:apache_beam.runners.dataflow.dataflow_runner:2020-08-21T07:05:37.735Z: JOB_MESSAGE_DETAILED: Cleaning up.
INFO:apache_beam.runners.dataflow.dataflow_runner:2020-08-21T07:05:37.810Z: JOB_MESSAGE_DEBUG: Starting worker pool teardown.
INFO:apache_beam.runners.dataflow.dataflow_runner:2020-08-21T07:05:37.829Z: JOB_MESSAGE_BASIC: Stopping worker pool...
INFO:apache_beam.runners.dataflow.dataflow_runner:2020-08-21T07:05:37.868Z: JOB_MESSAGE_DEBUG: Starting worker pool teardown.
INFO:apache_beam.runners.dataflow.dataflow_runner:2020-08-21T07:05:37.895Z: JOB_MESSAGE_BASIC: Stopping worker pool...
INFO:oauth2client.transport:Refreshing due to a 401 (attempt 1/2)
INFO:apache_beam.runners.dataflow.dataflow_runner:2020-08-21T07:08:18.389Z: JOB_MESSAGE_DETAILED: Autoscaling: Reduced the number of workers to 0 based on low average worker CPU utilization, and the pipeline having sufficiently low backlog and keeping up with input rate.
INFO:apache_beam.runners.dataflow.dataflow_runner:2020-08-21T07:08:18.456Z: JOB_MESSAGE_BASIC: Worker pool stopped.
INFO:apache_beam.runners.dataflow.dataflow_runner:2020-08-21T07:08:18.499Z: JOB_MESSAGE_DEBUG: Tearing down pending resources...
INFO:apache_beam.runners.dataflow.dataflow_runner:Job 2020-08-20_23_58_26-2408556687225993915 is in state JOB_STATE_DONE
test_element_param (apache_beam.pipeline_test.DoFnTest) ... ok
test_key_param (apache_beam.pipeline_test.DoFnTest) ... ok

----------------------------------------------------------------------
XML: nosetests-validatesRunnerStreamingTests-df-py27.xml
----------------------------------------------------------------------
XML: <https://ci-beam.apache.org/job/beam_PostCommit_Py_VR_Dataflow_V2/ws/src/sdks/python/nosetests.xml>
----------------------------------------------------------------------
Ran 27 tests in 2153.289s

OK
Worker logs: https://console.cloud.google.com/dataflow/jobs/us-central1/2020-08-20_23_32_52-10041871182391422530?project=apache-beam-testing
Worker logs: https://console.cloud.google.com/dataflow/jobs/us-central1/2020-08-20_23_41_27-10674826513778929513?project=apache-beam-testing
Worker logs: https://console.cloud.google.com/dataflow/jobs/us-central1/2020-08-20_23_50_04-16007390779345214908?project=apache-beam-testing
Worker logs: https://console.cloud.google.com/dataflow/jobs/us-central1/2020-08-20_23_58_26-2408556687225993915?project=apache-beam-testing
Worker logs: https://console.cloud.google.com/dataflow/jobs/us-central1/2020-08-20_23_32_52-16258364926181268667?project=apache-beam-testing
Worker logs: https://console.cloud.google.com/dataflow/jobs/us-central1/2020-08-20_23_40_50-11741245695652826662?project=apache-beam-testing
Worker logs: https://console.cloud.google.com/dataflow/jobs/us-central1/2020-08-20_23_49_20-15418484345989943049?project=apache-beam-testing
Worker logs: https://console.cloud.google.com/dataflow/jobs/us-central1/2020-08-20_23_32_53-16887180914885061815?project=apache-beam-testing
Worker logs: https://console.cloud.google.com/dataflow/jobs/us-central1/2020-08-20_23_41_19-10937229069113077102?project=apache-beam-testing
Worker logs: https://console.cloud.google.com/dataflow/jobs/us-central1/2020-08-20_23_49_44-2827309117390622418?project=apache-beam-testing
Worker logs: https://console.cloud.google.com/dataflow/jobs/us-central1/2020-08-20_23_32_55-18415292603898094659?project=apache-beam-testing
Worker logs: https://console.cloud.google.com/dataflow/jobs/us-central1/2020-08-20_23_41_15-6010984705704079735?project=apache-beam-testing
Worker logs: https://console.cloud.google.com/dataflow/jobs/us-central1/2020-08-20_23_49_46-6864507978733586571?project=apache-beam-testing
Worker logs: https://console.cloud.google.com/dataflow/jobs/us-central1/2020-08-20_23_32_52-9452551402687658468?project=apache-beam-testing
Worker logs: https://console.cloud.google.com/dataflow/jobs/us-central1/2020-08-20_23_40_15-642647435871414057?project=apache-beam-testing
Worker logs: https://console.cloud.google.com/dataflow/jobs/us-central1/2020-08-20_23_48_40-10612820915169514648?project=apache-beam-testing
Worker logs: https://console.cloud.google.com/dataflow/jobs/us-central1/2020-08-20_23_32_54-116299305187468596?project=apache-beam-testing
Worker logs: https://console.cloud.google.com/dataflow/jobs/us-central1/2020-08-20_23_40_31-4201519600965593583?project=apache-beam-testing
Worker logs: https://console.cloud.google.com/dataflow/jobs/us-central1/2020-08-20_23_49_11-11928551283061118901?project=apache-beam-testing
Worker logs: https://console.cloud.google.com/dataflow/jobs/us-central1/2020-08-20_23_32_54-2707161415496562817?project=apache-beam-testing
Worker logs: https://console.cloud.google.com/dataflow/jobs/us-central1/2020-08-20_23_41_20-5526136291018248034?project=apache-beam-testing
Worker logs: https://console.cloud.google.com/dataflow/jobs/us-central1/2020-08-20_23_32_53-7043792490917967355?project=apache-beam-testing
Worker logs: https://console.cloud.google.com/dataflow/jobs/us-central1/2020-08-20_23_40_31-18161429543506156481?project=apache-beam-testing
Worker logs: https://console.cloud.google.com/dataflow/jobs/us-central1/2020-08-20_23_49_11-8240011428474698380?project=apache-beam-testing

FAILURE: Build failed with an exception.

* Where:
Script '<https://ci-beam.apache.org/job/beam_PostCommit_Py_VR_Dataflow_V2/ws/src/sdks/python/test-suites/dataflow/common.gradle'> line: 146

* What went wrong:
Execution failed for task ':sdks:python:test-suites:dataflow:py2:validatesRunnerBatchTests'.
> Process 'command 'sh'' finished with non-zero exit value 1

* Try:
Run with --stacktrace option to get the stack trace. Run with --info or --debug option to get more log output. Run with --scan to get full insights.

* Get more help at https://help.gradle.org

Deprecated Gradle features were used in this build, making it incompatible with Gradle 6.0.
Use '--warning-mode all' to show the individual deprecation warnings.
See https://docs.gradle.org/5.2.1/userguide/command_line_interface.html#sec:command_line_warnings

BUILD FAILED in 1h 7m 53s
65 actionable tasks: 47 executed, 18 from cache

Publishing build scan...
https://gradle.com/s/qfrimwunpabfu

Build step 'Invoke Gradle script' changed build result to FAILURE
Build step 'Invoke Gradle script' marked build as failure

---------------------------------------------------------------------
To unsubscribe, e-mail: builds-unsubscribe@beam.apache.org
For additional commands, e-mail: builds-help@beam.apache.org


Build failed in Jenkins: beam_PostCommit_Py_VR_Dataflow_V2 #947

Posted by Apache Jenkins Server <je...@builds.apache.org>.
See <https://ci-beam.apache.org/job/beam_PostCommit_Py_VR_Dataflow_V2/947/display/redirect?page=changes>

Changes:

[daniel.o.programmer] [BEAM-3301] Consolidating starcgen method names in graph/fn.go and

[daniel.o.programmer] [BEAM-10289] Fixing miscalculated SDF split fraction.

[noreply] [BEAM-10701] Generate Codecov XML (#12566)

[noreply] [BEAM-9979] Fix read index being reported to be reset after any metrics

[noreply] [BEAM-9546] DataframeTransform can now consume a schema-aware


------------------------------------------
[...truncated 5.63 MB...]
        ], 
        "non_parallel_inputs": {}, 
        "output_info": [
          {
            "encoding": {
              "@type": "kind:windowed_value", 
              "component_encodings": [
                {
                  "@type": "FastPrimitivesCoder$<string of 176 bytes>", 
                  "component_encodings": [
                    {
                      "@type": "FastPrimitivesCoder$<string of 176 bytes>", 
                      "component_encodings": [], 
                      "pipeline_proto_coder_id": "ref_Coder_FastPrimitivesCoder_4"
                    }, 
                    {
                      "@type": "FastPrimitivesCoder$<string of 176 bytes>", 
                      "component_encodings": [], 
                      "pipeline_proto_coder_id": "ref_Coder_FastPrimitivesCoder_4"
                    }
                  ], 
                  "is_pair_like": true, 
                  "pipeline_proto_coder_id": "ref_Coder_FastPrimitivesCoder_4"
                }, 
                {
                  "@type": "kind:global_window"
                }
              ], 
              "is_wrapper": true
            }, 
            "output_name": "None", 
            "user_name": "assert_that/Unkey.out"
          }
        ], 
        "parallel_input": {
          "@type": "OutputReference", 
          "output_name": "None", 
          "step_name": "s19"
        }, 
        "serialized_fn": "ref_AppliedPTransform_assert_that/Unkey_29", 
        "user_name": "assert_that/Unkey"
      }
    }, 
    {
      "kind": "ParallelDo", 
      "name": "s21", 
      "properties": {
        "display_data": [
          {
            "key": "fn", 
            "label": "Transform Function", 
            "namespace": "apache_beam.transforms.core.CallableWrapperDoFn", 
            "type": "STRING", 
            "value": "_equal"
          }, 
          {
            "key": "fn", 
            "label": "Transform Function", 
            "namespace": "apache_beam.transforms.core.ParDo", 
            "shortValue": "CallableWrapperDoFn", 
            "type": "STRING", 
            "value": "apache_beam.transforms.core.CallableWrapperDoFn"
          }
        ], 
        "non_parallel_inputs": {}, 
        "output_info": [
          {
            "encoding": {
              "@type": "kind:windowed_value", 
              "component_encodings": [
                {
                  "@type": "FastPrimitivesCoder$<string of 176 bytes>", 
                  "component_encodings": [
                    {
                      "@type": "FastPrimitivesCoder$<string of 176 bytes>", 
                      "component_encodings": [], 
                      "pipeline_proto_coder_id": "ref_Coder_FastPrimitivesCoder_4"
                    }, 
                    {
                      "@type": "FastPrimitivesCoder$<string of 176 bytes>", 
                      "component_encodings": [], 
                      "pipeline_proto_coder_id": "ref_Coder_FastPrimitivesCoder_4"
                    }
                  ], 
                  "is_pair_like": true, 
                  "pipeline_proto_coder_id": "ref_Coder_FastPrimitivesCoder_4"
                }, 
                {
                  "@type": "kind:global_window"
                }
              ], 
              "is_wrapper": true
            }, 
            "output_name": "None", 
            "user_name": "assert_that/Match.out"
          }
        ], 
        "parallel_input": {
          "@type": "OutputReference", 
          "output_name": "None", 
          "step_name": "s20"
        }, 
        "serialized_fn": "ref_AppliedPTransform_assert_that/Match_30", 
        "user_name": "assert_that/Match"
      }
    }
  ], 
  "type": "JOB_TYPE_STREAMING"
}
INFO:apache_beam.runners.dataflow.internal.apiclient:Create job: <Job
 createTime: u'2020-08-21T00:59:29.247528Z'
 currentStateTime: u'1970-01-01T00:00:00Z'
 id: u'2020-08-20_17_59_28-8554732655575912405'
 location: u'us-central1'
 name: u'beamapp-jenkins-0821005918-622996'
 projectId: u'apache-beam-testing'
 stageStates: []
 startTime: u'2020-08-21T00:59:29.247528Z'
 steps: []
 tempFiles: []
 type: TypeValueValuesEnum(JOB_TYPE_STREAMING, 2)>
INFO:apache_beam.runners.dataflow.internal.apiclient:Created job with id: [2020-08-20_17_59_28-8554732655575912405]
INFO:apache_beam.runners.dataflow.internal.apiclient:Submitted job: 2020-08-20_17_59_28-8554732655575912405
INFO:apache_beam.runners.dataflow.internal.apiclient:To access the Dataflow monitoring console, please navigate to https://console.cloud.google.com/dataflow/jobs/us-central1/2020-08-20_17_59_28-8554732655575912405?project=apache-beam-testing
INFO:apache_beam.runners.dataflow.dataflow_runner:2020-08-21T00:59:27.249Z: JOB_MESSAGE_DETAILED: Autoscaling: Reduced the number of workers to 0 based on low average worker CPU utilization, and the pipeline having sufficiently low backlog and keeping up with input rate.
INFO:apache_beam.runners.dataflow.dataflow_runner:2020-08-21T00:59:27.333Z: JOB_MESSAGE_BASIC: Worker pool stopped.
INFO:apache_beam.runners.dataflow.dataflow_runner:2020-08-21T00:59:27.395Z: JOB_MESSAGE_DEBUG: Tearing down pending resources...
INFO:apache_beam.runners.dataflow.dataflow_runner:Job 2020-08-20_17_49_32-12019885076709819354 is in state JOB_STATE_DONE
WARNING:apache_beam.runners.dataflow.test_dataflow_runner:Waiting indefinitely for streaming job.
INFO:apache_beam.runners.dataflow.dataflow_runner:Job 2020-08-20_17_59_28-8554732655575912405 is in state JOB_STATE_RUNNING
test_empty_singleton_side_input (apache_beam.transforms.sideinputs_test.SideInputsTest) ... ok
INFO:apache_beam.runners.dataflow.dataflow_runner:2020-08-21T00:59:28.093Z: JOB_MESSAGE_DETAILED: Autoscaling is enabled for job 2020-08-20_17_59_28-8554732655575912405. The number of workers will be between 1 and 100.
INFO:apache_beam.runners.dataflow.dataflow_runner:2020-08-21T00:59:28.093Z: JOB_MESSAGE_WARNING: Autoscaling is enabled for Dataflow Streaming Engine. Workers will scale between 1 and 100 unless maxNumWorkers is specified.
INFO:apache_beam.runners.dataflow.dataflow_runner:2020-08-21T00:59:28.093Z: JOB_MESSAGE_DETAILED: Autoscaling was automatically enabled for job 2020-08-20_17_59_28-8554732655575912405.
INFO:apache_beam.runners.dataflow.dataflow_runner:2020-08-21T00:59:32.256Z: JOB_MESSAGE_BASIC: Worker configuration: n1-standard-2 in us-central1-a.
INFO:apache_beam.runners.dataflow.dataflow_runner:2020-08-21T00:59:33.011Z: JOB_MESSAGE_DETAILED: Expanding SplittableParDo operations into optimizable parts.
INFO:apache_beam.runners.dataflow.dataflow_runner:2020-08-21T00:59:33.042Z: JOB_MESSAGE_DETAILED: Expanding CollectionToSingleton operations into optimizable parts.
INFO:apache_beam.runners.dataflow.dataflow_runner:2020-08-21T00:59:33.110Z: JOB_MESSAGE_DETAILED: Expanding CoGroupByKey operations into optimizable parts.
INFO:apache_beam.runners.dataflow.dataflow_runner:2020-08-21T00:59:33.153Z: JOB_MESSAGE_DEBUG: Combiner lifting skipped for step assert_that/Group/GroupByKey: GroupByKey not followed by a combiner.
INFO:apache_beam.runners.dataflow.dataflow_runner:2020-08-21T00:59:33.180Z: JOB_MESSAGE_DEBUG: Combiner lifting skipped for step Create/MaybeReshuffle/Reshuffle/ReshufflePerKey/GroupByKey: GroupByKey not followed by a combiner.
INFO:apache_beam.runners.dataflow.dataflow_runner:2020-08-21T00:59:33.219Z: JOB_MESSAGE_DETAILED: Expanding SplittableProcessKeyed operations into optimizable parts.
INFO:apache_beam.runners.dataflow.dataflow_runner:2020-08-21T00:59:33.245Z: JOB_MESSAGE_DETAILED: Expanding GroupByKey operations into streaming Read/Write steps
INFO:apache_beam.runners.dataflow.dataflow_runner:2020-08-21T00:59:33.341Z: JOB_MESSAGE_DETAILED: Lifting ValueCombiningMappingFns into MergeBucketsMappingFns
INFO:apache_beam.runners.dataflow.dataflow_runner:2020-08-21T00:59:33.437Z: JOB_MESSAGE_DEBUG: Annotating graph with Autotuner information.
INFO:apache_beam.runners.dataflow.dataflow_runner:2020-08-21T00:59:33.495Z: JOB_MESSAGE_DETAILED: Fusing adjacent ParDo, Read, Write, and Flatten operations
INFO:apache_beam.runners.dataflow.dataflow_runner:2020-08-21T00:59:33.530Z: JOB_MESSAGE_DETAILED: Unzipping flatten s17 for input s15.None
INFO:apache_beam.runners.dataflow.dataflow_runner:2020-08-21T00:59:33.560Z: JOB_MESSAGE_DETAILED: Fusing unzipped copy of assert_that/Group/GroupByKey/WriteStream, through flatten assert_that/Group/Flatten, into producer assert_that/Group/pair_with_0
INFO:apache_beam.runners.dataflow.dataflow_runner:2020-08-21T00:59:33.609Z: JOB_MESSAGE_DETAILED: Fusing consumer assert_that/Group/GroupByKey/WriteStream into assert_that/Group/pair_with_1
INFO:apache_beam.runners.dataflow.dataflow_runner:2020-08-21T00:59:33.643Z: JOB_MESSAGE_DETAILED: Fusing consumer Create/MaybeReshuffle/Reshuffle/ReshufflePerKey/GroupByKey/MergeBuckets into Create/MaybeReshuffle/Reshuffle/ReshufflePerKey/GroupByKey/ReadStream
INFO:apache_beam.runners.dataflow.dataflow_runner:2020-08-21T00:59:33.676Z: JOB_MESSAGE_DETAILED: Fusing consumer Create/MaybeReshuffle/Reshuffle/ReshufflePerKey/FlatMap(restore_timestamps) into Create/MaybeReshuffle/Reshuffle/ReshufflePerKey/GroupByKey/MergeBuckets
INFO:apache_beam.runners.dataflow.dataflow_runner:2020-08-21T00:59:33.709Z: JOB_MESSAGE_DETAILED: Fusing consumer Create/MaybeReshuffle/Reshuffle/RemoveRandomKeys into Create/MaybeReshuffle/Reshuffle/ReshufflePerKey/FlatMap(restore_timestamps)
INFO:apache_beam.runners.dataflow.dataflow_runner:2020-08-21T00:59:33.744Z: JOB_MESSAGE_DETAILED: Fusing consumer Create/Map(decode) into Create/MaybeReshuffle/Reshuffle/RemoveRandomKeys
INFO:apache_beam.runners.dataflow.dataflow_runner:2020-08-21T00:59:33.779Z: JOB_MESSAGE_DETAILED: Fusing consumer Key param into Create/Map(decode)
INFO:apache_beam.runners.dataflow.dataflow_runner:2020-08-21T00:59:33.807Z: JOB_MESSAGE_DETAILED: Fusing consumer assert_that/WindowInto(WindowIntoFn) into Key param
INFO:apache_beam.runners.dataflow.dataflow_runner:2020-08-21T00:59:33.839Z: JOB_MESSAGE_DETAILED: Fusing consumer assert_that/ToVoidKey into assert_that/WindowInto(WindowIntoFn)
INFO:apache_beam.runners.dataflow.dataflow_runner:2020-08-21T00:59:33.872Z: JOB_MESSAGE_DETAILED: Fusing consumer assert_that/Group/pair_with_1 into assert_that/ToVoidKey
INFO:apache_beam.runners.dataflow.dataflow_runner:2020-08-21T00:59:33.908Z: JOB_MESSAGE_DETAILED: Fusing consumer assert_that/Group/GroupByKey/MergeBuckets into assert_that/Group/GroupByKey/ReadStream
INFO:apache_beam.runners.dataflow.dataflow_runner:2020-08-21T00:59:33.944Z: JOB_MESSAGE_DETAILED: Fusing consumer assert_that/Group/Map(_merge_tagged_vals_under_key) into assert_that/Group/GroupByKey/MergeBuckets
INFO:apache_beam.runners.dataflow.dataflow_runner:2020-08-21T00:59:33.979Z: JOB_MESSAGE_DETAILED: Fusing consumer assert_that/Unkey into assert_that/Group/Map(_merge_tagged_vals_under_key)
INFO:apache_beam.runners.dataflow.dataflow_runner:2020-08-21T00:59:34.005Z: JOB_MESSAGE_DETAILED: Fusing consumer assert_that/Match into assert_that/Unkey
INFO:apache_beam.runners.dataflow.dataflow_runner:2020-08-21T00:59:34.029Z: JOB_MESSAGE_DETAILED: Fusing consumer Create/FlatMap(<lambda at core.py:2833>) into Create/Impulse
INFO:apache_beam.runners.dataflow.dataflow_runner:2020-08-21T00:59:34.067Z: JOB_MESSAGE_DETAILED: Fusing consumer assert_that/Create/FlatMap(<lambda at core.py:2833>) into assert_that/Create/Impulse
INFO:apache_beam.runners.dataflow.dataflow_runner:2020-08-21T00:59:34.117Z: JOB_MESSAGE_DETAILED: Fusing consumer assert_that/Create/Map(decode) into assert_that/Create/FlatMap(<lambda at core.py:2833>)
INFO:apache_beam.runners.dataflow.dataflow_runner:2020-08-21T00:59:34.177Z: JOB_MESSAGE_DETAILED: Fusing consumer assert_that/Group/pair_with_0 into assert_that/Create/Map(decode)
INFO:apache_beam.runners.dataflow.dataflow_runner:2020-08-21T00:59:34.278Z: JOB_MESSAGE_DETAILED: Fusing consumer Create/MaybeReshuffle/Reshuffle/AddRandomKeys into Create/FlatMap(<lambda at core.py:2833>)
INFO:apache_beam.runners.dataflow.dataflow_runner:2020-08-21T00:59:34.357Z: JOB_MESSAGE_DETAILED: Fusing consumer Create/MaybeReshuffle/Reshuffle/ReshufflePerKey/Map(reify_timestamps) into Create/MaybeReshuffle/Reshuffle/AddRandomKeys
INFO:apache_beam.runners.dataflow.dataflow_runner:2020-08-21T00:59:34.414Z: JOB_MESSAGE_DETAILED: Fusing consumer Create/MaybeReshuffle/Reshuffle/ReshufflePerKey/GroupByKey/WriteStream into Create/MaybeReshuffle/Reshuffle/ReshufflePerKey/Map(reify_timestamps)
INFO:apache_beam.runners.dataflow.dataflow_runner:2020-08-21T00:59:34.492Z: JOB_MESSAGE_DEBUG: Workflow config is missing a default resource spec.
INFO:apache_beam.runners.dataflow.dataflow_runner:2020-08-21T00:59:34.529Z: JOB_MESSAGE_DEBUG: Adding StepResource setup and teardown to workflow graph.
INFO:apache_beam.runners.dataflow.dataflow_runner:2020-08-21T00:59:34.565Z: JOB_MESSAGE_DEBUG: Adding workflow start and stop steps.
INFO:apache_beam.runners.dataflow.dataflow_runner:2020-08-21T00:59:34.600Z: JOB_MESSAGE_DEBUG: Assigning stage ids.
INFO:apache_beam.runners.dataflow.dataflow_runner:2020-08-21T00:59:36.898Z: JOB_MESSAGE_DEBUG: Starting worker pool setup.
INFO:apache_beam.runners.dataflow.dataflow_runner:2020-08-21T00:59:36.971Z: JOB_MESSAGE_DEBUG: Starting worker pool setup.
INFO:apache_beam.runners.dataflow.dataflow_runner:2020-08-21T00:59:37.023Z: JOB_MESSAGE_BASIC: Starting 1 workers in us-central1-a...
INFO:apache_beam.runners.dataflow.dataflow_runner:2020-08-21T01:00:00.648Z: JOB_MESSAGE_WARNING: Your project already contains 100 Dataflow-created metric descriptors and Stackdriver will not create new Dataflow custom metrics for this job. Each unique user-defined metric name (independent of the DoFn in which it is defined) produces a new metric descriptor. To delete old / unused metric descriptors see https://developers.google.com/apis-explorer/#p/monitoring/v3/monitoring.projects.metricDescriptors.list and https://developers.google.com/apis-explorer/#p/monitoring/v3/monitoring.projects.metricDescriptors.delete
INFO:apache_beam.runners.dataflow.dataflow_runner:2020-08-21T01:00:07.632Z: JOB_MESSAGE_DETAILED: Autoscaling: Raised the number of workers to 1 so that the pipeline can catch up with its backlog and keep up with its input rate.
INFO:apache_beam.runners.dataflow.dataflow_runner:2020-08-21T01:00:53.774Z: JOB_MESSAGE_DETAILED: Workers have started successfully.
INFO:apache_beam.runners.dataflow.dataflow_runner:2020-08-21T01:00:53.805Z: JOB_MESSAGE_DETAILED: Workers have started successfully.
INFO:apache_beam.runners.dataflow.dataflow_runner:2020-08-21T01:06:38.770Z: JOB_MESSAGE_DETAILED: Cleaning up.
INFO:apache_beam.runners.dataflow.dataflow_runner:2020-08-21T01:06:38.897Z: JOB_MESSAGE_DEBUG: Starting worker pool teardown.
INFO:apache_beam.runners.dataflow.dataflow_runner:2020-08-21T01:06:38.922Z: JOB_MESSAGE_BASIC: Stopping worker pool...
INFO:apache_beam.runners.dataflow.dataflow_runner:2020-08-21T01:06:38.960Z: JOB_MESSAGE_DEBUG: Starting worker pool teardown.
INFO:apache_beam.runners.dataflow.dataflow_runner:2020-08-21T01:06:39.066Z: JOB_MESSAGE_BASIC: Stopping worker pool...
INFO:apache_beam.runners.dataflow.dataflow_runner:2020-08-21T01:07:28.142Z: JOB_MESSAGE_DETAILED: Autoscaling: Reduced the number of workers to 0 based on low average worker CPU utilization, and the pipeline having sufficiently low backlog and keeping up with input rate.
INFO:apache_beam.runners.dataflow.dataflow_runner:2020-08-21T01:07:28.179Z: JOB_MESSAGE_BASIC: Worker pool stopped.
INFO:apache_beam.runners.dataflow.dataflow_runner:2020-08-21T01:07:28.205Z: JOB_MESSAGE_DEBUG: Tearing down pending resources...
INFO:apache_beam.runners.dataflow.dataflow_runner:Job 2020-08-20_17_59_28-8554732655575912405 is in state JOB_STATE_DONE
test_element_param (apache_beam.pipeline_test.DoFnTest) ... ok
test_key_param (apache_beam.pipeline_test.DoFnTest) ... ok

----------------------------------------------------------------------
XML: nosetests-validatesRunnerStreamingTests-df-py27.xml
----------------------------------------------------------------------
XML: <https://ci-beam.apache.org/job/beam_PostCommit_Py_VR_Dataflow_V2/ws/src/sdks/python/nosetests.xml>
----------------------------------------------------------------------
Ran 27 tests in 2127.069s

OK
Worker logs: https://console.cloud.google.com/dataflow/jobs/us-central1/2020-08-20_17_32_36-10552198768269404645?project=apache-beam-testing
Worker logs: https://console.cloud.google.com/dataflow/jobs/us-central1/2020-08-20_17_42_17-15016623793889673312?project=apache-beam-testing
Worker logs: https://console.cloud.google.com/dataflow/jobs/us-central1/2020-08-20_17_50_52-5509105271795832909?project=apache-beam-testing
Worker logs: https://console.cloud.google.com/dataflow/jobs/us-central1/2020-08-20_17_59_28-8554732655575912405?project=apache-beam-testing
Worker logs: https://console.cloud.google.com/dataflow/jobs/us-central1/2020-08-20_17_32_35-13733730632276318157?project=apache-beam-testing
Worker logs: https://console.cloud.google.com/dataflow/jobs/us-central1/2020-08-20_17_41_07-3937514595832069395?project=apache-beam-testing
Worker logs: https://console.cloud.google.com/dataflow/jobs/us-central1/2020-08-20_17_49_32-12019885076709819354?project=apache-beam-testing
Worker logs: https://console.cloud.google.com/dataflow/jobs/us-central1/2020-08-20_17_32_37-11267026274439930686?project=apache-beam-testing
Worker logs: https://console.cloud.google.com/dataflow/jobs/us-central1/2020-08-20_17_39_45-5582741583531532169?project=apache-beam-testing
Worker logs: https://console.cloud.google.com/dataflow/jobs/us-central1/2020-08-20_17_48_21-9977250161037711777?project=apache-beam-testing
Worker logs: https://console.cloud.google.com/dataflow/jobs/us-central1/2020-08-20_17_32_36-765125314190212483?project=apache-beam-testing
Worker logs: https://console.cloud.google.com/dataflow/jobs/us-central1/2020-08-20_17_42_02-12655081143190406709?project=apache-beam-testing
Worker logs: https://console.cloud.google.com/dataflow/jobs/us-central1/2020-08-20_17_32_36-2234888580744724698?project=apache-beam-testing
Worker logs: https://console.cloud.google.com/dataflow/jobs/us-central1/2020-08-20_17_41_13-12642499918606984346?project=apache-beam-testing
Worker logs: https://console.cloud.google.com/dataflow/jobs/us-central1/2020-08-20_17_49_43-5271862855945110075?project=apache-beam-testing
Worker logs: https://console.cloud.google.com/dataflow/jobs/us-central1/2020-08-20_17_32_34-2725408810261104309?project=apache-beam-testing
Worker logs: https://console.cloud.google.com/dataflow/jobs/us-central1/2020-08-20_17_41_01-6538715684737678224?project=apache-beam-testing
Worker logs: https://console.cloud.google.com/dataflow/jobs/us-central1/2020-08-20_17_49_32-13723004897870287763?project=apache-beam-testing
Worker logs: https://console.cloud.google.com/dataflow/jobs/us-central1/2020-08-20_17_32_37-5689809499637495126?project=apache-beam-testing
Worker logs: https://console.cloud.google.com/dataflow/jobs/us-central1/2020-08-20_17_41_15-9045433656113476080?project=apache-beam-testing
Worker logs: https://console.cloud.google.com/dataflow/jobs/us-central1/2020-08-20_17_49_46-14995218310028619138?project=apache-beam-testing
Worker logs: https://console.cloud.google.com/dataflow/jobs/us-central1/2020-08-20_17_32_36-1104204695665665837?project=apache-beam-testing
Worker logs: https://console.cloud.google.com/dataflow/jobs/us-central1/2020-08-20_17_41_08-6104061088026660137?project=apache-beam-testing
Worker logs: https://console.cloud.google.com/dataflow/jobs/us-central1/2020-08-20_17_49_37-15744436223094563510?project=apache-beam-testing

FAILURE: Build failed with an exception.

* Where:
Script '<https://ci-beam.apache.org/job/beam_PostCommit_Py_VR_Dataflow_V2/ws/src/sdks/python/test-suites/dataflow/common.gradle'> line: 146

* What went wrong:
Execution failed for task ':sdks:python:test-suites:dataflow:py2:validatesRunnerBatchTests'.
> Process 'command 'sh'' finished with non-zero exit value 1

* Try:
Run with --stacktrace option to get the stack trace. Run with --info or --debug option to get more log output. Run with --scan to get full insights.

* Get more help at https://help.gradle.org

Deprecated Gradle features were used in this build, making it incompatible with Gradle 6.0.
Use '--warning-mode all' to show the individual deprecation warnings.
See https://docs.gradle.org/5.2.1/userguide/command_line_interface.html#sec:command_line_warnings

BUILD FAILED in 1h 7m 20s
65 actionable tasks: 47 executed, 18 from cache

Publishing build scan...
https://gradle.com/s/crkxde5y3rady

Build step 'Invoke Gradle script' changed build result to FAILURE
Build step 'Invoke Gradle script' marked build as failure

---------------------------------------------------------------------
To unsubscribe, e-mail: builds-unsubscribe@beam.apache.org
For additional commands, e-mail: builds-help@beam.apache.org


Build failed in Jenkins: beam_PostCommit_Py_VR_Dataflow_V2 #946

Posted by Apache Jenkins Server <je...@builds.apache.org>.
See <https://ci-beam.apache.org/job/beam_PostCommit_Py_VR_Dataflow_V2/946/display/redirect?page=changes>

Changes:

[david.janicek] [BEAM-10292] LocalFileSystem.matchNewResource method throws

[Kamil Wasilewski] [BEAM-10674] Python CoGBK: Remove unnecessary step. Adjust parameters to

[Kamil Wasilewski] [BEAM-10674] Python CoGBK: Add streaming job

[Kyle Weaver] [BEAM-9118] Increase portable_runner_test timeout.

[Kyle Weaver] [BEAM-10770] Remove DataflowPortabilityApiUnsupported annotation.

[david.janicek] [BEAM-10292] changes after review


------------------------------------------
[...truncated 5.44 MB...]
            "namespace": "apache_beam.transforms.core.ParDo", 
            "shortValue": "CallableWrapperDoFn", 
            "type": "STRING", 
            "value": "apache_beam.transforms.core.CallableWrapperDoFn"
          }
        ], 
        "non_parallel_inputs": {}, 
        "output_info": [
          {
            "encoding": {
              "@type": "kind:windowed_value", 
              "component_encodings": [
                {
                  "@type": "FastPrimitivesCoder$<string of 176 bytes>", 
                  "component_encodings": [
                    {
                      "@type": "FastPrimitivesCoder$<string of 176 bytes>", 
                      "component_encodings": [], 
                      "pipeline_proto_coder_id": "ref_Coder_FastPrimitivesCoder_4"
                    }, 
                    {
                      "@type": "FastPrimitivesCoder$<string of 176 bytes>", 
                      "component_encodings": [], 
                      "pipeline_proto_coder_id": "ref_Coder_FastPrimitivesCoder_4"
                    }
                  ], 
                  "is_pair_like": true, 
                  "pipeline_proto_coder_id": "ref_Coder_FastPrimitivesCoder_4"
                }, 
                {
                  "@type": "kind:global_window"
                }
              ], 
              "is_wrapper": true
            }, 
            "output_name": "None", 
            "user_name": "assert_that/Unkey.out"
          }
        ], 
        "parallel_input": {
          "@type": "OutputReference", 
          "output_name": "None", 
          "step_name": "s19"
        }, 
        "serialized_fn": "ref_AppliedPTransform_assert_that/Unkey_29", 
        "user_name": "assert_that/Unkey"
      }
    }, 
    {
      "kind": "ParallelDo", 
      "name": "s21", 
      "properties": {
        "display_data": [
          {
            "key": "fn", 
            "label": "Transform Function", 
            "namespace": "apache_beam.transforms.core.CallableWrapperDoFn", 
            "type": "STRING", 
            "value": "_equal"
          }, 
          {
            "key": "fn", 
            "label": "Transform Function", 
            "namespace": "apache_beam.transforms.core.ParDo", 
            "shortValue": "CallableWrapperDoFn", 
            "type": "STRING", 
            "value": "apache_beam.transforms.core.CallableWrapperDoFn"
          }
        ], 
        "non_parallel_inputs": {}, 
        "output_info": [
          {
            "encoding": {
              "@type": "kind:windowed_value", 
              "component_encodings": [
                {
                  "@type": "FastPrimitivesCoder$<string of 176 bytes>", 
                  "component_encodings": [
                    {
                      "@type": "FastPrimitivesCoder$<string of 176 bytes>", 
                      "component_encodings": [], 
                      "pipeline_proto_coder_id": "ref_Coder_FastPrimitivesCoder_4"
                    }, 
                    {
                      "@type": "FastPrimitivesCoder$<string of 176 bytes>", 
                      "component_encodings": [], 
                      "pipeline_proto_coder_id": "ref_Coder_FastPrimitivesCoder_4"
                    }
                  ], 
                  "is_pair_like": true, 
                  "pipeline_proto_coder_id": "ref_Coder_FastPrimitivesCoder_4"
                }, 
                {
                  "@type": "kind:global_window"
                }
              ], 
              "is_wrapper": true
            }, 
            "output_name": "None", 
            "user_name": "assert_that/Match.out"
          }
        ], 
        "parallel_input": {
          "@type": "OutputReference", 
          "output_name": "None", 
          "step_name": "s20"
        }, 
        "serialized_fn": "ref_AppliedPTransform_assert_that/Match_30", 
        "user_name": "assert_that/Match"
      }
    }
  ], 
  "type": "JOB_TYPE_STREAMING"
}
INFO:apache_beam.runners.dataflow.internal.apiclient:Create job: <Job
 createTime: u'2020-08-20T19:00:00.670554Z'
 currentStateTime: u'1970-01-01T00:00:00Z'
 id: u'2020-08-20_11_59_59-10961065162205110194'
 location: u'us-central1'
 name: u'beamapp-jenkins-0820185950-588128'
 projectId: u'apache-beam-testing'
 stageStates: []
 startTime: u'2020-08-20T19:00:00.670554Z'
 steps: []
 tempFiles: []
 type: TypeValueValuesEnum(JOB_TYPE_STREAMING, 2)>
INFO:apache_beam.runners.dataflow.internal.apiclient:Created job with id: [2020-08-20_11_59_59-10961065162205110194]
INFO:apache_beam.runners.dataflow.internal.apiclient:Submitted job: 2020-08-20_11_59_59-10961065162205110194
INFO:apache_beam.runners.dataflow.internal.apiclient:To access the Dataflow monitoring console, please navigate to https://console.cloud.google.com/dataflow/jobs/us-central1/2020-08-20_11_59_59-10961065162205110194?project=apache-beam-testing
WARNING:apache_beam.runners.dataflow.test_dataflow_runner:Waiting indefinitely for streaming job.
INFO:apache_beam.runners.dataflow.dataflow_runner:Job 2020-08-20_11_59_59-10961065162205110194 is in state JOB_STATE_RUNNING
INFO:apache_beam.runners.dataflow.dataflow_runner:2020-08-20T18:59:59.619Z: JOB_MESSAGE_DETAILED: Autoscaling is enabled for job 2020-08-20_11_59_59-10961065162205110194. The number of workers will be between 1 and 100.
INFO:apache_beam.runners.dataflow.dataflow_runner:2020-08-20T18:59:59.619Z: JOB_MESSAGE_WARNING: Autoscaling is enabled for Dataflow Streaming Engine. Workers will scale between 1 and 100 unless maxNumWorkers is specified.
INFO:apache_beam.runners.dataflow.dataflow_runner:2020-08-20T18:59:59.619Z: JOB_MESSAGE_DETAILED: Autoscaling was automatically enabled for job 2020-08-20_11_59_59-10961065162205110194.
INFO:apache_beam.runners.dataflow.dataflow_runner:2020-08-20T19:00:14.462Z: JOB_MESSAGE_BASIC: Worker configuration: n1-standard-2 in us-central1-b.
INFO:apache_beam.runners.dataflow.dataflow_runner:2020-08-20T19:00:15.127Z: JOB_MESSAGE_DETAILED: Expanding SplittableParDo operations into optimizable parts.
INFO:apache_beam.runners.dataflow.dataflow_runner:2020-08-20T19:00:15.168Z: JOB_MESSAGE_DETAILED: Expanding CollectionToSingleton operations into optimizable parts.
INFO:apache_beam.runners.dataflow.dataflow_runner:2020-08-20T19:00:15.237Z: JOB_MESSAGE_DETAILED: Expanding CoGroupByKey operations into optimizable parts.
INFO:apache_beam.runners.dataflow.dataflow_runner:2020-08-20T19:00:15.280Z: JOB_MESSAGE_DEBUG: Combiner lifting skipped for step assert_that/Group/GroupByKey: GroupByKey not followed by a combiner.
INFO:apache_beam.runners.dataflow.dataflow_runner:2020-08-20T19:00:15.316Z: JOB_MESSAGE_DEBUG: Combiner lifting skipped for step Create/MaybeReshuffle/Reshuffle/ReshufflePerKey/GroupByKey: GroupByKey not followed by a combiner.
INFO:apache_beam.runners.dataflow.dataflow_runner:2020-08-20T19:00:15.355Z: JOB_MESSAGE_DETAILED: Expanding SplittableProcessKeyed operations into optimizable parts.
INFO:apache_beam.runners.dataflow.dataflow_runner:2020-08-20T19:00:15.382Z: JOB_MESSAGE_DETAILED: Expanding GroupByKey operations into streaming Read/Write steps
INFO:apache_beam.runners.dataflow.dataflow_runner:2020-08-20T19:00:15.468Z: JOB_MESSAGE_DETAILED: Lifting ValueCombiningMappingFns into MergeBucketsMappingFns
INFO:apache_beam.runners.dataflow.dataflow_runner:2020-08-20T19:00:15.577Z: JOB_MESSAGE_DEBUG: Annotating graph with Autotuner information.
INFO:apache_beam.runners.dataflow.dataflow_runner:2020-08-20T19:00:15.618Z: JOB_MESSAGE_DETAILED: Fusing adjacent ParDo, Read, Write, and Flatten operations
INFO:apache_beam.runners.dataflow.dataflow_runner:2020-08-20T19:00:15.650Z: JOB_MESSAGE_DETAILED: Unzipping flatten s17 for input s15.None
INFO:apache_beam.runners.dataflow.dataflow_runner:2020-08-20T19:00:15.681Z: JOB_MESSAGE_DETAILED: Fusing unzipped copy of assert_that/Group/GroupByKey/WriteStream, through flatten assert_that/Group/Flatten, into producer assert_that/Group/pair_with_0
INFO:apache_beam.runners.dataflow.dataflow_runner:2020-08-20T19:00:15.718Z: JOB_MESSAGE_DETAILED: Fusing consumer assert_that/Group/GroupByKey/WriteStream into assert_that/Group/pair_with_1
INFO:apache_beam.runners.dataflow.dataflow_runner:2020-08-20T19:00:15.751Z: JOB_MESSAGE_DETAILED: Fusing consumer Create/MaybeReshuffle/Reshuffle/ReshufflePerKey/GroupByKey/MergeBuckets into Create/MaybeReshuffle/Reshuffle/ReshufflePerKey/GroupByKey/ReadStream
INFO:apache_beam.runners.dataflow.dataflow_runner:2020-08-20T19:00:15.787Z: JOB_MESSAGE_DETAILED: Fusing consumer Create/MaybeReshuffle/Reshuffle/ReshufflePerKey/FlatMap(restore_timestamps) into Create/MaybeReshuffle/Reshuffle/ReshufflePerKey/GroupByKey/MergeBuckets
INFO:apache_beam.runners.dataflow.dataflow_runner:2020-08-20T19:00:15.811Z: JOB_MESSAGE_DETAILED: Fusing consumer Create/MaybeReshuffle/Reshuffle/RemoveRandomKeys into Create/MaybeReshuffle/Reshuffle/ReshufflePerKey/FlatMap(restore_timestamps)
INFO:apache_beam.runners.dataflow.dataflow_runner:2020-08-20T19:00:15.833Z: JOB_MESSAGE_DETAILED: Fusing consumer Create/Map(decode) into Create/MaybeReshuffle/Reshuffle/RemoveRandomKeys
INFO:apache_beam.runners.dataflow.dataflow_runner:2020-08-20T19:00:15.855Z: JOB_MESSAGE_DETAILED: Fusing consumer Key param into Create/Map(decode)
INFO:apache_beam.runners.dataflow.dataflow_runner:2020-08-20T19:00:15.887Z: JOB_MESSAGE_DETAILED: Fusing consumer assert_that/WindowInto(WindowIntoFn) into Key param
INFO:apache_beam.runners.dataflow.dataflow_runner:2020-08-20T19:00:15.918Z: JOB_MESSAGE_DETAILED: Fusing consumer assert_that/ToVoidKey into assert_that/WindowInto(WindowIntoFn)
INFO:apache_beam.runners.dataflow.dataflow_runner:2020-08-20T19:00:15.948Z: JOB_MESSAGE_DETAILED: Fusing consumer assert_that/Group/pair_with_1 into assert_that/ToVoidKey
INFO:apache_beam.runners.dataflow.dataflow_runner:2020-08-20T19:00:15.980Z: JOB_MESSAGE_DETAILED: Fusing consumer assert_that/Group/GroupByKey/MergeBuckets into assert_that/Group/GroupByKey/ReadStream
INFO:apache_beam.runners.dataflow.dataflow_runner:2020-08-20T19:00:16.006Z: JOB_MESSAGE_DETAILED: Fusing consumer assert_that/Group/Map(_merge_tagged_vals_under_key) into assert_that/Group/GroupByKey/MergeBuckets
INFO:apache_beam.runners.dataflow.dataflow_runner:2020-08-20T19:00:16.039Z: JOB_MESSAGE_DETAILED: Fusing consumer assert_that/Unkey into assert_that/Group/Map(_merge_tagged_vals_under_key)
INFO:apache_beam.runners.dataflow.dataflow_runner:2020-08-20T19:00:16.082Z: JOB_MESSAGE_DETAILED: Fusing consumer assert_that/Match into assert_that/Unkey
INFO:apache_beam.runners.dataflow.dataflow_runner:2020-08-20T19:00:16.107Z: JOB_MESSAGE_DETAILED: Fusing consumer Create/FlatMap(<lambda at core.py:2833>) into Create/Impulse
INFO:apache_beam.runners.dataflow.dataflow_runner:2020-08-20T19:00:16.140Z: JOB_MESSAGE_DETAILED: Fusing consumer assert_that/Create/FlatMap(<lambda at core.py:2833>) into assert_that/Create/Impulse
INFO:apache_beam.runners.dataflow.dataflow_runner:2020-08-20T19:00:16.167Z: JOB_MESSAGE_DETAILED: Fusing consumer assert_that/Create/Map(decode) into assert_that/Create/FlatMap(<lambda at core.py:2833>)
INFO:apache_beam.runners.dataflow.dataflow_runner:2020-08-20T19:00:16.191Z: JOB_MESSAGE_DETAILED: Fusing consumer assert_that/Group/pair_with_0 into assert_that/Create/Map(decode)
INFO:apache_beam.runners.dataflow.dataflow_runner:2020-08-20T19:00:16.214Z: JOB_MESSAGE_DETAILED: Fusing consumer Create/MaybeReshuffle/Reshuffle/AddRandomKeys into Create/FlatMap(<lambda at core.py:2833>)
INFO:apache_beam.runners.dataflow.dataflow_runner:2020-08-20T19:00:16.259Z: JOB_MESSAGE_DETAILED: Fusing consumer Create/MaybeReshuffle/Reshuffle/ReshufflePerKey/Map(reify_timestamps) into Create/MaybeReshuffle/Reshuffle/AddRandomKeys
INFO:apache_beam.runners.dataflow.dataflow_runner:2020-08-20T19:00:16.292Z: JOB_MESSAGE_DETAILED: Fusing consumer Create/MaybeReshuffle/Reshuffle/ReshufflePerKey/GroupByKey/WriteStream into Create/MaybeReshuffle/Reshuffle/ReshufflePerKey/Map(reify_timestamps)
INFO:apache_beam.runners.dataflow.dataflow_runner:2020-08-20T19:00:16.340Z: JOB_MESSAGE_DEBUG: Workflow config is missing a default resource spec.
INFO:apache_beam.runners.dataflow.dataflow_runner:2020-08-20T19:00:16.370Z: JOB_MESSAGE_DEBUG: Adding StepResource setup and teardown to workflow graph.
INFO:apache_beam.runners.dataflow.dataflow_runner:2020-08-20T19:00:16.410Z: JOB_MESSAGE_DEBUG: Adding workflow start and stop steps.
INFO:apache_beam.runners.dataflow.dataflow_runner:2020-08-20T19:00:16.446Z: JOB_MESSAGE_DEBUG: Assigning stage ids.
INFO:apache_beam.runners.dataflow.dataflow_runner:2020-08-20T19:00:18.718Z: JOB_MESSAGE_DEBUG: Starting worker pool setup.
INFO:apache_beam.runners.dataflow.dataflow_runner:2020-08-20T19:00:18.745Z: JOB_MESSAGE_BASIC: Starting 1 workers in us-central1-b...
INFO:apache_beam.runners.dataflow.dataflow_runner:2020-08-20T19:00:18.768Z: JOB_MESSAGE_DEBUG: Starting worker pool setup.
INFO:apache_beam.runners.dataflow.dataflow_runner:2020-08-20T19:00:27.567Z: JOB_MESSAGE_WARNING: Your project already contains 100 Dataflow-created metric descriptors and Stackdriver will not create new Dataflow custom metrics for this job. Each unique user-defined metric name (independent of the DoFn in which it is defined) produces a new metric descriptor. To delete old / unused metric descriptors see https://developers.google.com/apis-explorer/#p/monitoring/v3/monitoring.projects.metricDescriptors.list and https://developers.google.com/apis-explorer/#p/monitoring/v3/monitoring.projects.metricDescriptors.delete
INFO:apache_beam.runners.dataflow.dataflow_runner:2020-08-20T19:00:42.337Z: JOB_MESSAGE_DETAILED: Autoscaling: Raised the number of workers to 1 so that the pipeline can catch up with its backlog and keep up with its input rate.
INFO:apache_beam.runners.dataflow.dataflow_runner:2020-08-20T19:01:22.308Z: JOB_MESSAGE_DETAILED: Workers have started successfully.
INFO:apache_beam.runners.dataflow.dataflow_runner:2020-08-20T19:01:22.344Z: JOB_MESSAGE_DETAILED: Workers have started successfully.
INFO:apache_beam.runners.dataflow.dataflow_runner:2020-08-20T19:07:19.769Z: JOB_MESSAGE_DETAILED: Cleaning up.
INFO:apache_beam.runners.dataflow.dataflow_runner:2020-08-20T19:07:19.839Z: JOB_MESSAGE_DEBUG: Starting worker pool teardown.
INFO:apache_beam.runners.dataflow.dataflow_runner:2020-08-20T19:07:19.861Z: JOB_MESSAGE_BASIC: Stopping worker pool...
INFO:apache_beam.runners.dataflow.dataflow_runner:2020-08-20T19:07:19.881Z: JOB_MESSAGE_DEBUG: Starting worker pool teardown.
INFO:apache_beam.runners.dataflow.dataflow_runner:2020-08-20T19:07:19.903Z: JOB_MESSAGE_BASIC: Stopping worker pool...
INFO:apache_beam.runners.dataflow.dataflow_runner:2020-08-20T19:07:56.621Z: JOB_MESSAGE_DETAILED: Autoscaling: Reduced the number of workers to 0 based on low average worker CPU utilization, and the pipeline having sufficiently low backlog and keeping up with input rate.
INFO:apache_beam.runners.dataflow.dataflow_runner:2020-08-20T19:07:56.652Z: JOB_MESSAGE_BASIC: Worker pool stopped.
INFO:apache_beam.runners.dataflow.dataflow_runner:2020-08-20T19:07:56.685Z: JOB_MESSAGE_DEBUG: Tearing down pending resources...
INFO:apache_beam.runners.dataflow.dataflow_runner:Job 2020-08-20_11_59_59-10961065162205110194 is in state JOB_STATE_DONE
test_element_param (apache_beam.pipeline_test.DoFnTest) ... ok
test_key_param (apache_beam.pipeline_test.DoFnTest) ... ok

----------------------------------------------------------------------
XML: nosetests-validatesRunnerStreamingTests-df-py27.xml
----------------------------------------------------------------------
XML: <https://ci-beam.apache.org/job/beam_PostCommit_Py_VR_Dataflow_V2/ws/src/sdks/python/nosetests.xml>
----------------------------------------------------------------------
Ran 27 tests in 2043.271s

OK
Worker logs: https://console.cloud.google.com/dataflow/jobs/us-central1/2020-08-20_11_34_27-8089858113936072223?project=apache-beam-testing
Worker logs: https://console.cloud.google.com/dataflow/jobs/us-central1/2020-08-20_11_42_56-16816300416105819961?project=apache-beam-testing
Worker logs: https://console.cloud.google.com/dataflow/jobs/us-central1/2020-08-20_11_51_27-8766307633499662291?project=apache-beam-testing
Worker logs: https://console.cloud.google.com/dataflow/jobs/us-central1/2020-08-20_11_59_59-10961065162205110194?project=apache-beam-testing
Worker logs: https://console.cloud.google.com/dataflow/jobs/us-central1/2020-08-20_11_34_26-2307571929097275493?project=apache-beam-testing
Worker logs: https://console.cloud.google.com/dataflow/jobs/us-central1/2020-08-20_11_42_48-6787771206519683708?project=apache-beam-testing
Worker logs: https://console.cloud.google.com/dataflow/jobs/us-central1/2020-08-20_11_51_24-15754133253641253264?project=apache-beam-testing
Worker logs: https://console.cloud.google.com/dataflow/jobs/us-central1/2020-08-20_11_34_27-6097192547331999344?project=apache-beam-testing
Worker logs: https://console.cloud.google.com/dataflow/jobs/us-central1/2020-08-20_11_41_37-12091308024677493402?project=apache-beam-testing
Worker logs: https://console.cloud.google.com/dataflow/jobs/us-central1/2020-08-20_11_50_18-17741985792263455985?project=apache-beam-testing
Worker logs: https://console.cloud.google.com/dataflow/jobs/us-central1/2020-08-20_11_34_27-3006340165785063677?project=apache-beam-testing
Worker logs: https://console.cloud.google.com/dataflow/jobs/us-central1/2020-08-20_11_41_51-11941477801668676672?project=apache-beam-testing
Worker logs: https://console.cloud.google.com/dataflow/jobs/us-central1/2020-08-20_11_50_10-1563649800761476361?project=apache-beam-testing
Worker logs: https://console.cloud.google.com/dataflow/jobs/us-central1/2020-08-20_11_34_26-5563299957848757355?project=apache-beam-testing
Worker logs: https://console.cloud.google.com/dataflow/jobs/us-central1/2020-08-20_11_42_48-14711731060649360321?project=apache-beam-testing
Worker logs: https://console.cloud.google.com/dataflow/jobs/us-central1/2020-08-20_11_34_26-6035965249273050184?project=apache-beam-testing
Worker logs: https://console.cloud.google.com/dataflow/jobs/us-central1/2020-08-20_11_42_57-2508429620664566546?project=apache-beam-testing
Worker logs: https://console.cloud.google.com/dataflow/jobs/us-central1/2020-08-20_11_51_19-3473776954141074574?project=apache-beam-testing
Worker logs: https://console.cloud.google.com/dataflow/jobs/us-central1/2020-08-20_11_34_28-10656727846917796343?project=apache-beam-testing
Worker logs: https://console.cloud.google.com/dataflow/jobs/us-central1/2020-08-20_11_42_53-5701312764026615228?project=apache-beam-testing
Worker logs: https://console.cloud.google.com/dataflow/jobs/us-central1/2020-08-20_11_51_13-14782624001810613732?project=apache-beam-testing
Worker logs: https://console.cloud.google.com/dataflow/jobs/us-central1/2020-08-20_11_34_26-6459524091083942443?project=apache-beam-testing
Worker logs: https://console.cloud.google.com/dataflow/jobs/us-central1/2020-08-20_11_42_56-13240180585342581496?project=apache-beam-testing
Worker logs: https://console.cloud.google.com/dataflow/jobs/us-central1/2020-08-20_11_51_27-1094175126004740318?project=apache-beam-testing

FAILURE: Build failed with an exception.

* Where:
Script '<https://ci-beam.apache.org/job/beam_PostCommit_Py_VR_Dataflow_V2/ws/src/sdks/python/test-suites/dataflow/common.gradle'> line: 146

* What went wrong:
Execution failed for task ':sdks:python:test-suites:dataflow:py2:validatesRunnerBatchTests'.
> Process 'command 'sh'' finished with non-zero exit value 1

* Try:
Run with --stacktrace option to get the stack trace. Run with --info or --debug option to get more log output. Run with --scan to get full insights.

* Get more help at https://help.gradle.org

Deprecated Gradle features were used in this build, making it incompatible with Gradle 6.0.
Use '--warning-mode all' to show the individual deprecation warnings.
See https://docs.gradle.org/5.2.1/userguide/command_line_interface.html#sec:command_line_warnings

BUILD FAILED in 1h 7m 47s
65 actionable tasks: 50 executed, 15 from cache

Publishing build scan...
https://gradle.com/s/qw2h2fwl2476c

Build step 'Invoke Gradle script' changed build result to FAILURE
Build step 'Invoke Gradle script' marked build as failure

---------------------------------------------------------------------
To unsubscribe, e-mail: builds-unsubscribe@beam.apache.org
For additional commands, e-mail: builds-help@beam.apache.org


beam_PostCommit_Py_VR_Dataflow_V2 - Build # 945 - Aborted!

Posted by Apache Jenkins Server <je...@builds.apache.org>.
beam_PostCommit_Py_VR_Dataflow_V2 - Build # 945 - Aborted:

Check console output at https://ci-beam.apache.org/job/beam_PostCommit_Py_VR_Dataflow_V2/945/ to view the results.

Build failed in Jenkins: beam_PostCommit_Py_VR_Dataflow_V2 #944

Posted by Apache Jenkins Server <je...@builds.apache.org>.
See <https://ci-beam.apache.org/job/beam_PostCommit_Py_VR_Dataflow_V2/944/display/redirect?page=changes>

Changes:

[douglas.damon] Add Filter lesson to Go SDK katas

[douglas.damon] Reformat code for readability

[yoshiki.obata] [BEAM-9980] Configure Python versions for direct test suite tasks via

[douglas.damon] Change license info format in task-info.yaml

[douglas.damon] Update stepik course

[kevinsijo] [BEAM-9920] Enabling artifact staging for xlang transforms

[kevinsijo] documentation(beam/sdks/go): added apache license and function docstring

[noreply] [BEAM-9547] Implement dataframes top, join, merge. (#12516)

[kevinsijo] fix(beam/sdks/go): correcting changed function name

[noreply] Merge pull request #12581 from [BEAM-10378] Add Azure Blob Storage


------------------------------------------
[...truncated 5.81 MB...]
            "namespace": "apache_beam.transforms.core.ParDo", 
            "shortValue": "CallableWrapperDoFn", 
            "type": "STRING", 
            "value": "apache_beam.transforms.core.CallableWrapperDoFn"
          }
        ], 
        "non_parallel_inputs": {}, 
        "output_info": [
          {
            "encoding": {
              "@type": "kind:windowed_value", 
              "component_encodings": [
                {
                  "@type": "FastPrimitivesCoder$<string of 176 bytes>", 
                  "component_encodings": [
                    {
                      "@type": "FastPrimitivesCoder$<string of 176 bytes>", 
                      "component_encodings": [], 
                      "pipeline_proto_coder_id": "ref_Coder_FastPrimitivesCoder_4"
                    }, 
                    {
                      "@type": "FastPrimitivesCoder$<string of 176 bytes>", 
                      "component_encodings": [], 
                      "pipeline_proto_coder_id": "ref_Coder_FastPrimitivesCoder_4"
                    }
                  ], 
                  "is_pair_like": true, 
                  "pipeline_proto_coder_id": "ref_Coder_FastPrimitivesCoder_4"
                }, 
                {
                  "@type": "kind:global_window"
                }
              ], 
              "is_wrapper": true
            }, 
            "output_name": "None", 
            "user_name": "assert_that/Unkey.out"
          }
        ], 
        "parallel_input": {
          "@type": "OutputReference", 
          "output_name": "None", 
          "step_name": "s19"
        }, 
        "serialized_fn": "ref_AppliedPTransform_assert_that/Unkey_29", 
        "user_name": "assert_that/Unkey"
      }
    }, 
    {
      "kind": "ParallelDo", 
      "name": "s21", 
      "properties": {
        "display_data": [
          {
            "key": "fn", 
            "label": "Transform Function", 
            "namespace": "apache_beam.transforms.core.CallableWrapperDoFn", 
            "type": "STRING", 
            "value": "_equal"
          }, 
          {
            "key": "fn", 
            "label": "Transform Function", 
            "namespace": "apache_beam.transforms.core.ParDo", 
            "shortValue": "CallableWrapperDoFn", 
            "type": "STRING", 
            "value": "apache_beam.transforms.core.CallableWrapperDoFn"
          }
        ], 
        "non_parallel_inputs": {}, 
        "output_info": [
          {
            "encoding": {
              "@type": "kind:windowed_value", 
              "component_encodings": [
                {
                  "@type": "FastPrimitivesCoder$<string of 176 bytes>", 
                  "component_encodings": [
                    {
                      "@type": "FastPrimitivesCoder$<string of 176 bytes>", 
                      "component_encodings": [], 
                      "pipeline_proto_coder_id": "ref_Coder_FastPrimitivesCoder_4"
                    }, 
                    {
                      "@type": "FastPrimitivesCoder$<string of 176 bytes>", 
                      "component_encodings": [], 
                      "pipeline_proto_coder_id": "ref_Coder_FastPrimitivesCoder_4"
                    }
                  ], 
                  "is_pair_like": true, 
                  "pipeline_proto_coder_id": "ref_Coder_FastPrimitivesCoder_4"
                }, 
                {
                  "@type": "kind:global_window"
                }
              ], 
              "is_wrapper": true
            }, 
            "output_name": "None", 
            "user_name": "assert_that/Match.out"
          }
        ], 
        "parallel_input": {
          "@type": "OutputReference", 
          "output_name": "None", 
          "step_name": "s20"
        }, 
        "serialized_fn": "ref_AppliedPTransform_assert_that/Match_30", 
        "user_name": "assert_that/Match"
      }
    }
  ], 
  "type": "JOB_TYPE_STREAMING"
}
INFO:apache_beam.runners.dataflow.internal.apiclient:Create job: <Job
 createTime: u'2020-08-20T06:58:47.785650Z'
 currentStateTime: u'1970-01-01T00:00:00Z'
 id: u'2020-08-19_23_58_46-15596488558403565241'
 location: u'us-central1'
 name: u'beamapp-jenkins-0820065836-537770'
 projectId: u'apache-beam-testing'
 stageStates: []
 startTime: u'2020-08-20T06:58:47.785650Z'
 steps: []
 tempFiles: []
 type: TypeValueValuesEnum(JOB_TYPE_STREAMING, 2)>
INFO:apache_beam.runners.dataflow.internal.apiclient:Created job with id: [2020-08-19_23_58_46-15596488558403565241]
INFO:apache_beam.runners.dataflow.internal.apiclient:Submitted job: 2020-08-19_23_58_46-15596488558403565241
INFO:apache_beam.runners.dataflow.internal.apiclient:To access the Dataflow monitoring console, please navigate to https://console.cloud.google.com/dataflow/jobs/us-central1/2020-08-19_23_58_46-15596488558403565241?project=apache-beam-testing
WARNING:apache_beam.runners.dataflow.test_dataflow_runner:Waiting indefinitely for streaming job.
INFO:apache_beam.runners.dataflow.dataflow_runner:Job 2020-08-19_23_58_46-15596488558403565241 is in state JOB_STATE_RUNNING
INFO:apache_beam.runners.dataflow.dataflow_runner:2020-08-20T06:58:46.502Z: JOB_MESSAGE_DETAILED: Autoscaling was automatically enabled for job 2020-08-19_23_58_46-15596488558403565241.
INFO:apache_beam.runners.dataflow.dataflow_runner:2020-08-20T06:58:46.502Z: JOB_MESSAGE_WARNING: Autoscaling is enabled for Dataflow Streaming Engine. Workers will scale between 1 and 100 unless maxNumWorkers is specified.
INFO:apache_beam.runners.dataflow.dataflow_runner:2020-08-20T06:58:46.502Z: JOB_MESSAGE_DETAILED: Autoscaling is enabled for job 2020-08-19_23_58_46-15596488558403565241. The number of workers will be between 1 and 100.
INFO:apache_beam.runners.dataflow.dataflow_runner:2020-08-20T06:58:51.041Z: JOB_MESSAGE_BASIC: Worker configuration: n1-standard-2 in us-central1-f.
INFO:apache_beam.runners.dataflow.dataflow_runner:2020-08-20T06:58:51.734Z: JOB_MESSAGE_DETAILED: Expanding SplittableParDo operations into optimizable parts.
INFO:apache_beam.runners.dataflow.dataflow_runner:2020-08-20T06:58:51.796Z: JOB_MESSAGE_DETAILED: Expanding CollectionToSingleton operations into optimizable parts.
INFO:apache_beam.runners.dataflow.dataflow_runner:2020-08-20T06:58:51.874Z: JOB_MESSAGE_DETAILED: Expanding CoGroupByKey operations into optimizable parts.
INFO:apache_beam.runners.dataflow.dataflow_runner:2020-08-20T06:58:51.938Z: JOB_MESSAGE_DEBUG: Combiner lifting skipped for step assert_that/Group/GroupByKey: GroupByKey not followed by a combiner.
INFO:apache_beam.runners.dataflow.dataflow_runner:2020-08-20T06:58:51.982Z: JOB_MESSAGE_DEBUG: Combiner lifting skipped for step Create/MaybeReshuffle/Reshuffle/ReshufflePerKey/GroupByKey: GroupByKey not followed by a combiner.
INFO:apache_beam.runners.dataflow.dataflow_runner:2020-08-20T06:58:52.023Z: JOB_MESSAGE_DETAILED: Expanding SplittableProcessKeyed operations into optimizable parts.
INFO:apache_beam.runners.dataflow.dataflow_runner:2020-08-20T06:58:52.063Z: JOB_MESSAGE_DETAILED: Expanding GroupByKey operations into streaming Read/Write steps
INFO:apache_beam.runners.dataflow.dataflow_runner:2020-08-20T06:58:52.141Z: JOB_MESSAGE_DETAILED: Lifting ValueCombiningMappingFns into MergeBucketsMappingFns
INFO:apache_beam.runners.dataflow.dataflow_runner:2020-08-20T06:58:52.254Z: JOB_MESSAGE_DEBUG: Annotating graph with Autotuner information.
INFO:apache_beam.runners.dataflow.dataflow_runner:2020-08-20T06:58:52.295Z: JOB_MESSAGE_DETAILED: Fusing adjacent ParDo, Read, Write, and Flatten operations
INFO:apache_beam.runners.dataflow.dataflow_runner:2020-08-20T06:58:52.332Z: JOB_MESSAGE_DETAILED: Unzipping flatten s17 for input s15.None
INFO:apache_beam.runners.dataflow.dataflow_runner:2020-08-20T06:58:52.362Z: JOB_MESSAGE_DETAILED: Fusing unzipped copy of assert_that/Group/GroupByKey/WriteStream, through flatten assert_that/Group/Flatten, into producer assert_that/Group/pair_with_0
INFO:apache_beam.runners.dataflow.dataflow_runner:2020-08-20T06:58:52.395Z: JOB_MESSAGE_DETAILED: Fusing consumer assert_that/Group/GroupByKey/WriteStream into assert_that/Group/pair_with_1
INFO:apache_beam.runners.dataflow.dataflow_runner:2020-08-20T06:58:52.432Z: JOB_MESSAGE_DETAILED: Fusing consumer Create/MaybeReshuffle/Reshuffle/ReshufflePerKey/GroupByKey/MergeBuckets into Create/MaybeReshuffle/Reshuffle/ReshufflePerKey/GroupByKey/ReadStream
INFO:apache_beam.runners.dataflow.dataflow_runner:2020-08-20T06:58:52.463Z: JOB_MESSAGE_DETAILED: Fusing consumer Create/MaybeReshuffle/Reshuffle/ReshufflePerKey/FlatMap(restore_timestamps) into Create/MaybeReshuffle/Reshuffle/ReshufflePerKey/GroupByKey/MergeBuckets
INFO:apache_beam.runners.dataflow.dataflow_runner:2020-08-20T06:58:52.500Z: JOB_MESSAGE_DETAILED: Fusing consumer Create/MaybeReshuffle/Reshuffle/RemoveRandomKeys into Create/MaybeReshuffle/Reshuffle/ReshufflePerKey/FlatMap(restore_timestamps)
INFO:apache_beam.runners.dataflow.dataflow_runner:2020-08-20T06:58:52.540Z: JOB_MESSAGE_DETAILED: Fusing consumer Create/Map(decode) into Create/MaybeReshuffle/Reshuffle/RemoveRandomKeys
INFO:apache_beam.runners.dataflow.dataflow_runner:2020-08-20T06:58:52.577Z: JOB_MESSAGE_DETAILED: Fusing consumer Key param into Create/Map(decode)
INFO:apache_beam.runners.dataflow.dataflow_runner:2020-08-20T06:58:52.613Z: JOB_MESSAGE_DETAILED: Fusing consumer assert_that/WindowInto(WindowIntoFn) into Key param
INFO:apache_beam.runners.dataflow.dataflow_runner:2020-08-20T06:58:52.651Z: JOB_MESSAGE_DETAILED: Fusing consumer assert_that/ToVoidKey into assert_that/WindowInto(WindowIntoFn)
INFO:apache_beam.runners.dataflow.dataflow_runner:2020-08-20T06:58:52.685Z: JOB_MESSAGE_DETAILED: Fusing consumer assert_that/Group/pair_with_1 into assert_that/ToVoidKey
INFO:apache_beam.runners.dataflow.dataflow_runner:2020-08-20T06:58:52.734Z: JOB_MESSAGE_DETAILED: Fusing consumer assert_that/Group/GroupByKey/MergeBuckets into assert_that/Group/GroupByKey/ReadStream
INFO:apache_beam.runners.dataflow.dataflow_runner:2020-08-20T06:58:52.771Z: JOB_MESSAGE_DETAILED: Fusing consumer assert_that/Group/Map(_merge_tagged_vals_under_key) into assert_that/Group/GroupByKey/MergeBuckets
INFO:apache_beam.runners.dataflow.dataflow_runner:2020-08-20T06:58:52.807Z: JOB_MESSAGE_DETAILED: Fusing consumer assert_that/Unkey into assert_that/Group/Map(_merge_tagged_vals_under_key)
INFO:apache_beam.runners.dataflow.dataflow_runner:2020-08-20T06:58:52.841Z: JOB_MESSAGE_DETAILED: Fusing consumer assert_that/Match into assert_that/Unkey
INFO:apache_beam.runners.dataflow.dataflow_runner:2020-08-20T06:58:52.868Z: JOB_MESSAGE_DETAILED: Fusing consumer Create/FlatMap(<lambda at core.py:2833>) into Create/Impulse
INFO:apache_beam.runners.dataflow.dataflow_runner:2020-08-20T06:58:52.907Z: JOB_MESSAGE_DETAILED: Fusing consumer assert_that/Create/FlatMap(<lambda at core.py:2833>) into assert_that/Create/Impulse
INFO:apache_beam.runners.dataflow.dataflow_runner:2020-08-20T06:58:52.944Z: JOB_MESSAGE_DETAILED: Fusing consumer assert_that/Create/Map(decode) into assert_that/Create/FlatMap(<lambda at core.py:2833>)
INFO:apache_beam.runners.dataflow.dataflow_runner:2020-08-20T06:58:52.982Z: JOB_MESSAGE_DETAILED: Fusing consumer assert_that/Group/pair_with_0 into assert_that/Create/Map(decode)
INFO:apache_beam.runners.dataflow.dataflow_runner:2020-08-20T06:58:53.035Z: JOB_MESSAGE_DETAILED: Fusing consumer Create/MaybeReshuffle/Reshuffle/AddRandomKeys into Create/FlatMap(<lambda at core.py:2833>)
INFO:apache_beam.runners.dataflow.dataflow_runner:2020-08-20T06:58:53.065Z: JOB_MESSAGE_DETAILED: Fusing consumer Create/MaybeReshuffle/Reshuffle/ReshufflePerKey/Map(reify_timestamps) into Create/MaybeReshuffle/Reshuffle/AddRandomKeys
INFO:apache_beam.runners.dataflow.dataflow_runner:2020-08-20T06:58:53.095Z: JOB_MESSAGE_DETAILED: Fusing consumer Create/MaybeReshuffle/Reshuffle/ReshufflePerKey/GroupByKey/WriteStream into Create/MaybeReshuffle/Reshuffle/ReshufflePerKey/Map(reify_timestamps)
INFO:apache_beam.runners.dataflow.dataflow_runner:2020-08-20T06:58:53.150Z: JOB_MESSAGE_DEBUG: Workflow config is missing a default resource spec.
INFO:apache_beam.runners.dataflow.dataflow_runner:2020-08-20T06:58:53.189Z: JOB_MESSAGE_DEBUG: Adding StepResource setup and teardown to workflow graph.
INFO:apache_beam.runners.dataflow.dataflow_runner:2020-08-20T06:58:53.224Z: JOB_MESSAGE_DEBUG: Adding workflow start and stop steps.
INFO:apache_beam.runners.dataflow.dataflow_runner:2020-08-20T06:58:53.263Z: JOB_MESSAGE_DEBUG: Assigning stage ids.
INFO:apache_beam.runners.dataflow.dataflow_runner:2020-08-20T06:58:57.492Z: JOB_MESSAGE_DEBUG: Starting worker pool setup.
INFO:apache_beam.runners.dataflow.dataflow_runner:2020-08-20T06:58:57.527Z: JOB_MESSAGE_BASIC: Starting 1 workers in us-central1-f...
INFO:apache_beam.runners.dataflow.dataflow_runner:2020-08-20T06:58:57.563Z: JOB_MESSAGE_DEBUG: Starting worker pool setup.
INFO:apache_beam.runners.dataflow.dataflow_runner:2020-08-20T06:59:01.110Z: JOB_MESSAGE_WARNING: Your project already contains 100 Dataflow-created metric descriptors and Stackdriver will not create new Dataflow custom metrics for this job. Each unique user-defined metric name (independent of the DoFn in which it is defined) produces a new metric descriptor. To delete old / unused metric descriptors see https://developers.google.com/apis-explorer/#p/monitoring/v3/monitoring.projects.metricDescriptors.list and https://developers.google.com/apis-explorer/#p/monitoring/v3/monitoring.projects.metricDescriptors.delete
INFO:apache_beam.runners.dataflow.dataflow_runner:2020-08-20T06:59:29.399Z: JOB_MESSAGE_DETAILED: Autoscaling: Raised the number of workers to 1 so that the pipeline can catch up with its backlog and keep up with its input rate.
INFO:apache_beam.runners.dataflow.dataflow_runner:2020-08-20T07:00:03.486Z: JOB_MESSAGE_DETAILED: Workers have started successfully.
INFO:apache_beam.runners.dataflow.dataflow_runner:2020-08-20T07:00:03.537Z: JOB_MESSAGE_DETAILED: Workers have started successfully.
INFO:apache_beam.runners.dataflow.dataflow_runner:2020-08-20T07:05:58.341Z: JOB_MESSAGE_DETAILED: Cleaning up.
INFO:apache_beam.runners.dataflow.dataflow_runner:2020-08-20T07:05:58.425Z: JOB_MESSAGE_DEBUG: Starting worker pool teardown.
INFO:apache_beam.runners.dataflow.dataflow_runner:2020-08-20T07:05:58.445Z: JOB_MESSAGE_BASIC: Stopping worker pool...
INFO:apache_beam.runners.dataflow.dataflow_runner:2020-08-20T07:05:58.479Z: JOB_MESSAGE_DEBUG: Starting worker pool teardown.
INFO:apache_beam.runners.dataflow.dataflow_runner:2020-08-20T07:05:58.541Z: JOB_MESSAGE_BASIC: Stopping worker pool...
INFO:apache_beam.runners.dataflow.dataflow_runner:2020-08-20T07:06:44.194Z: JOB_MESSAGE_DETAILED: Autoscaling: Reduced the number of workers to 0 based on low average worker CPU utilization, and the pipeline having sufficiently low backlog and keeping up with input rate.
INFO:apache_beam.runners.dataflow.dataflow_runner:2020-08-20T07:06:44.243Z: JOB_MESSAGE_BASIC: Worker pool stopped.
INFO:apache_beam.runners.dataflow.dataflow_runner:2020-08-20T07:06:44.280Z: JOB_MESSAGE_DEBUG: Tearing down pending resources...
INFO:apache_beam.runners.dataflow.dataflow_runner:Job 2020-08-19_23_58_46-15596488558403565241 is in state JOB_STATE_DONE
test_element_param (apache_beam.pipeline_test.DoFnTest) ... ok
test_key_param (apache_beam.pipeline_test.DoFnTest) ... ok

----------------------------------------------------------------------
XML: nosetests-validatesRunnerStreamingTests-df-py27.xml
----------------------------------------------------------------------
XML: <https://ci-beam.apache.org/job/beam_PostCommit_Py_VR_Dataflow_V2/ws/src/sdks/python/nosetests.xml>
----------------------------------------------------------------------
Ran 27 tests in 2125.429s

OK
Worker logs: https://console.cloud.google.com/dataflow/jobs/us-central1/2020-08-19_23_32_12-17733930080101348319?project=apache-beam-testing
Worker logs: https://console.cloud.google.com/dataflow/jobs/us-central1/2020-08-19_23_41_43-13245411559063849896?project=apache-beam-testing
Worker logs: https://console.cloud.google.com/dataflow/jobs/us-central1/2020-08-19_23_50_25-12656648823609096610?project=apache-beam-testing
Worker logs: https://console.cloud.google.com/dataflow/jobs/us-central1/2020-08-19_23_58_46-15596488558403565241?project=apache-beam-testing
Worker logs: https://console.cloud.google.com/dataflow/jobs/us-central1/2020-08-19_23_32_11-6534401239402501298?project=apache-beam-testing
Worker logs: https://console.cloud.google.com/dataflow/jobs/us-central1/2020-08-19_23_41_38-8974457976935525955?project=apache-beam-testing
Worker logs: https://console.cloud.google.com/dataflow/jobs/us-central1/2020-08-19_23_50_01-8039956093927816740?project=apache-beam-testing
Worker logs: https://console.cloud.google.com/dataflow/jobs/us-central1/2020-08-19_23_32_11-13337571586418702070?project=apache-beam-testing
Worker logs: https://console.cloud.google.com/dataflow/jobs/us-central1/2020-08-19_23_39_59-7499299792769069508?project=apache-beam-testing
Worker logs: https://console.cloud.google.com/dataflow/jobs/us-central1/2020-08-19_23_48_29-11334947856433447446?project=apache-beam-testing
Worker logs: https://console.cloud.google.com/dataflow/jobs/us-central1/2020-08-19_23_32_11-8808044732619512111?project=apache-beam-testing
Worker logs: https://console.cloud.google.com/dataflow/jobs/us-central1/2020-08-19_23_41_43-9954240216584168002?project=apache-beam-testing
Worker logs: https://console.cloud.google.com/dataflow/jobs/us-central1/2020-08-19_23_50_21-951895870878253785?project=apache-beam-testing
Worker logs: https://console.cloud.google.com/dataflow/jobs/us-central1/2020-08-19_23_32_11-11864052238972520844?project=apache-beam-testing
Worker logs: https://console.cloud.google.com/dataflow/jobs/us-central1/2020-08-19_23_40_39-349365484935373852?project=apache-beam-testing
Worker logs: https://console.cloud.google.com/dataflow/jobs/us-central1/2020-08-19_23_49_06-7465265339785891598?project=apache-beam-testing
Worker logs: https://console.cloud.google.com/dataflow/jobs/us-central1/2020-08-19_23_32_09-14847116136266641040?project=apache-beam-testing
Worker logs: https://console.cloud.google.com/dataflow/jobs/us-central1/2020-08-19_23_42_35-11698732663710896537?project=apache-beam-testing
Worker logs: https://console.cloud.google.com/dataflow/jobs/us-central1/2020-08-19_23_32_11-12389262459890698755?project=apache-beam-testing
Worker logs: https://console.cloud.google.com/dataflow/jobs/us-central1/2020-08-19_23_41_10-749615318612572309?project=apache-beam-testing
Worker logs: https://console.cloud.google.com/dataflow/jobs/us-central1/2020-08-19_23_49_51-8131547149331167704?project=apache-beam-testing
Worker logs: https://console.cloud.google.com/dataflow/jobs/us-central1/2020-08-19_23_32_10-17262551755532121320?project=apache-beam-testing
Worker logs: https://console.cloud.google.com/dataflow/jobs/us-central1/2020-08-19_23_40_39-15170695703885848077?project=apache-beam-testing
Worker logs: https://console.cloud.google.com/dataflow/jobs/us-central1/2020-08-19_23_50_07-18433188794951315647?project=apache-beam-testing

FAILURE: Build failed with an exception.

* Where:
Script '<https://ci-beam.apache.org/job/beam_PostCommit_Py_VR_Dataflow_V2/ws/src/sdks/python/test-suites/dataflow/common.gradle'> line: 146

* What went wrong:
Execution failed for task ':sdks:python:test-suites:dataflow:py2:validatesRunnerBatchTests'.
> Process 'command 'sh'' finished with non-zero exit value 1

* Try:
Run with --stacktrace option to get the stack trace. Run with --info or --debug option to get more log output. Run with --scan to get full insights.

* Get more help at https://help.gradle.org

Deprecated Gradle features were used in this build, making it incompatible with Gradle 6.0.
Use '--warning-mode all' to show the individual deprecation warnings.
See https://docs.gradle.org/5.2.1/userguide/command_line_interface.html#sec:command_line_warnings

BUILD FAILED in 1h 6m 32s
65 actionable tasks: 47 executed, 18 from cache

Publishing build scan...
https://gradle.com/s/no4mbsfla3uy6

Build step 'Invoke Gradle script' changed build result to FAILURE
Build step 'Invoke Gradle script' marked build as failure

---------------------------------------------------------------------
To unsubscribe, e-mail: builds-unsubscribe@beam.apache.org
For additional commands, e-mail: builds-help@beam.apache.org


Build failed in Jenkins: beam_PostCommit_Py_VR_Dataflow_V2 #943

Posted by Apache Jenkins Server <je...@builds.apache.org>.
See <https://ci-beam.apache.org/job/beam_PostCommit_Py_VR_Dataflow_V2/943/display/redirect?page=changes>

Changes:

[chamikaramj] Include coders embedded in CombinePayload when converting x-lang

[kevinsijo] [BEAM-9919] Refining xlang types and wrappers

[Luke Cwik] [BEAM-9979] Support a reset call that happens after the bundle is done

[noreply] [BEAM-10200] Add optional experiment to enable heap dump through the …

[kevinsijo] [BEAM-9919] xlang transforms wrapped with namespaces

[kevinsijo] [BEAM-9919] cleaning namespace.go


------------------------------------------
[...truncated 6.18 MB...]
                      "pipeline_proto_coder_id": "ref_Coder_FastPrimitivesCoder_4"
                    }
                  ], 
                  "is_pair_like": true, 
                  "pipeline_proto_coder_id": "ref_Coder_FastPrimitivesCoder_4"
                }, 
                {
                  "@type": "kind:global_window"
                }
              ], 
              "is_wrapper": true
            }, 
            "output_name": "None", 
            "user_name": "assert_that/Group/Map(_merge_tagged_vals_under_key).out"
          }
        ], 
        "parallel_input": {
          "@type": "OutputReference", 
          "output_name": "out", 
          "step_name": "s18"
        }, 
        "serialized_fn": "ref_AppliedPTransform_assert_that/Group/Map(_merge_tagged_vals_under_key)_28", 
        "user_name": "assert_that/Group/Map(_merge_tagged_vals_under_key)"
      }
    }, 
    {
      "kind": "ParallelDo", 
      "name": "s20", 
      "properties": {
        "display_data": [
          {
            "key": "fn", 
            "label": "Transform Function", 
            "namespace": "apache_beam.transforms.core.CallableWrapperDoFn", 
            "type": "STRING", 
            "value": "<lambda>"
          }, 
          {
            "key": "fn", 
            "label": "Transform Function", 
            "namespace": "apache_beam.transforms.core.ParDo", 
            "shortValue": "CallableWrapperDoFn", 
            "type": "STRING", 
            "value": "apache_beam.transforms.core.CallableWrapperDoFn"
          }
        ], 
        "non_parallel_inputs": {}, 
        "output_info": [
          {
            "encoding": {
              "@type": "kind:windowed_value", 
              "component_encodings": [
                {
                  "@type": "FastPrimitivesCoder$<string of 176 bytes>", 
                  "component_encodings": [
                    {
                      "@type": "FastPrimitivesCoder$<string of 176 bytes>", 
                      "component_encodings": [], 
                      "pipeline_proto_coder_id": "ref_Coder_FastPrimitivesCoder_4"
                    }, 
                    {
                      "@type": "FastPrimitivesCoder$<string of 176 bytes>", 
                      "component_encodings": [], 
                      "pipeline_proto_coder_id": "ref_Coder_FastPrimitivesCoder_4"
                    }
                  ], 
                  "is_pair_like": true, 
                  "pipeline_proto_coder_id": "ref_Coder_FastPrimitivesCoder_4"
                }, 
                {
                  "@type": "kind:global_window"
                }
              ], 
              "is_wrapper": true
            }, 
            "output_name": "None", 
            "user_name": "assert_that/Unkey.out"
          }
        ], 
        "parallel_input": {
          "@type": "OutputReference", 
          "output_name": "None", 
          "step_name": "s19"
        }, 
        "serialized_fn": "ref_AppliedPTransform_assert_that/Unkey_29", 
        "user_name": "assert_that/Unkey"
      }
    }, 
    {
      "kind": "ParallelDo", 
      "name": "s21", 
      "properties": {
        "display_data": [
          {
            "key": "fn", 
            "label": "Transform Function", 
            "namespace": "apache_beam.transforms.core.CallableWrapperDoFn", 
            "type": "STRING", 
            "value": "_equal"
          }, 
          {
            "key": "fn", 
            "label": "Transform Function", 
            "namespace": "apache_beam.transforms.core.ParDo", 
            "shortValue": "CallableWrapperDoFn", 
            "type": "STRING", 
            "value": "apache_beam.transforms.core.CallableWrapperDoFn"
          }
        ], 
        "non_parallel_inputs": {}, 
        "output_info": [
          {
            "encoding": {
              "@type": "kind:windowed_value", 
              "component_encodings": [
                {
                  "@type": "FastPrimitivesCoder$<string of 176 bytes>", 
                  "component_encodings": [
                    {
                      "@type": "FastPrimitivesCoder$<string of 176 bytes>", 
                      "component_encodings": [], 
                      "pipeline_proto_coder_id": "ref_Coder_FastPrimitivesCoder_4"
                    }, 
                    {
                      "@type": "FastPrimitivesCoder$<string of 176 bytes>", 
                      "component_encodings": [], 
                      "pipeline_proto_coder_id": "ref_Coder_FastPrimitivesCoder_4"
                    }
                  ], 
                  "is_pair_like": true, 
                  "pipeline_proto_coder_id": "ref_Coder_FastPrimitivesCoder_4"
                }, 
                {
                  "@type": "kind:global_window"
                }
              ], 
              "is_wrapper": true
            }, 
            "output_name": "None", 
            "user_name": "assert_that/Match.out"
          }
        ], 
        "parallel_input": {
          "@type": "OutputReference", 
          "output_name": "None", 
          "step_name": "s20"
        }, 
        "serialized_fn": "ref_AppliedPTransform_assert_that/Match_30", 
        "user_name": "assert_that/Match"
      }
    }
  ], 
  "type": "JOB_TYPE_STREAMING"
}
apache_beam.runners.dataflow.internal.apiclient: INFO: Create job: <Job
 createTime: u'2020-08-20T00:46:14.530443Z'
 currentStateTime: u'1970-01-01T00:00:00Z'
 id: u'2020-08-19_17_46_13-5463213511170260284'
 location: u'us-central1'
 name: u'beamapp-jenkins-0820004604-991939'
 projectId: u'apache-beam-testing'
 stageStates: []
 startTime: u'2020-08-20T00:46:14.530443Z'
 steps: []
 tempFiles: []
 type: TypeValueValuesEnum(JOB_TYPE_STREAMING, 2)>
apache_beam.runners.dataflow.internal.apiclient: INFO: Created job with id: [2020-08-19_17_46_13-5463213511170260284]
apache_beam.runners.dataflow.internal.apiclient: INFO: Submitted job: 2020-08-19_17_46_13-5463213511170260284
apache_beam.runners.dataflow.internal.apiclient: INFO: To access the Dataflow monitoring console, please navigate to https://console.cloud.google.com/dataflow/jobs/us-central1/2020-08-19_17_46_13-5463213511170260284?project=apache-beam-testing
apache_beam.runners.dataflow.test_dataflow_runner: WARNING: Waiting indefinitely for streaming job.
--------------------- >> end captured logging << ---------------------

----------------------------------------------------------------------
XML: nosetests-validatesRunnerStreamingTests-df-py27.xml
----------------------------------------------------------------------
XML: <https://ci-beam.apache.org/job/beam_PostCommit_Py_VR_Dataflow_V2/ws/src/sdks/python/nosetests.xml>
----------------------------------------------------------------------
Ran 27 tests in 1709.260s

FAILED (failures=3)
Worker logs: https://console.cloud.google.com/dataflow/jobs/us-central1/2020-08-19_17_29_02-6431729789135399222?project=apache-beam-testing
Worker logs: https://console.cloud.google.com/dataflow/jobs/us-central1/2020-08-19_17_37_30-17125198294963333443?project=apache-beam-testing
Worker logs: https://console.cloud.google.com/dataflow/jobs/us-central1/2020-08-19_17_45_02-10000869801060284618?project=apache-beam-testing
Worker logs: https://console.cloud.google.com/dataflow/jobs/us-central1/2020-08-19_17_29_01-1351030185712572479?project=apache-beam-testing
Worker logs: https://console.cloud.google.com/dataflow/jobs/us-central1/2020-08-19_17_37_38-17696754859556333238?project=apache-beam-testing
Worker logs: https://console.cloud.google.com/dataflow/jobs/us-central1/2020-08-19_17_46_13-5463213511170260284?project=apache-beam-testing
Worker logs: https://console.cloud.google.com/dataflow/jobs/us-central1/2020-08-19_17_46_44-3434017023226491915?project=apache-beam-testing
Worker logs: https://console.cloud.google.com/dataflow/jobs/us-central1/2020-08-19_17_29_03-17273394236158666750?project=apache-beam-testing
Worker logs: https://console.cloud.google.com/dataflow/jobs/us-central1/2020-08-19_17_37_31-2847190279203028432?project=apache-beam-testing
Worker logs: https://console.cloud.google.com/dataflow/jobs/us-central1/2020-08-19_17_46_00-13679587470990726546?project=apache-beam-testing
Worker logs: https://console.cloud.google.com/dataflow/jobs/us-central1/2020-08-19_17_29_03-1586135489285355393?project=apache-beam-testing
Worker logs: https://console.cloud.google.com/dataflow/jobs/us-central1/2020-08-19_17_37_45-415098833044994987?project=apache-beam-testing
Worker logs: https://console.cloud.google.com/dataflow/jobs/us-central1/2020-08-19_17_29_04-312296602623370152?project=apache-beam-testing
Worker logs: https://console.cloud.google.com/dataflow/jobs/us-central1/2020-08-19_17_36_07-17082563805832859683?project=apache-beam-testing
Worker logs: https://console.cloud.google.com/dataflow/jobs/us-central1/2020-08-19_17_44_38-6088636578480942619?project=apache-beam-testing
Worker logs: https://console.cloud.google.com/dataflow/jobs/us-central1/2020-08-19_17_29_03-3042909111730823394?project=apache-beam-testing
Worker logs: https://console.cloud.google.com/dataflow/jobs/us-central1/2020-08-19_17_37_42-6159332862467876571?project=apache-beam-testing
Worker logs: https://console.cloud.google.com/dataflow/jobs/us-central1/2020-08-19_17_46_14-5875483635145503353?project=apache-beam-testing
Worker logs: https://console.cloud.google.com/dataflow/jobs/us-central1/2020-08-19_17_29_03-11128493118794081128?project=apache-beam-testing
Worker logs: https://console.cloud.google.com/dataflow/jobs/us-central1/2020-08-19_17_36_32-16450097531388263063?project=apache-beam-testing
Worker logs: https://console.cloud.google.com/dataflow/jobs/us-central1/2020-08-19_17_45_04-1022136640796127718?project=apache-beam-testing
Worker logs: https://console.cloud.google.com/dataflow/jobs/us-central1/2020-08-19_17_29_01-15293588963443292738?project=apache-beam-testing
Worker logs: https://console.cloud.google.com/dataflow/jobs/us-central1/2020-08-19_17_37_30-9691505037554855351?project=apache-beam-testing
Worker logs: https://console.cloud.google.com/dataflow/jobs/us-central1/2020-08-19_17_45_54-8316620724949992116?project=apache-beam-testing

> Task :sdks:python:test-suites:dataflow:py2:validatesRunnerStreamingTests FAILED

FAILURE: Build completed with 2 failures.

1: Task failed with an exception.
-----------
* Where:
Script '<https://ci-beam.apache.org/job/beam_PostCommit_Py_VR_Dataflow_V2/ws/src/sdks/python/test-suites/dataflow/common.gradle'> line: 146

* What went wrong:
Execution failed for task ':sdks:python:test-suites:dataflow:py2:validatesRunnerBatchTests'.
> Process 'command 'sh'' finished with non-zero exit value 1

* Try:
Run with --stacktrace option to get the stack trace. Run with --info or --debug option to get more log output. Run with --scan to get full insights.
==============================================================================

2: Task failed with an exception.
-----------
* Where:
Script '<https://ci-beam.apache.org/job/beam_PostCommit_Py_VR_Dataflow_V2/ws/src/sdks/python/test-suites/dataflow/common.gradle'> line: 175

* What went wrong:
Execution failed for task ':sdks:python:test-suites:dataflow:py2:validatesRunnerStreamingTests'.
> Process 'command 'sh'' finished with non-zero exit value 1

* Try:
Run with --stacktrace option to get the stack trace. Run with --info or --debug option to get more log output. Run with --scan to get full insights.
==============================================================================

* Get more help at https://help.gradle.org

Deprecated Gradle features were used in this build, making it incompatible with Gradle 6.0.
Use '--warning-mode all' to show the individual deprecation warnings.
See https://docs.gradle.org/5.2.1/userguide/command_line_interface.html#sec:command_line_warnings

BUILD FAILED in 55m 42s
65 actionable tasks: 47 executed, 18 from cache

Publishing build scan...
https://gradle.com/s/o5ba4nimpsfkc

Build step 'Invoke Gradle script' changed build result to FAILURE
Build step 'Invoke Gradle script' marked build as failure

---------------------------------------------------------------------
To unsubscribe, e-mail: builds-unsubscribe@beam.apache.org
For additional commands, e-mail: builds-help@beam.apache.org


Build failed in Jenkins: beam_PostCommit_Py_VR_Dataflow_V2 #942

Posted by Apache Jenkins Server <je...@builds.apache.org>.
See <https://ci-beam.apache.org/job/beam_PostCommit_Py_VR_Dataflow_V2/942/display/redirect?page=changes>

Changes:

[zyichi] Allow Nexmark launcher to publish human-readable events to pubsub.

[irvi.fa] [BEAM-10753] Add Slack link invitation on README

[Luke Cwik] [BEAM-10756] Fix empty pull response to not ack and to not throw

[noreply] Merge pull request #12597: [BEAM-10685] Added integration test for

[ettarapp] clarifying unclear comments

[noreply] Update README.md

[noreply] [BEAM-3301] Adding SDF Go Dataflow translation. (#12629)

[noreply] [BEAM-10752] Use TestPubsubSignal in PubsubToBigqueryIT (#12625)


------------------------------------------
[...truncated 5.27 MB...]
                  "is_pair_like": true, 
                  "pipeline_proto_coder_id": "ref_Coder_FastPrimitivesCoder_4"
                }, 
                {
                  "@type": "kind:global_window"
                }
              ], 
              "is_wrapper": true
            }, 
            "output_name": "None", 
            "user_name": "assert_that/Match.out"
          }
        ], 
        "parallel_input": {
          "@type": "OutputReference", 
          "output_name": "None", 
          "step_name": "s20"
        }, 
        "serialized_fn": "ref_AppliedPTransform_assert_that/Match_30", 
        "user_name": "assert_that/Match"
      }
    }
  ], 
  "type": "JOB_TYPE_STREAMING"
}
INFO:apache_beam.runners.dataflow.internal.apiclient:Create job: <Job
 createTime: u'2020-08-19T18:59:48.351369Z'
 currentStateTime: u'1970-01-01T00:00:00Z'
 id: u'2020-08-19_11_59_47-2065660926116299971'
 location: u'us-central1'
 name: u'beamapp-jenkins-0819185938-071243'
 projectId: u'apache-beam-testing'
 stageStates: []
 startTime: u'2020-08-19T18:59:48.351369Z'
 steps: []
 tempFiles: []
 type: TypeValueValuesEnum(JOB_TYPE_STREAMING, 2)>
INFO:apache_beam.runners.dataflow.internal.apiclient:Created job with id: [2020-08-19_11_59_47-2065660926116299971]
INFO:apache_beam.runners.dataflow.internal.apiclient:Submitted job: 2020-08-19_11_59_47-2065660926116299971
INFO:apache_beam.runners.dataflow.internal.apiclient:To access the Dataflow monitoring console, please navigate to https://console.cloud.google.com/dataflow/jobs/us-central1/2020-08-19_11_59_47-2065660926116299971?project=apache-beam-testing
WARNING:apache_beam.runners.dataflow.test_dataflow_runner:Waiting indefinitely for streaming job.
INFO:apache_beam.runners.dataflow.dataflow_runner:Job 2020-08-19_11_59_47-2065660926116299971 is in state JOB_STATE_RUNNING
INFO:apache_beam.runners.dataflow.dataflow_runner:2020-08-19T18:59:47.347Z: JOB_MESSAGE_DETAILED: Autoscaling was automatically enabled for job 2020-08-19_11_59_47-2065660926116299971.
INFO:apache_beam.runners.dataflow.dataflow_runner:2020-08-19T18:59:47.347Z: JOB_MESSAGE_DETAILED: Autoscaling is enabled for job 2020-08-19_11_59_47-2065660926116299971. The number of workers will be between 1 and 100.
INFO:apache_beam.runners.dataflow.dataflow_runner:2020-08-19T18:59:47.347Z: JOB_MESSAGE_WARNING: Autoscaling is enabled for Dataflow Streaming Engine. Workers will scale between 1 and 100 unless maxNumWorkers is specified.
INFO:apache_beam.runners.dataflow.dataflow_runner:2020-08-19T18:59:52.876Z: JOB_MESSAGE_BASIC: Worker configuration: n1-standard-2 in us-central1-b.
INFO:apache_beam.runners.dataflow.dataflow_runner:2020-08-19T18:59:53.652Z: JOB_MESSAGE_DETAILED: Expanding SplittableParDo operations into optimizable parts.
INFO:apache_beam.runners.dataflow.dataflow_runner:2020-08-19T18:59:53.715Z: JOB_MESSAGE_DETAILED: Expanding CollectionToSingleton operations into optimizable parts.
INFO:apache_beam.runners.dataflow.dataflow_runner:2020-08-19T18:59:53.933Z: JOB_MESSAGE_DETAILED: Expanding CoGroupByKey operations into optimizable parts.
INFO:apache_beam.runners.dataflow.dataflow_runner:2020-08-19T18:59:53.980Z: JOB_MESSAGE_DEBUG: Combiner lifting skipped for step assert_that/Group/GroupByKey: GroupByKey not followed by a combiner.
INFO:apache_beam.runners.dataflow.dataflow_runner:2020-08-19T18:59:54.008Z: JOB_MESSAGE_DEBUG: Combiner lifting skipped for step Create/MaybeReshuffle/Reshuffle/ReshufflePerKey/GroupByKey: GroupByKey not followed by a combiner.
INFO:apache_beam.runners.dataflow.dataflow_runner:2020-08-19T18:59:54.044Z: JOB_MESSAGE_DETAILED: Expanding SplittableProcessKeyed operations into optimizable parts.
INFO:apache_beam.runners.dataflow.dataflow_runner:2020-08-19T18:59:54.088Z: JOB_MESSAGE_DETAILED: Expanding GroupByKey operations into streaming Read/Write steps
INFO:apache_beam.runners.dataflow.dataflow_runner:2020-08-19T18:59:54.179Z: JOB_MESSAGE_DETAILED: Lifting ValueCombiningMappingFns into MergeBucketsMappingFns
INFO:apache_beam.runners.dataflow.dataflow_runner:2020-08-19T18:59:54.287Z: JOB_MESSAGE_DEBUG: Annotating graph with Autotuner information.
INFO:apache_beam.runners.dataflow.dataflow_runner:2020-08-19T18:59:54.352Z: JOB_MESSAGE_DETAILED: Fusing adjacent ParDo, Read, Write, and Flatten operations
INFO:apache_beam.runners.dataflow.dataflow_runner:2020-08-19T18:59:54.394Z: JOB_MESSAGE_DETAILED: Unzipping flatten s17 for input s15.None
INFO:apache_beam.runners.dataflow.dataflow_runner:2020-08-19T18:59:54.417Z: JOB_MESSAGE_DETAILED: Fusing unzipped copy of assert_that/Group/GroupByKey/WriteStream, through flatten assert_that/Group/Flatten, into producer assert_that/Group/pair_with_0
INFO:apache_beam.runners.dataflow.dataflow_runner:2020-08-19T18:59:54.450Z: JOB_MESSAGE_DETAILED: Fusing consumer assert_that/Group/GroupByKey/WriteStream into assert_that/Group/pair_with_1
INFO:apache_beam.runners.dataflow.dataflow_runner:2020-08-19T18:59:54.486Z: JOB_MESSAGE_DETAILED: Fusing consumer Create/MaybeReshuffle/Reshuffle/ReshufflePerKey/GroupByKey/MergeBuckets into Create/MaybeReshuffle/Reshuffle/ReshufflePerKey/GroupByKey/ReadStream
INFO:apache_beam.runners.dataflow.dataflow_runner:2020-08-19T18:59:54.523Z: JOB_MESSAGE_DETAILED: Fusing consumer Create/MaybeReshuffle/Reshuffle/ReshufflePerKey/FlatMap(restore_timestamps) into Create/MaybeReshuffle/Reshuffle/ReshufflePerKey/GroupByKey/MergeBuckets
INFO:apache_beam.runners.dataflow.dataflow_runner:2020-08-19T18:59:54.573Z: JOB_MESSAGE_DETAILED: Fusing consumer Create/MaybeReshuffle/Reshuffle/RemoveRandomKeys into Create/MaybeReshuffle/Reshuffle/ReshufflePerKey/FlatMap(restore_timestamps)
INFO:apache_beam.runners.dataflow.dataflow_runner:2020-08-19T18:59:54.601Z: JOB_MESSAGE_DETAILED: Fusing consumer Create/Map(decode) into Create/MaybeReshuffle/Reshuffle/RemoveRandomKeys
INFO:apache_beam.runners.dataflow.dataflow_runner:2020-08-19T18:59:54.630Z: JOB_MESSAGE_DETAILED: Fusing consumer Key param into Create/Map(decode)
INFO:apache_beam.runners.dataflow.dataflow_runner:2020-08-19T18:59:54.661Z: JOB_MESSAGE_DETAILED: Fusing consumer assert_that/WindowInto(WindowIntoFn) into Key param
INFO:apache_beam.runners.dataflow.dataflow_runner:2020-08-19T18:59:54.684Z: JOB_MESSAGE_DETAILED: Fusing consumer assert_that/ToVoidKey into assert_that/WindowInto(WindowIntoFn)
INFO:apache_beam.runners.dataflow.dataflow_runner:2020-08-19T18:59:54.711Z: JOB_MESSAGE_DETAILED: Fusing consumer assert_that/Group/pair_with_1 into assert_that/ToVoidKey
INFO:apache_beam.runners.dataflow.dataflow_runner:2020-08-19T18:59:54.749Z: JOB_MESSAGE_DETAILED: Fusing consumer assert_that/Group/GroupByKey/MergeBuckets into assert_that/Group/GroupByKey/ReadStream
INFO:apache_beam.runners.dataflow.dataflow_runner:2020-08-19T18:59:54.784Z: JOB_MESSAGE_DETAILED: Fusing consumer assert_that/Group/Map(_merge_tagged_vals_under_key) into assert_that/Group/GroupByKey/MergeBuckets
INFO:apache_beam.runners.dataflow.dataflow_runner:2020-08-19T18:59:54.816Z: JOB_MESSAGE_DETAILED: Fusing consumer assert_that/Unkey into assert_that/Group/Map(_merge_tagged_vals_under_key)
INFO:apache_beam.runners.dataflow.dataflow_runner:2020-08-19T18:59:54.851Z: JOB_MESSAGE_DETAILED: Fusing consumer assert_that/Match into assert_that/Unkey
INFO:apache_beam.runners.dataflow.dataflow_runner:2020-08-19T18:59:54.876Z: JOB_MESSAGE_DETAILED: Fusing consumer Create/FlatMap(<lambda at core.py:2826>) into Create/Impulse
INFO:apache_beam.runners.dataflow.dataflow_runner:2020-08-19T18:59:54.913Z: JOB_MESSAGE_DETAILED: Fusing consumer assert_that/Create/FlatMap(<lambda at core.py:2826>) into assert_that/Create/Impulse
INFO:apache_beam.runners.dataflow.dataflow_runner:2020-08-19T18:59:54.935Z: JOB_MESSAGE_DETAILED: Fusing consumer assert_that/Create/Map(decode) into assert_that/Create/FlatMap(<lambda at core.py:2826>)
INFO:apache_beam.runners.dataflow.dataflow_runner:2020-08-19T18:59:54.965Z: JOB_MESSAGE_DETAILED: Fusing consumer assert_that/Group/pair_with_0 into assert_that/Create/Map(decode)
INFO:apache_beam.runners.dataflow.dataflow_runner:2020-08-19T18:59:54.990Z: JOB_MESSAGE_DETAILED: Fusing consumer Create/MaybeReshuffle/Reshuffle/AddRandomKeys into Create/FlatMap(<lambda at core.py:2826>)
INFO:apache_beam.runners.dataflow.dataflow_runner:2020-08-19T18:59:55.026Z: JOB_MESSAGE_DETAILED: Fusing consumer Create/MaybeReshuffle/Reshuffle/ReshufflePerKey/Map(reify_timestamps) into Create/MaybeReshuffle/Reshuffle/AddRandomKeys
INFO:apache_beam.runners.dataflow.dataflow_runner:2020-08-19T18:59:55.058Z: JOB_MESSAGE_DETAILED: Fusing consumer Create/MaybeReshuffle/Reshuffle/ReshufflePerKey/GroupByKey/WriteStream into Create/MaybeReshuffle/Reshuffle/ReshufflePerKey/Map(reify_timestamps)
INFO:apache_beam.runners.dataflow.dataflow_runner:2020-08-19T18:59:55.119Z: JOB_MESSAGE_DEBUG: Workflow config is missing a default resource spec.
INFO:apache_beam.runners.dataflow.dataflow_runner:2020-08-19T18:59:55.184Z: JOB_MESSAGE_DEBUG: Adding StepResource setup and teardown to workflow graph.
INFO:apache_beam.runners.dataflow.dataflow_runner:2020-08-19T18:59:55.243Z: JOB_MESSAGE_DEBUG: Adding workflow start and stop steps.
INFO:apache_beam.runners.dataflow.dataflow_runner:2020-08-19T18:59:55.303Z: JOB_MESSAGE_DEBUG: Assigning stage ids.
INFO:apache_beam.runners.dataflow.dataflow_runner:2020-08-19T18:59:57.873Z: JOB_MESSAGE_DEBUG: Starting worker pool setup.
INFO:apache_beam.runners.dataflow.dataflow_runner:2020-08-19T18:59:57.928Z: JOB_MESSAGE_DEBUG: Starting worker pool setup.
INFO:apache_beam.runners.dataflow.dataflow_runner:2020-08-19T18:59:57.966Z: JOB_MESSAGE_BASIC: Starting 1 workers in us-central1-b...
INFO:apache_beam.runners.dataflow.dataflow_runner:2020-08-19T19:00:22.919Z: JOB_MESSAGE_DETAILED: Autoscaling: Raised the number of workers to 1 so that the pipeline can catch up with its backlog and keep up with its input rate.
INFO:apache_beam.runners.dataflow.dataflow_runner:2020-08-19T19:00:24.553Z: JOB_MESSAGE_WARNING: Your project already contains 100 Dataflow-created metric descriptors and Stackdriver will not create new Dataflow custom metrics for this job. Each unique user-defined metric name (independent of the DoFn in which it is defined) produces a new metric descriptor. To delete old / unused metric descriptors see https://developers.google.com/apis-explorer/#p/monitoring/v3/monitoring.projects.metricDescriptors.list and https://developers.google.com/apis-explorer/#p/monitoring/v3/monitoring.projects.metricDescriptors.delete
INFO:apache_beam.runners.dataflow.dataflow_runner:2020-08-19T19:01:01.590Z: JOB_MESSAGE_DETAILED: Workers have started successfully.
INFO:apache_beam.runners.dataflow.dataflow_runner:2020-08-19T19:01:01.625Z: JOB_MESSAGE_DETAILED: Workers have started successfully.
INFO:apache_beam.runners.dataflow.dataflow_runner:2020-08-19T19:07:02.063Z: JOB_MESSAGE_DETAILED: Cleaning up.
INFO:apache_beam.runners.dataflow.dataflow_runner:2020-08-19T19:07:02.125Z: JOB_MESSAGE_DEBUG: Starting worker pool teardown.
INFO:apache_beam.runners.dataflow.dataflow_runner:2020-08-19T19:07:02.166Z: JOB_MESSAGE_BASIC: Stopping worker pool...
INFO:apache_beam.runners.dataflow.dataflow_runner:2020-08-19T19:07:02.221Z: JOB_MESSAGE_DEBUG: Starting worker pool teardown.
INFO:apache_beam.runners.dataflow.dataflow_runner:2020-08-19T19:07:02.255Z: JOB_MESSAGE_BASIC: Stopping worker pool...
INFO:apache_beam.runners.dataflow.dataflow_runner:2020-08-19T19:07:56.067Z: JOB_MESSAGE_DETAILED: Autoscaling: Reduced the number of workers to 0 based on low average worker CPU utilization, and the pipeline having sufficiently low backlog and keeping up with input rate.
INFO:apache_beam.runners.dataflow.dataflow_runner:2020-08-19T19:07:56.112Z: JOB_MESSAGE_BASIC: Worker pool stopped.
INFO:apache_beam.runners.dataflow.dataflow_runner:2020-08-19T19:07:56.146Z: JOB_MESSAGE_DEBUG: Tearing down pending resources...
INFO:apache_beam.runners.dataflow.dataflow_runner:Job 2020-08-19_11_59_47-2065660926116299971 is in state JOB_STATE_DONE
test_element_param (apache_beam.pipeline_test.DoFnTest) ... ok
test_key_param (apache_beam.pipeline_test.DoFnTest) ... ok
INFO:apache_beam.runners.dataflow.dataflow_runner:2020-08-19T19:13:33.317Z: JOB_MESSAGE_DETAILED: Cleaning up.
INFO:apache_beam.runners.dataflow.dataflow_runner:2020-08-19T19:13:33.416Z: JOB_MESSAGE_DEBUG: Starting worker pool teardown.
INFO:apache_beam.runners.dataflow.dataflow_runner:2020-08-19T19:13:33.470Z: JOB_MESSAGE_BASIC: Stopping worker pool...
INFO:apache_beam.runners.dataflow.dataflow_runner:2020-08-19T19:13:33.525Z: JOB_MESSAGE_DEBUG: Starting worker pool teardown.
INFO:apache_beam.runners.dataflow.dataflow_runner:2020-08-19T19:13:33.558Z: JOB_MESSAGE_BASIC: Stopping worker pool...
INFO:apache_beam.runners.dataflow.dataflow_runner:2020-08-19T19:14:15.329Z: JOB_MESSAGE_DETAILED: Autoscaling: Reduced the number of workers to 0 based on low average worker CPU utilization, and the pipeline having sufficiently low backlog and keeping up with input rate.
INFO:apache_beam.runners.dataflow.dataflow_runner:2020-08-19T19:14:15.394Z: JOB_MESSAGE_BASIC: Worker pool stopped.
INFO:apache_beam.runners.dataflow.dataflow_runner:2020-08-19T19:14:15.484Z: JOB_MESSAGE_DEBUG: Tearing down pending resources...
INFO:apache_beam.runners.dataflow.dataflow_runner:Job 2020-08-19_11_51_16-4637314372768157291 is in state JOB_STATE_DONE
test_reshuffle_preserves_timestamps (apache_beam.transforms.util_test.ReshuffleTest) ... ok

======================================================================
ERROR: test_iterable_side_input (apache_beam.transforms.sideinputs_test.SideInputsTest)
----------------------------------------------------------------------
Traceback (most recent call last):
  File "<https://ci-beam.apache.org/job/beam_PostCommit_Py_VR_Dataflow_V2/ws/src/sdks/python/apache_beam/transforms/sideinputs_test.py",> line 196, in test_iterable_side_input
    pipeline.run()
  File "<https://ci-beam.apache.org/job/beam_PostCommit_Py_VR_Dataflow_V2/ws/src/sdks/python/apache_beam/testing/test_pipeline.py",> line 112, in run
    False if self.not_use_test_runner_api else test_runner_api))
  File "<https://ci-beam.apache.org/job/beam_PostCommit_Py_VR_Dataflow_V2/ws/src/sdks/python/apache_beam/pipeline.py",> line 521, in run
    allow_proto_holders=True).run(False)
  File "<https://ci-beam.apache.org/job/beam_PostCommit_Py_VR_Dataflow_V2/ws/src/sdks/python/apache_beam/pipeline.py",> line 534, in run
    return self.runner.run_pipeline(self, self._options)
  File "<https://ci-beam.apache.org/job/beam_PostCommit_Py_VR_Dataflow_V2/ws/src/sdks/python/apache_beam/runners/dataflow/test_dataflow_runner.py",> line 57, in run_pipeline
    self).run_pipeline(pipeline, options)
  File "<https://ci-beam.apache.org/job/beam_PostCommit_Py_VR_Dataflow_V2/ws/src/sdks/python/apache_beam/runners/dataflow/dataflow_runner.py",> line 479, in run_pipeline
    artifacts=environments.python_sdk_dependencies(options)))
  File "<https://ci-beam.apache.org/job/beam_PostCommit_Py_VR_Dataflow_V2/ws/src/sdks/python/apache_beam/transforms/environments.py",> line 613, in python_sdk_dependencies
    staged_name in stager.Stager.create_job_resources(options, tmp_dir))
  File "<https://ci-beam.apache.org/job/beam_PostCommit_Py_VR_Dataflow_V2/ws/src/sdks/python/apache_beam/runners/portability/stager.py",> line 172, in create_job_resources
    setup_options.requirements_file, requirements_cache_path)
  File "<https://ci-beam.apache.org/job/beam_PostCommit_Py_VR_Dataflow_V2/ws/src/sdks/python/apache_beam/utils/retry.py",> line 236, in wrapper
    return fun(*args, **kwargs)
  File "<https://ci-beam.apache.org/job/beam_PostCommit_Py_VR_Dataflow_V2/ws/src/sdks/python/apache_beam/runners/portability/stager.py",> line 558, in _populate_requirements_cache
    processes.check_output(cmd_args, stderr=processes.STDOUT)
  File "<https://ci-beam.apache.org/job/beam_PostCommit_Py_VR_Dataflow_V2/ws/src/sdks/python/apache_beam/utils/processes.py",> line 99, in check_output
    .format(traceback.format_exc(), args[0][6], error.output))
RuntimeError: Full traceback: Traceback (most recent call last):
  File "<https://ci-beam.apache.org/job/beam_PostCommit_Py_VR_Dataflow_V2/ws/src/sdks/python/apache_beam/utils/processes.py",> line 91, in check_output
    out = subprocess.check_output(*args, **kwargs)
  File "/usr/lib/python2.7/subprocess.py", line 574, in check_output
    raise CalledProcessError(retcode, cmd, output=output)
CalledProcessError: Command '['<https://ci-beam.apache.org/job/beam_PostCommit_Py_VR_Dataflow_V2/ws/src/build/gradleenv/-194514014/bin/python',> '-m', 'pip', 'download', '--dest', '/tmp/dataflow-requirements-cache', '-r', 'postcommit_requirements.txt', '--exists-action', 'i', '--no-binary', ':all:']' returned non-zero exit status 1
 
 Pip install failed for package: -r           
 Output from execution of subprocess: DEPRECATION: Python 2.7 reached the end of its life on January 1st, 2020. Please upgrade your Python as Python 2.7 is no longer maintained. pip 21.0 will drop support for Python 2.7 in January 2021. More details about Python 2 support in pip can be found at https://pip.pypa.io/en/latest/development/release-process/#python-2-support
Collecting pyhamcrest!=1.10.0,<2.0.0
  File was already downloaded /tmp/dataflow-requirements-cache/PyHamcrest-1.10.1.tar.gz
Collecting mock<3.0.0
  File was already downloaded /tmp/dataflow-requirements-cache/mock-2.0.0.tar.gz
    ERROR: Command errored out with exit status 1:
     command: <https://ci-beam.apache.org/job/beam_PostCommit_Py_VR_Dataflow_V2/ws/src/build/gradleenv/-194514014/bin/python> -c 'import sys, setuptools, tokenize; sys.argv[0] = '"'"'/tmp/pip-download-UNwiY5/mock/setup.py'"'"'; __file__='"'"'/tmp/pip-download-UNwiY5/mock/setup.py'"'"';f=getattr(tokenize, '"'"'open'"'"', open)(__file__);code=f.read().replace('"'"'\r\n'"'"', '"'"'\n'"'"');f.close();exec(compile(code, __file__, '"'"'exec'"'"'))' egg_info --egg-base /tmp/pip-pip-egg-info-0I0slc
         cwd: /tmp/pip-download-UNwiY5/mock/
    Complete output (12 lines):
    <https://ci-beam.apache.org/job/beam_PostCommit_Py_VR_Dataflow_V2/ws/src/build/gradleenv/-194514014/local/lib/python2.7/site-packages/nose/plugins/manager.py>:395: RuntimeWarning: Unable to load plugin beam_test_plugin = test_config:BeamTestPlugin: No module named test_config
      RuntimeWarning)
    ERROR:root:Error parsing
    Traceback (most recent call last):
      File "<https://ci-beam.apache.org/job/beam_PostCommit_Py_VR_Dataflow_V2/ws/src/build/gradleenv/-194514014/local/lib/python2.7/site-packages/pbr/core.py",> line 96, in pbr
        attrs = util.cfg_to_args(path, dist.script_args)
      File "<https://ci-beam.apache.org/job/beam_PostCommit_Py_VR_Dataflow_V2/ws/src/build/gradleenv/-194514014/local/lib/python2.7/site-packages/pbr/util.py",> line 273, in cfg_to_args
        kwargs = setup_cfg_to_setup_kwargs(config, script_args)
      File "<https://ci-beam.apache.org/job/beam_PostCommit_Py_VR_Dataflow_V2/ws/src/build/gradleenv/-194514014/local/lib/python2.7/site-packages/pbr/util.py",> line 335, in setup_cfg_to_setup_kwargs
        description_file = io.open(filename, encoding='utf-8')
    IOError: [Errno 2] No such file or directory: 'README.rst'
    error in setup command: Error parsing /tmp/pip-download-UNwiY5/mock/setup.cfg: IOError: [Errno 2] No such file or directory: 'README.rst'
    ----------------------------------------
ERROR: Command errored out with exit status 1: python setup.py egg_info Check the logs for full command output.

-------------------- >> begin captured logging << --------------------
apache_beam.runners.portability.stager: INFO: Executing command: ['<https://ci-beam.apache.org/job/beam_PostCommit_Py_VR_Dataflow_V2/ws/src/build/gradleenv/-194514014/bin/python',> '-m', 'pip', 'download', '--dest', '/tmp/dataflow-requirements-cache', '-r', 'postcommit_requirements.txt', '--exists-action', 'i', '--no-binary', ':all:']
--------------------- >> end captured logging << ---------------------

----------------------------------------------------------------------
XML: nosetests-validatesRunnerStreamingTests-df-py27.xml
----------------------------------------------------------------------
XML: <https://ci-beam.apache.org/job/beam_PostCommit_Py_VR_Dataflow_V2/ws/src/sdks/python/nosetests.xml>
----------------------------------------------------------------------
Ran 27 tests in 2452.019s

FAILED (errors=1)
Worker logs: https://console.cloud.google.com/dataflow/jobs/us-central1/2020-08-19_11_34_03-17928302912384551122?project=apache-beam-testing
Worker logs: https://console.cloud.google.com/dataflow/jobs/us-central1/2020-08-19_11_42_37-13870694828124691244?project=apache-beam-testing
Worker logs: https://console.cloud.google.com/dataflow/jobs/us-central1/2020-08-19_11_51_16-4637314372768157291?project=apache-beam-testing
Worker logs: https://console.cloud.google.com/dataflow/jobs/us-central1/2020-08-19_11_34_02-1777669174619017140?project=apache-beam-testing
Worker logs: https://console.cloud.google.com/dataflow/jobs/us-central1/2020-08-19_11_42_36-18308924120840762979?project=apache-beam-testing
Worker logs: https://console.cloud.google.com/dataflow/jobs/us-central1/2020-08-19_11_51_16-15729121810703375010?project=apache-beam-testing
Worker logs: https://console.cloud.google.com/dataflow/jobs/us-central1/2020-08-19_11_59_47-2065660926116299971?project=apache-beam-testing
Worker logs: https://console.cloud.google.com/dataflow/jobs/us-central1/2020-08-19_11_34_02-2590283008582156702?project=apache-beam-testing
Worker logs: https://console.cloud.google.com/dataflow/jobs/us-central1/2020-08-19_11_41_55-6462671989878904527?project=apache-beam-testing
Worker logs: https://console.cloud.google.com/dataflow/jobs/us-central1/2020-08-19_11_49_30-3011089566372207975?project=apache-beam-testing
Worker logs: https://console.cloud.google.com/dataflow/jobs/us-central1/2020-08-19_11_34_01-842684077288773637?project=apache-beam-testing
Worker logs: https://console.cloud.google.com/dataflow/jobs/us-central1/2020-08-19_11_44_21-6057857156988794721?project=apache-beam-testing
Worker logs: https://console.cloud.google.com/dataflow/jobs/us-central1/2020-08-19_11_34_03-3792594628270338755?project=apache-beam-testing
Worker logs: https://console.cloud.google.com/dataflow/jobs/us-central1/2020-08-19_11_42_36-960974216227116747?project=apache-beam-testing
Worker logs: https://console.cloud.google.com/dataflow/jobs/us-central1/2020-08-19_11_50_12-2887463791027147253?project=apache-beam-testing
Worker logs: https://console.cloud.google.com/dataflow/jobs/us-central1/2020-08-19_11_34_00-797747120068818378?project=apache-beam-testing
Worker logs: https://console.cloud.google.com/dataflow/jobs/us-central1/2020-08-19_11_42_35-10502759086909132774?project=apache-beam-testing
Worker logs: https://console.cloud.google.com/dataflow/jobs/us-central1/2020-08-19_11_50_56-1782863025528057357?project=apache-beam-testing
Worker logs: https://console.cloud.google.com/dataflow/jobs/us-central1/2020-08-19_11_34_04-13196309150460909240?project=apache-beam-testing
Worker logs: https://console.cloud.google.com/dataflow/jobs/us-central1/2020-08-19_11_44_30-7659070136748731510?project=apache-beam-testing
Worker logs: https://console.cloud.google.com/dataflow/jobs/us-central1/2020-08-19_11_34_01-13096680862334625095?project=apache-beam-testing
Worker logs: https://console.cloud.google.com/dataflow/jobs/us-central1/2020-08-19_11_42_35-10645879251236557957?project=apache-beam-testing
Worker logs: https://console.cloud.google.com/dataflow/jobs/us-central1/2020-08-19_11_51_01-17802348734991135227?project=apache-beam-testing

> Task :sdks:python:test-suites:dataflow:py2:validatesRunnerStreamingTests FAILED

FAILURE: Build completed with 2 failures.

1: Task failed with an exception.
-----------
* Where:
Script '<https://ci-beam.apache.org/job/beam_PostCommit_Py_VR_Dataflow_V2/ws/src/sdks/python/test-suites/dataflow/common.gradle'> line: 146

* What went wrong:
Execution failed for task ':sdks:python:test-suites:dataflow:py2:validatesRunnerBatchTests'.
> Process 'command 'sh'' finished with non-zero exit value 1

* Try:
Run with --stacktrace option to get the stack trace. Run with --info or --debug option to get more log output. Run with --scan to get full insights.
==============================================================================

2: Task failed with an exception.
-----------
* Where:
Script '<https://ci-beam.apache.org/job/beam_PostCommit_Py_VR_Dataflow_V2/ws/src/sdks/python/test-suites/dataflow/common.gradle'> line: 175

* What went wrong:
Execution failed for task ':sdks:python:test-suites:dataflow:py2:validatesRunnerStreamingTests'.
> Process 'command 'sh'' finished with non-zero exit value 1

* Try:
Run with --stacktrace option to get the stack trace. Run with --info or --debug option to get more log output. Run with --scan to get full insights.
==============================================================================

* Get more help at https://help.gradle.org

Deprecated Gradle features were used in this build, making it incompatible with Gradle 6.0.
Use '--warning-mode all' to show the individual deprecation warnings.
See https://docs.gradle.org/5.2.1/userguide/command_line_interface.html#sec:command_line_warnings

BUILD FAILED in 1h 14m 8s
65 actionable tasks: 47 executed, 18 from cache

Publishing build scan...
https://gradle.com/s/clsxcoadlmsio

Build step 'Invoke Gradle script' changed build result to FAILURE
Build step 'Invoke Gradle script' marked build as failure

---------------------------------------------------------------------
To unsubscribe, e-mail: builds-unsubscribe@beam.apache.org
For additional commands, e-mail: builds-help@beam.apache.org


Build failed in Jenkins: beam_PostCommit_Py_VR_Dataflow_V2 #941

Posted by Apache Jenkins Server <je...@builds.apache.org>.
See <https://ci-beam.apache.org/job/beam_PostCommit_Py_VR_Dataflow_V2/941/display/redirect?page=changes>

Changes:

[tobiasz.kedzierski] [BEAM-BEAM-10667] Make github actions bulding wheels bucket name stored


------------------------------------------
[...truncated 5.38 MB...]
        ], 
        "non_parallel_inputs": {}, 
        "output_info": [
          {
            "encoding": {
              "@type": "kind:windowed_value", 
              "component_encodings": [
                {
                  "@type": "FastPrimitivesCoder$<string of 176 bytes>", 
                  "component_encodings": [
                    {
                      "@type": "FastPrimitivesCoder$<string of 176 bytes>", 
                      "component_encodings": [], 
                      "pipeline_proto_coder_id": "ref_Coder_FastPrimitivesCoder_4"
                    }, 
                    {
                      "@type": "FastPrimitivesCoder$<string of 176 bytes>", 
                      "component_encodings": [], 
                      "pipeline_proto_coder_id": "ref_Coder_FastPrimitivesCoder_4"
                    }
                  ], 
                  "is_pair_like": true, 
                  "pipeline_proto_coder_id": "ref_Coder_FastPrimitivesCoder_4"
                }, 
                {
                  "@type": "kind:global_window"
                }
              ], 
              "is_wrapper": true
            }, 
            "output_name": "None", 
            "user_name": "assert_that/Unkey.out"
          }
        ], 
        "parallel_input": {
          "@type": "OutputReference", 
          "output_name": "None", 
          "step_name": "s19"
        }, 
        "serialized_fn": "ref_AppliedPTransform_assert_that/Unkey_29", 
        "user_name": "assert_that/Unkey"
      }
    }, 
    {
      "kind": "ParallelDo", 
      "name": "s21", 
      "properties": {
        "display_data": [
          {
            "key": "fn", 
            "label": "Transform Function", 
            "namespace": "apache_beam.transforms.core.CallableWrapperDoFn", 
            "type": "STRING", 
            "value": "_equal"
          }, 
          {
            "key": "fn", 
            "label": "Transform Function", 
            "namespace": "apache_beam.transforms.core.ParDo", 
            "shortValue": "CallableWrapperDoFn", 
            "type": "STRING", 
            "value": "apache_beam.transforms.core.CallableWrapperDoFn"
          }
        ], 
        "non_parallel_inputs": {}, 
        "output_info": [
          {
            "encoding": {
              "@type": "kind:windowed_value", 
              "component_encodings": [
                {
                  "@type": "FastPrimitivesCoder$<string of 176 bytes>", 
                  "component_encodings": [
                    {
                      "@type": "FastPrimitivesCoder$<string of 176 bytes>", 
                      "component_encodings": [], 
                      "pipeline_proto_coder_id": "ref_Coder_FastPrimitivesCoder_4"
                    }, 
                    {
                      "@type": "FastPrimitivesCoder$<string of 176 bytes>", 
                      "component_encodings": [], 
                      "pipeline_proto_coder_id": "ref_Coder_FastPrimitivesCoder_4"
                    }
                  ], 
                  "is_pair_like": true, 
                  "pipeline_proto_coder_id": "ref_Coder_FastPrimitivesCoder_4"
                }, 
                {
                  "@type": "kind:global_window"
                }
              ], 
              "is_wrapper": true
            }, 
            "output_name": "None", 
            "user_name": "assert_that/Match.out"
          }
        ], 
        "parallel_input": {
          "@type": "OutputReference", 
          "output_name": "None", 
          "step_name": "s20"
        }, 
        "serialized_fn": "ref_AppliedPTransform_assert_that/Match_30", 
        "user_name": "assert_that/Match"
      }
    }
  ], 
  "type": "JOB_TYPE_STREAMING"
}
INFO:apache_beam.runners.dataflow.internal.apiclient:Create job: <Job
 createTime: u'2020-08-19T12:57:37.238920Z'
 currentStateTime: u'1970-01-01T00:00:00Z'
 id: u'2020-08-19_05_57_36-15573232874606042330'
 location: u'us-central1'
 name: u'beamapp-jenkins-0819125725-270537'
 projectId: u'apache-beam-testing'
 stageStates: []
 startTime: u'2020-08-19T12:57:37.238920Z'
 steps: []
 tempFiles: []
 type: TypeValueValuesEnum(JOB_TYPE_STREAMING, 2)>
INFO:apache_beam.runners.dataflow.internal.apiclient:Created job with id: [2020-08-19_05_57_36-15573232874606042330]
INFO:apache_beam.runners.dataflow.internal.apiclient:Submitted job: 2020-08-19_05_57_36-15573232874606042330
INFO:apache_beam.runners.dataflow.internal.apiclient:To access the Dataflow monitoring console, please navigate to https://console.cloud.google.com/dataflow/jobs/us-central1/2020-08-19_05_57_36-15573232874606042330?project=apache-beam-testing
WARNING:apache_beam.runners.dataflow.test_dataflow_runner:Waiting indefinitely for streaming job.
INFO:apache_beam.runners.dataflow.dataflow_runner:Job 2020-08-19_05_57_36-15573232874606042330 is in state JOB_STATE_RUNNING
INFO:apache_beam.runners.dataflow.dataflow_runner:2020-08-19T12:57:36.130Z: JOB_MESSAGE_WARNING: Autoscaling is enabled for Dataflow Streaming Engine. Workers will scale between 1 and 100 unless maxNumWorkers is specified.
INFO:apache_beam.runners.dataflow.dataflow_runner:2020-08-19T12:57:36.131Z: JOB_MESSAGE_DETAILED: Autoscaling was automatically enabled for job 2020-08-19_05_57_36-15573232874606042330.
INFO:apache_beam.runners.dataflow.dataflow_runner:2020-08-19T12:57:36.131Z: JOB_MESSAGE_DETAILED: Autoscaling is enabled for job 2020-08-19_05_57_36-15573232874606042330. The number of workers will be between 1 and 100.
INFO:apache_beam.runners.dataflow.dataflow_runner:2020-08-19T12:57:40.119Z: JOB_MESSAGE_BASIC: Worker configuration: n1-standard-2 in us-central1-f.
INFO:apache_beam.runners.dataflow.dataflow_runner:2020-08-19T12:57:40.753Z: JOB_MESSAGE_DETAILED: Expanding SplittableParDo operations into optimizable parts.
INFO:apache_beam.runners.dataflow.dataflow_runner:2020-08-19T12:57:40.788Z: JOB_MESSAGE_DETAILED: Expanding CollectionToSingleton operations into optimizable parts.
INFO:apache_beam.runners.dataflow.dataflow_runner:2020-08-19T12:57:40.870Z: JOB_MESSAGE_DETAILED: Expanding CoGroupByKey operations into optimizable parts.
INFO:apache_beam.runners.dataflow.dataflow_runner:2020-08-19T12:57:40.903Z: JOB_MESSAGE_DEBUG: Combiner lifting skipped for step assert_that/Group/GroupByKey: GroupByKey not followed by a combiner.
INFO:apache_beam.runners.dataflow.dataflow_runner:2020-08-19T12:57:40.936Z: JOB_MESSAGE_DEBUG: Combiner lifting skipped for step Create/MaybeReshuffle/Reshuffle/ReshufflePerKey/GroupByKey: GroupByKey not followed by a combiner.
INFO:apache_beam.runners.dataflow.dataflow_runner:2020-08-19T12:57:40.982Z: JOB_MESSAGE_DETAILED: Expanding SplittableProcessKeyed operations into optimizable parts.
INFO:apache_beam.runners.dataflow.dataflow_runner:2020-08-19T12:57:41.009Z: JOB_MESSAGE_DETAILED: Expanding GroupByKey operations into streaming Read/Write steps
INFO:apache_beam.runners.dataflow.dataflow_runner:2020-08-19T12:57:41.108Z: JOB_MESSAGE_DETAILED: Lifting ValueCombiningMappingFns into MergeBucketsMappingFns
INFO:apache_beam.runners.dataflow.dataflow_runner:2020-08-19T12:57:41.211Z: JOB_MESSAGE_DEBUG: Annotating graph with Autotuner information.
INFO:apache_beam.runners.dataflow.dataflow_runner:2020-08-19T12:57:41.259Z: JOB_MESSAGE_DETAILED: Fusing adjacent ParDo, Read, Write, and Flatten operations
INFO:apache_beam.runners.dataflow.dataflow_runner:2020-08-19T12:57:41.285Z: JOB_MESSAGE_DETAILED: Unzipping flatten s17 for input s15.None
INFO:apache_beam.runners.dataflow.dataflow_runner:2020-08-19T12:57:41.320Z: JOB_MESSAGE_DETAILED: Fusing unzipped copy of assert_that/Group/GroupByKey/WriteStream, through flatten assert_that/Group/Flatten, into producer assert_that/Group/pair_with_0
INFO:apache_beam.runners.dataflow.dataflow_runner:2020-08-19T12:57:41.356Z: JOB_MESSAGE_DETAILED: Fusing consumer assert_that/Group/GroupByKey/WriteStream into assert_that/Group/pair_with_1
INFO:apache_beam.runners.dataflow.dataflow_runner:2020-08-19T12:57:41.379Z: JOB_MESSAGE_DETAILED: Fusing consumer Create/MaybeReshuffle/Reshuffle/ReshufflePerKey/GroupByKey/MergeBuckets into Create/MaybeReshuffle/Reshuffle/ReshufflePerKey/GroupByKey/ReadStream
INFO:apache_beam.runners.dataflow.dataflow_runner:2020-08-19T12:57:41.411Z: JOB_MESSAGE_DETAILED: Fusing consumer Create/MaybeReshuffle/Reshuffle/ReshufflePerKey/FlatMap(restore_timestamps) into Create/MaybeReshuffle/Reshuffle/ReshufflePerKey/GroupByKey/MergeBuckets
INFO:apache_beam.runners.dataflow.dataflow_runner:2020-08-19T12:57:41.445Z: JOB_MESSAGE_DETAILED: Fusing consumer Create/MaybeReshuffle/Reshuffle/RemoveRandomKeys into Create/MaybeReshuffle/Reshuffle/ReshufflePerKey/FlatMap(restore_timestamps)
INFO:apache_beam.runners.dataflow.dataflow_runner:2020-08-19T12:57:41.471Z: JOB_MESSAGE_DETAILED: Fusing consumer Create/Map(decode) into Create/MaybeReshuffle/Reshuffle/RemoveRandomKeys
INFO:apache_beam.runners.dataflow.dataflow_runner:2020-08-19T12:57:41.508Z: JOB_MESSAGE_DETAILED: Fusing consumer Key param into Create/Map(decode)
INFO:apache_beam.runners.dataflow.dataflow_runner:2020-08-19T12:57:41.544Z: JOB_MESSAGE_DETAILED: Fusing consumer assert_that/WindowInto(WindowIntoFn) into Key param
INFO:apache_beam.runners.dataflow.dataflow_runner:2020-08-19T12:57:41.584Z: JOB_MESSAGE_DETAILED: Fusing consumer assert_that/ToVoidKey into assert_that/WindowInto(WindowIntoFn)
INFO:apache_beam.runners.dataflow.dataflow_runner:2020-08-19T12:57:41.619Z: JOB_MESSAGE_DETAILED: Fusing consumer assert_that/Group/pair_with_1 into assert_that/ToVoidKey
INFO:apache_beam.runners.dataflow.dataflow_runner:2020-08-19T12:57:41.657Z: JOB_MESSAGE_DETAILED: Fusing consumer assert_that/Group/GroupByKey/MergeBuckets into assert_that/Group/GroupByKey/ReadStream
INFO:apache_beam.runners.dataflow.dataflow_runner:2020-08-19T12:57:41.692Z: JOB_MESSAGE_DETAILED: Fusing consumer assert_that/Group/Map(_merge_tagged_vals_under_key) into assert_that/Group/GroupByKey/MergeBuckets
INFO:apache_beam.runners.dataflow.dataflow_runner:2020-08-19T12:57:41.718Z: JOB_MESSAGE_DETAILED: Fusing consumer assert_that/Unkey into assert_that/Group/Map(_merge_tagged_vals_under_key)
INFO:apache_beam.runners.dataflow.dataflow_runner:2020-08-19T12:57:41.750Z: JOB_MESSAGE_DETAILED: Fusing consumer assert_that/Match into assert_that/Unkey
INFO:apache_beam.runners.dataflow.dataflow_runner:2020-08-19T12:57:41.786Z: JOB_MESSAGE_DETAILED: Fusing consumer Create/FlatMap(<lambda at core.py:2826>) into Create/Impulse
INFO:apache_beam.runners.dataflow.dataflow_runner:2020-08-19T12:57:41.822Z: JOB_MESSAGE_DETAILED: Fusing consumer assert_that/Create/FlatMap(<lambda at core.py:2826>) into assert_that/Create/Impulse
INFO:apache_beam.runners.dataflow.dataflow_runner:2020-08-19T12:57:41.861Z: JOB_MESSAGE_DETAILED: Fusing consumer assert_that/Create/Map(decode) into assert_that/Create/FlatMap(<lambda at core.py:2826>)
INFO:apache_beam.runners.dataflow.dataflow_runner:2020-08-19T12:57:41.901Z: JOB_MESSAGE_DETAILED: Fusing consumer assert_that/Group/pair_with_0 into assert_that/Create/Map(decode)
INFO:apache_beam.runners.dataflow.dataflow_runner:2020-08-19T12:57:41.933Z: JOB_MESSAGE_DETAILED: Fusing consumer Create/MaybeReshuffle/Reshuffle/AddRandomKeys into Create/FlatMap(<lambda at core.py:2826>)
INFO:apache_beam.runners.dataflow.dataflow_runner:2020-08-19T12:57:41.959Z: JOB_MESSAGE_DETAILED: Fusing consumer Create/MaybeReshuffle/Reshuffle/ReshufflePerKey/Map(reify_timestamps) into Create/MaybeReshuffle/Reshuffle/AddRandomKeys
INFO:apache_beam.runners.dataflow.dataflow_runner:2020-08-19T12:57:41.992Z: JOB_MESSAGE_DETAILED: Fusing consumer Create/MaybeReshuffle/Reshuffle/ReshufflePerKey/GroupByKey/WriteStream into Create/MaybeReshuffle/Reshuffle/ReshufflePerKey/Map(reify_timestamps)
INFO:apache_beam.runners.dataflow.dataflow_runner:2020-08-19T12:57:42.048Z: JOB_MESSAGE_DEBUG: Workflow config is missing a default resource spec.
INFO:apache_beam.runners.dataflow.dataflow_runner:2020-08-19T12:57:42.081Z: JOB_MESSAGE_DEBUG: Adding StepResource setup and teardown to workflow graph.
INFO:apache_beam.runners.dataflow.dataflow_runner:2020-08-19T12:57:42.118Z: JOB_MESSAGE_DEBUG: Adding workflow start and stop steps.
INFO:apache_beam.runners.dataflow.dataflow_runner:2020-08-19T12:57:42.156Z: JOB_MESSAGE_DEBUG: Assigning stage ids.
INFO:apache_beam.runners.dataflow.dataflow_runner:2020-08-19T12:57:44.381Z: JOB_MESSAGE_DEBUG: Starting worker pool setup.
INFO:apache_beam.runners.dataflow.dataflow_runner:2020-08-19T12:57:44.413Z: JOB_MESSAGE_BASIC: Starting 1 workers in us-central1-f...
INFO:apache_beam.runners.dataflow.dataflow_runner:2020-08-19T12:57:44.463Z: JOB_MESSAGE_DEBUG: Starting worker pool setup.
INFO:apache_beam.runners.dataflow.dataflow_runner:2020-08-19T12:58:07.625Z: JOB_MESSAGE_DETAILED: Autoscaling: Raised the number of workers to 1 so that the pipeline can catch up with its backlog and keep up with its input rate.
INFO:apache_beam.runners.dataflow.dataflow_runner:2020-08-19T12:58:14.580Z: JOB_MESSAGE_DETAILED: Autoscaling: Reduced the number of workers to 0 based on low average worker CPU utilization, and the pipeline having sufficiently low backlog and keeping up with input rate.
INFO:apache_beam.runners.dataflow.dataflow_runner:2020-08-19T12:58:14.625Z: JOB_MESSAGE_BASIC: Worker pool stopped.
INFO:apache_beam.runners.dataflow.dataflow_runner:2020-08-19T12:58:14.655Z: JOB_MESSAGE_DEBUG: Tearing down pending resources...
INFO:apache_beam.runners.dataflow.dataflow_runner:2020-08-19T12:58:17.091Z: JOB_MESSAGE_WARNING: Your project already contains 100 Dataflow-created metric descriptors and Stackdriver will not create new Dataflow custom metrics for this job. Each unique user-defined metric name (independent of the DoFn in which it is defined) produces a new metric descriptor. To delete old / unused metric descriptors see https://developers.google.com/apis-explorer/#p/monitoring/v3/monitoring.projects.metricDescriptors.list and https://developers.google.com/apis-explorer/#p/monitoring/v3/monitoring.projects.metricDescriptors.delete
INFO:apache_beam.runners.dataflow.dataflow_runner:Job 2020-08-19_05_49_04-14543390857195326283 is in state JOB_STATE_DONE
test_reshuffle_preserves_timestamps (apache_beam.transforms.util_test.ReshuffleTest) ... ok
INFO:apache_beam.runners.dataflow.dataflow_runner:2020-08-19T12:58:52.993Z: JOB_MESSAGE_DETAILED: Workers have started successfully.
INFO:apache_beam.runners.dataflow.dataflow_runner:2020-08-19T12:58:53.034Z: JOB_MESSAGE_DETAILED: Workers have started successfully.
INFO:apache_beam.runners.dataflow.dataflow_runner:2020-08-19T13:04:46.390Z: JOB_MESSAGE_DETAILED: Cleaning up.
INFO:apache_beam.runners.dataflow.dataflow_runner:2020-08-19T13:04:46.549Z: JOB_MESSAGE_DEBUG: Starting worker pool teardown.
INFO:apache_beam.runners.dataflow.dataflow_runner:2020-08-19T13:04:46.575Z: JOB_MESSAGE_BASIC: Stopping worker pool...
INFO:apache_beam.runners.dataflow.dataflow_runner:2020-08-19T13:04:46.598Z: JOB_MESSAGE_DEBUG: Starting worker pool teardown.
INFO:apache_beam.runners.dataflow.dataflow_runner:2020-08-19T13:04:46.624Z: JOB_MESSAGE_BASIC: Stopping worker pool...
INFO:apache_beam.runners.dataflow.dataflow_runner:2020-08-19T13:05:38.919Z: JOB_MESSAGE_DETAILED: Autoscaling: Reduced the number of workers to 0 based on low average worker CPU utilization, and the pipeline having sufficiently low backlog and keeping up with input rate.
INFO:apache_beam.runners.dataflow.dataflow_runner:2020-08-19T13:05:38.984Z: JOB_MESSAGE_BASIC: Worker pool stopped.
INFO:apache_beam.runners.dataflow.dataflow_runner:2020-08-19T13:05:39.021Z: JOB_MESSAGE_DEBUG: Tearing down pending resources...
INFO:apache_beam.runners.dataflow.dataflow_runner:Job 2020-08-19_05_57_36-15573232874606042330 is in state JOB_STATE_DONE
test_element_param (apache_beam.pipeline_test.DoFnTest) ... ok
test_key_param (apache_beam.pipeline_test.DoFnTest) ... ok

----------------------------------------------------------------------
XML: nosetests-validatesRunnerStreamingTests-df-py27.xml
----------------------------------------------------------------------
XML: <https://ci-beam.apache.org/job/beam_PostCommit_Py_VR_Dataflow_V2/ws/src/sdks/python/nosetests.xml>
----------------------------------------------------------------------
Ran 27 tests in 2057.001s

OK
Worker logs: https://console.cloud.google.com/dataflow/jobs/us-central1/2020-08-19_05_31_56-5140507842159452360?project=apache-beam-testing
Worker logs: https://console.cloud.google.com/dataflow/jobs/us-central1/2020-08-19_05_40_33-17572239361308536898?project=apache-beam-testing
Worker logs: https://console.cloud.google.com/dataflow/jobs/us-central1/2020-08-19_05_49_09-8741331711050832271?project=apache-beam-testing
Worker logs: https://console.cloud.google.com/dataflow/jobs/us-central1/2020-08-19_05_57_36-15573232874606042330?project=apache-beam-testing
Worker logs: https://console.cloud.google.com/dataflow/jobs/us-central1/2020-08-19_05_31_56-811280439412030282?project=apache-beam-testing
Worker logs: https://console.cloud.google.com/dataflow/jobs/us-central1/2020-08-19_05_41_52-14018041716885000760?project=apache-beam-testing
Worker logs: https://console.cloud.google.com/dataflow/jobs/us-central1/2020-08-19_05_31_55-11437583935757666815?project=apache-beam-testing
Worker logs: https://console.cloud.google.com/dataflow/jobs/us-central1/2020-08-19_05_39_28-11820784541544145675?project=apache-beam-testing
Worker logs: https://console.cloud.google.com/dataflow/jobs/us-central1/2020-08-19_05_47_48-6997598805986294088?project=apache-beam-testing
Worker logs: https://console.cloud.google.com/dataflow/jobs/us-central1/2020-08-19_05_31_56-11435232047719258730?project=apache-beam-testing
Worker logs: https://console.cloud.google.com/dataflow/jobs/us-central1/2020-08-19_05_40_26-3276607154838157789?project=apache-beam-testing
Worker logs: https://console.cloud.google.com/dataflow/jobs/us-central1/2020-08-19_05_48_52-6735160125267736772?project=apache-beam-testing
Worker logs: https://console.cloud.google.com/dataflow/jobs/us-central1/2020-08-19_05_31_54-6632851267481966644?project=apache-beam-testing
Worker logs: https://console.cloud.google.com/dataflow/jobs/us-central1/2020-08-19_05_40_27-14627664568055625823?project=apache-beam-testing
Worker logs: https://console.cloud.google.com/dataflow/jobs/us-central1/2020-08-19_05_49_04-14543390857195326283?project=apache-beam-testing
Worker logs: https://console.cloud.google.com/dataflow/jobs/us-central1/2020-08-19_05_31_56-9898358574250216461?project=apache-beam-testing
Worker logs: https://console.cloud.google.com/dataflow/jobs/us-central1/2020-08-19_05_40_28-6887594710595293618?project=apache-beam-testing
Worker logs: https://console.cloud.google.com/dataflow/jobs/us-central1/2020-08-19_05_48_54-16788833760056792229?project=apache-beam-testing
Worker logs: https://console.cloud.google.com/dataflow/jobs/us-central1/2020-08-19_05_31_54-17014880488508562235?project=apache-beam-testing
Worker logs: https://console.cloud.google.com/dataflow/jobs/us-central1/2020-08-19_05_40_27-5687278176486735197?project=apache-beam-testing
Worker logs: https://console.cloud.google.com/dataflow/jobs/us-central1/2020-08-19_05_49_04-1033534650403312592?project=apache-beam-testing
Worker logs: https://console.cloud.google.com/dataflow/jobs/us-central1/2020-08-19_05_31_57-12771502645156672098?project=apache-beam-testing
Worker logs: https://console.cloud.google.com/dataflow/jobs/us-central1/2020-08-19_05_40_29-13705337852243064881?project=apache-beam-testing
Worker logs: https://console.cloud.google.com/dataflow/jobs/us-central1/2020-08-19_05_48_56-8434001820376493795?project=apache-beam-testing

FAILURE: Build failed with an exception.

* Where:
Script '<https://ci-beam.apache.org/job/beam_PostCommit_Py_VR_Dataflow_V2/ws/src/sdks/python/test-suites/dataflow/common.gradle'> line: 146

* What went wrong:
Execution failed for task ':sdks:python:test-suites:dataflow:py2:validatesRunnerBatchTests'.
> Process 'command 'sh'' finished with non-zero exit value 1

* Try:
Run with --stacktrace option to get the stack trace. Run with --info or --debug option to get more log output. Run with --scan to get full insights.

* Get more help at https://help.gradle.org

Deprecated Gradle features were used in this build, making it incompatible with Gradle 6.0.
Use '--warning-mode all' to show the individual deprecation warnings.
See https://docs.gradle.org/5.2.1/userguide/command_line_interface.html#sec:command_line_warnings

BUILD FAILED in 1h 5m 31s
65 actionable tasks: 47 executed, 18 from cache

Publishing build scan...
https://gradle.com/s/upiocppqsglpg

Build step 'Invoke Gradle script' changed build result to FAILURE
Build step 'Invoke Gradle script' marked build as failure

---------------------------------------------------------------------
To unsubscribe, e-mail: builds-unsubscribe@beam.apache.org
For additional commands, e-mail: builds-help@beam.apache.org


Build failed in Jenkins: beam_PostCommit_Py_VR_Dataflow_V2 #940

Posted by Apache Jenkins Server <je...@builds.apache.org>.
See <https://ci-beam.apache.org/job/beam_PostCommit_Py_VR_Dataflow_V2/940/display/redirect?page=changes>

Changes:

[ekirpichov] Add enum34 to manual_licenses


------------------------------------------
[...truncated 5.42 MB...]
            "namespace": "apache_beam.transforms.core.ParDo", 
            "shortValue": "CallableWrapperDoFn", 
            "type": "STRING", 
            "value": "apache_beam.transforms.core.CallableWrapperDoFn"
          }
        ], 
        "non_parallel_inputs": {}, 
        "output_info": [
          {
            "encoding": {
              "@type": "kind:windowed_value", 
              "component_encodings": [
                {
                  "@type": "FastPrimitivesCoder$<string of 176 bytes>", 
                  "component_encodings": [
                    {
                      "@type": "FastPrimitivesCoder$<string of 176 bytes>", 
                      "component_encodings": [], 
                      "pipeline_proto_coder_id": "ref_Coder_FastPrimitivesCoder_4"
                    }, 
                    {
                      "@type": "FastPrimitivesCoder$<string of 176 bytes>", 
                      "component_encodings": [], 
                      "pipeline_proto_coder_id": "ref_Coder_FastPrimitivesCoder_4"
                    }
                  ], 
                  "is_pair_like": true, 
                  "pipeline_proto_coder_id": "ref_Coder_FastPrimitivesCoder_4"
                }, 
                {
                  "@type": "kind:global_window"
                }
              ], 
              "is_wrapper": true
            }, 
            "output_name": "None", 
            "user_name": "assert_that/Unkey.out"
          }
        ], 
        "parallel_input": {
          "@type": "OutputReference", 
          "output_name": "None", 
          "step_name": "s19"
        }, 
        "serialized_fn": "ref_AppliedPTransform_assert_that/Unkey_29", 
        "user_name": "assert_that/Unkey"
      }
    }, 
    {
      "kind": "ParallelDo", 
      "name": "s21", 
      "properties": {
        "display_data": [
          {
            "key": "fn", 
            "label": "Transform Function", 
            "namespace": "apache_beam.transforms.core.CallableWrapperDoFn", 
            "type": "STRING", 
            "value": "_equal"
          }, 
          {
            "key": "fn", 
            "label": "Transform Function", 
            "namespace": "apache_beam.transforms.core.ParDo", 
            "shortValue": "CallableWrapperDoFn", 
            "type": "STRING", 
            "value": "apache_beam.transforms.core.CallableWrapperDoFn"
          }
        ], 
        "non_parallel_inputs": {}, 
        "output_info": [
          {
            "encoding": {
              "@type": "kind:windowed_value", 
              "component_encodings": [
                {
                  "@type": "FastPrimitivesCoder$<string of 176 bytes>", 
                  "component_encodings": [
                    {
                      "@type": "FastPrimitivesCoder$<string of 176 bytes>", 
                      "component_encodings": [], 
                      "pipeline_proto_coder_id": "ref_Coder_FastPrimitivesCoder_4"
                    }, 
                    {
                      "@type": "FastPrimitivesCoder$<string of 176 bytes>", 
                      "component_encodings": [], 
                      "pipeline_proto_coder_id": "ref_Coder_FastPrimitivesCoder_4"
                    }
                  ], 
                  "is_pair_like": true, 
                  "pipeline_proto_coder_id": "ref_Coder_FastPrimitivesCoder_4"
                }, 
                {
                  "@type": "kind:global_window"
                }
              ], 
              "is_wrapper": true
            }, 
            "output_name": "None", 
            "user_name": "assert_that/Match.out"
          }
        ], 
        "parallel_input": {
          "@type": "OutputReference", 
          "output_name": "None", 
          "step_name": "s20"
        }, 
        "serialized_fn": "ref_AppliedPTransform_assert_that/Match_30", 
        "user_name": "assert_that/Match"
      }
    }
  ], 
  "type": "JOB_TYPE_STREAMING"
}
INFO:apache_beam.runners.dataflow.internal.apiclient:Create job: <Job
 createTime: u'2020-08-19T06:54:04.380668Z'
 currentStateTime: u'1970-01-01T00:00:00Z'
 id: u'2020-08-18_23_53_55-12787532217488596459'
 location: u'us-central1'
 name: u'beamapp-jenkins-0819065345-284095'
 projectId: u'apache-beam-testing'
 stageStates: []
 startTime: u'2020-08-19T06:54:04.380668Z'
 steps: []
 tempFiles: []
 type: TypeValueValuesEnum(JOB_TYPE_STREAMING, 2)>
INFO:apache_beam.runners.dataflow.internal.apiclient:Created job with id: [2020-08-18_23_53_55-12787532217488596459]
INFO:apache_beam.runners.dataflow.internal.apiclient:Submitted job: 2020-08-18_23_53_55-12787532217488596459
INFO:apache_beam.runners.dataflow.internal.apiclient:To access the Dataflow monitoring console, please navigate to https://console.cloud.google.com/dataflow/jobs/us-central1/2020-08-18_23_53_55-12787532217488596459?project=apache-beam-testing
WARNING:apache_beam.runners.dataflow.test_dataflow_runner:Waiting indefinitely for streaming job.
INFO:apache_beam.runners.dataflow.dataflow_runner:Job 2020-08-18_23_53_55-12787532217488596459 is in state JOB_STATE_RUNNING
INFO:apache_beam.runners.dataflow.dataflow_runner:2020-08-19T06:53:56Z: JOB_MESSAGE_WARNING: Autoscaling is enabled for Dataflow Streaming Engine. Workers will scale between 1 and 100 unless maxNumWorkers is specified.
INFO:apache_beam.runners.dataflow.dataflow_runner:2020-08-19T06:53:56Z: JOB_MESSAGE_DETAILED: Autoscaling is enabled for job 2020-08-18_23_53_55-12787532217488596459. The number of workers will be between 1 and 100.
INFO:apache_beam.runners.dataflow.dataflow_runner:2020-08-19T06:53:56Z: JOB_MESSAGE_DETAILED: Autoscaling was automatically enabled for job 2020-08-18_23_53_55-12787532217488596459.
INFO:apache_beam.runners.dataflow.dataflow_runner:2020-08-19T06:54:07.038Z: JOB_MESSAGE_BASIC: Worker configuration: n1-standard-2 in us-central1-f.
INFO:apache_beam.runners.dataflow.dataflow_runner:2020-08-19T06:54:07.684Z: JOB_MESSAGE_DETAILED: Expanding SplittableParDo operations into optimizable parts.
INFO:apache_beam.runners.dataflow.dataflow_runner:2020-08-19T06:54:07.786Z: JOB_MESSAGE_DETAILED: Expanding CollectionToSingleton operations into optimizable parts.
INFO:apache_beam.runners.dataflow.dataflow_runner:2020-08-19T06:54:07.879Z: JOB_MESSAGE_DETAILED: Expanding CoGroupByKey operations into optimizable parts.
INFO:apache_beam.runners.dataflow.dataflow_runner:2020-08-19T06:54:07.917Z: JOB_MESSAGE_DEBUG: Combiner lifting skipped for step assert_that/Group/GroupByKey: GroupByKey not followed by a combiner.
INFO:apache_beam.runners.dataflow.dataflow_runner:2020-08-19T06:54:07.949Z: JOB_MESSAGE_DEBUG: Combiner lifting skipped for step Create/MaybeReshuffle/Reshuffle/ReshufflePerKey/GroupByKey: GroupByKey not followed by a combiner.
INFO:apache_beam.runners.dataflow.dataflow_runner:2020-08-19T06:54:07.987Z: JOB_MESSAGE_DETAILED: Expanding SplittableProcessKeyed operations into optimizable parts.
INFO:apache_beam.runners.dataflow.dataflow_runner:2020-08-19T06:54:08.006Z: JOB_MESSAGE_DETAILED: Expanding GroupByKey operations into streaming Read/Write steps
INFO:apache_beam.runners.dataflow.dataflow_runner:2020-08-19T06:54:08.107Z: JOB_MESSAGE_DETAILED: Lifting ValueCombiningMappingFns into MergeBucketsMappingFns
INFO:apache_beam.runners.dataflow.dataflow_runner:2020-08-19T06:54:08.202Z: JOB_MESSAGE_DEBUG: Annotating graph with Autotuner information.
INFO:apache_beam.runners.dataflow.dataflow_runner:2020-08-19T06:54:08.239Z: JOB_MESSAGE_DETAILED: Fusing adjacent ParDo, Read, Write, and Flatten operations
INFO:apache_beam.runners.dataflow.dataflow_runner:2020-08-19T06:54:08.265Z: JOB_MESSAGE_DETAILED: Unzipping flatten s17 for input s15.None
INFO:apache_beam.runners.dataflow.dataflow_runner:2020-08-19T06:54:08.293Z: JOB_MESSAGE_DETAILED: Fusing unzipped copy of assert_that/Group/GroupByKey/WriteStream, through flatten assert_that/Group/Flatten, into producer assert_that/Group/pair_with_0
INFO:apache_beam.runners.dataflow.dataflow_runner:2020-08-19T06:54:08.326Z: JOB_MESSAGE_DETAILED: Fusing consumer assert_that/Group/GroupByKey/WriteStream into assert_that/Group/pair_with_1
INFO:apache_beam.runners.dataflow.dataflow_runner:2020-08-19T06:54:08.362Z: JOB_MESSAGE_DETAILED: Fusing consumer Create/MaybeReshuffle/Reshuffle/ReshufflePerKey/GroupByKey/MergeBuckets into Create/MaybeReshuffle/Reshuffle/ReshufflePerKey/GroupByKey/ReadStream
INFO:apache_beam.runners.dataflow.dataflow_runner:2020-08-19T06:54:08.390Z: JOB_MESSAGE_DETAILED: Fusing consumer Create/MaybeReshuffle/Reshuffle/ReshufflePerKey/FlatMap(restore_timestamps) into Create/MaybeReshuffle/Reshuffle/ReshufflePerKey/GroupByKey/MergeBuckets
INFO:apache_beam.runners.dataflow.dataflow_runner:2020-08-19T06:54:08.418Z: JOB_MESSAGE_DETAILED: Fusing consumer Create/MaybeReshuffle/Reshuffle/RemoveRandomKeys into Create/MaybeReshuffle/Reshuffle/ReshufflePerKey/FlatMap(restore_timestamps)
INFO:apache_beam.runners.dataflow.dataflow_runner:2020-08-19T06:54:08.454Z: JOB_MESSAGE_DETAILED: Fusing consumer Create/Map(decode) into Create/MaybeReshuffle/Reshuffle/RemoveRandomKeys
INFO:apache_beam.runners.dataflow.dataflow_runner:2020-08-19T06:54:08.491Z: JOB_MESSAGE_DETAILED: Fusing consumer Key param into Create/Map(decode)
INFO:apache_beam.runners.dataflow.dataflow_runner:2020-08-19T06:54:08.518Z: JOB_MESSAGE_DETAILED: Fusing consumer assert_that/WindowInto(WindowIntoFn) into Key param
INFO:apache_beam.runners.dataflow.dataflow_runner:2020-08-19T06:54:08.551Z: JOB_MESSAGE_DETAILED: Fusing consumer assert_that/ToVoidKey into assert_that/WindowInto(WindowIntoFn)
INFO:apache_beam.runners.dataflow.dataflow_runner:2020-08-19T06:54:08.586Z: JOB_MESSAGE_DETAILED: Fusing consumer assert_that/Group/pair_with_1 into assert_that/ToVoidKey
INFO:apache_beam.runners.dataflow.dataflow_runner:2020-08-19T06:54:08.621Z: JOB_MESSAGE_DETAILED: Fusing consumer assert_that/Group/GroupByKey/MergeBuckets into assert_that/Group/GroupByKey/ReadStream
INFO:apache_beam.runners.dataflow.dataflow_runner:2020-08-19T06:54:08.648Z: JOB_MESSAGE_DETAILED: Fusing consumer assert_that/Group/Map(_merge_tagged_vals_under_key) into assert_that/Group/GroupByKey/MergeBuckets
INFO:apache_beam.runners.dataflow.dataflow_runner:2020-08-19T06:54:08.682Z: JOB_MESSAGE_DETAILED: Fusing consumer assert_that/Unkey into assert_that/Group/Map(_merge_tagged_vals_under_key)
INFO:apache_beam.runners.dataflow.dataflow_runner:2020-08-19T06:54:08.716Z: JOB_MESSAGE_DETAILED: Fusing consumer assert_that/Match into assert_that/Unkey
INFO:apache_beam.runners.dataflow.dataflow_runner:2020-08-19T06:54:08.755Z: JOB_MESSAGE_DETAILED: Fusing consumer Create/FlatMap(<lambda at core.py:2826>) into Create/Impulse
INFO:apache_beam.runners.dataflow.dataflow_runner:2020-08-19T06:54:08.788Z: JOB_MESSAGE_DETAILED: Fusing consumer assert_that/Create/FlatMap(<lambda at core.py:2826>) into assert_that/Create/Impulse
INFO:apache_beam.runners.dataflow.dataflow_runner:2020-08-19T06:54:08.812Z: JOB_MESSAGE_DETAILED: Fusing consumer assert_that/Create/Map(decode) into assert_that/Create/FlatMap(<lambda at core.py:2826>)
INFO:apache_beam.runners.dataflow.dataflow_runner:2020-08-19T06:54:08.848Z: JOB_MESSAGE_DETAILED: Fusing consumer assert_that/Group/pair_with_0 into assert_that/Create/Map(decode)
INFO:apache_beam.runners.dataflow.dataflow_runner:2020-08-19T06:54:08.871Z: JOB_MESSAGE_DETAILED: Fusing consumer Create/MaybeReshuffle/Reshuffle/AddRandomKeys into Create/FlatMap(<lambda at core.py:2826>)
INFO:apache_beam.runners.dataflow.dataflow_runner:2020-08-19T06:54:08.908Z: JOB_MESSAGE_DETAILED: Fusing consumer Create/MaybeReshuffle/Reshuffle/ReshufflePerKey/Map(reify_timestamps) into Create/MaybeReshuffle/Reshuffle/AddRandomKeys
INFO:apache_beam.runners.dataflow.dataflow_runner:2020-08-19T06:54:08.930Z: JOB_MESSAGE_DETAILED: Fusing consumer Create/MaybeReshuffle/Reshuffle/ReshufflePerKey/GroupByKey/WriteStream into Create/MaybeReshuffle/Reshuffle/ReshufflePerKey/Map(reify_timestamps)
INFO:apache_beam.runners.dataflow.dataflow_runner:2020-08-19T06:54:08.973Z: JOB_MESSAGE_DEBUG: Workflow config is missing a default resource spec.
INFO:apache_beam.runners.dataflow.dataflow_runner:2020-08-19T06:54:09.009Z: JOB_MESSAGE_DEBUG: Adding StepResource setup and teardown to workflow graph.
INFO:apache_beam.runners.dataflow.dataflow_runner:2020-08-19T06:54:09.044Z: JOB_MESSAGE_DEBUG: Adding workflow start and stop steps.
INFO:apache_beam.runners.dataflow.dataflow_runner:2020-08-19T06:54:09.077Z: JOB_MESSAGE_DEBUG: Assigning stage ids.
INFO:apache_beam.runners.dataflow.dataflow_runner:2020-08-19T06:54:11.335Z: JOB_MESSAGE_DEBUG: Starting worker pool setup.
INFO:apache_beam.runners.dataflow.dataflow_runner:2020-08-19T06:54:11.389Z: JOB_MESSAGE_DEBUG: Starting worker pool setup.
INFO:apache_beam.runners.dataflow.dataflow_runner:2020-08-19T06:54:11.422Z: JOB_MESSAGE_BASIC: Starting 1 workers in us-central1-f...
INFO:apache_beam.runners.dataflow.dataflow_runner:2020-08-19T06:54:20.234Z: JOB_MESSAGE_WARNING: Your project already contains 100 Dataflow-created metric descriptors and Stackdriver will not create new Dataflow custom metrics for this job. Each unique user-defined metric name (independent of the DoFn in which it is defined) produces a new metric descriptor. To delete old / unused metric descriptors see https://developers.google.com/apis-explorer/#p/monitoring/v3/monitoring.projects.metricDescriptors.list and https://developers.google.com/apis-explorer/#p/monitoring/v3/monitoring.projects.metricDescriptors.delete
INFO:apache_beam.runners.dataflow.dataflow_runner:2020-08-19T06:54:39.834Z: JOB_MESSAGE_DETAILED: Autoscaling: Raised the number of workers to 1 so that the pipeline can catch up with its backlog and keep up with its input rate.
INFO:apache_beam.runners.dataflow.dataflow_runner:2020-08-19T06:55:27.431Z: JOB_MESSAGE_DETAILED: Workers have started successfully.
INFO:apache_beam.runners.dataflow.dataflow_runner:2020-08-19T06:55:27.475Z: JOB_MESSAGE_DETAILED: Workers have started successfully.
INFO:apache_beam.runners.dataflow.dataflow_runner:2020-08-19T07:01:13.320Z: JOB_MESSAGE_DETAILED: Cleaning up.
INFO:apache_beam.runners.dataflow.dataflow_runner:2020-08-19T07:01:13.378Z: JOB_MESSAGE_DEBUG: Starting worker pool teardown.
INFO:apache_beam.runners.dataflow.dataflow_runner:2020-08-19T07:01:13.412Z: JOB_MESSAGE_BASIC: Stopping worker pool...
INFO:apache_beam.runners.dataflow.dataflow_runner:2020-08-19T07:01:13.449Z: JOB_MESSAGE_DEBUG: Starting worker pool teardown.
INFO:apache_beam.runners.dataflow.dataflow_runner:2020-08-19T07:01:13.482Z: JOB_MESSAGE_BASIC: Stopping worker pool...
INFO:apache_beam.runners.dataflow.dataflow_runner:2020-08-19T07:02:42.964Z: JOB_MESSAGE_DETAILED: Autoscaling: Reduced the number of workers to 0 based on low average worker CPU utilization, and the pipeline having sufficiently low backlog and keeping up with input rate.
INFO:apache_beam.runners.dataflow.dataflow_runner:2020-08-19T07:02:43.005Z: JOB_MESSAGE_BASIC: Worker pool stopped.
INFO:apache_beam.runners.dataflow.dataflow_runner:2020-08-19T07:02:43.029Z: JOB_MESSAGE_DEBUG: Tearing down pending resources...
INFO:apache_beam.runners.dataflow.dataflow_runner:Job 2020-08-18_23_53_55-12787532217488596459 is in state JOB_STATE_DONE
test_element_param (apache_beam.pipeline_test.DoFnTest) ... ok
test_key_param (apache_beam.pipeline_test.DoFnTest) ... ok

----------------------------------------------------------------------
XML: nosetests-validatesRunnerStreamingTests-df-py27.xml
----------------------------------------------------------------------
XML: <https://ci-beam.apache.org/job/beam_PostCommit_Py_VR_Dataflow_V2/ws/src/sdks/python/nosetests.xml>
----------------------------------------------------------------------
Ran 27 tests in 2201.812s

OK
Worker logs: https://console.cloud.google.com/dataflow/jobs/us-central1/2020-08-18_23_26_33-4630750653683362764?project=apache-beam-testing
Worker logs: https://console.cloud.google.com/dataflow/jobs/us-central1/2020-08-18_23_35_02-4452364394802034757?project=apache-beam-testing
Worker logs: https://console.cloud.google.com/dataflow/jobs/us-central1/2020-08-18_23_45_29-12307643470100423636?project=apache-beam-testing
Worker logs: https://console.cloud.google.com/dataflow/jobs/us-central1/2020-08-18_23_53_55-12787532217488596459?project=apache-beam-testing
Worker logs: https://console.cloud.google.com/dataflow/jobs/us-central1/2020-08-18_23_26_33-14725915909331400786?project=apache-beam-testing
Worker logs: https://console.cloud.google.com/dataflow/jobs/us-central1/2020-08-18_23_36_48-15212526752051022151?project=apache-beam-testing
Worker logs: https://console.cloud.google.com/dataflow/jobs/us-central1/2020-08-18_23_45_27-2738063425648292518?project=apache-beam-testing
Worker logs: https://console.cloud.google.com/dataflow/jobs/us-central1/2020-08-18_23_26_34-10743538550751104681?project=apache-beam-testing
Worker logs: https://console.cloud.google.com/dataflow/jobs/us-central1/2020-08-18_23_34_14-2513572765458946388?project=apache-beam-testing
Worker logs: https://console.cloud.google.com/dataflow/jobs/us-central1/2020-08-18_23_42_44-18106086086449129751?project=apache-beam-testing
Worker logs: https://console.cloud.google.com/dataflow/jobs/us-central1/2020-08-18_23_26_35-12452099069394728149?project=apache-beam-testing
Worker logs: https://console.cloud.google.com/dataflow/jobs/us-central1/2020-08-18_23_35_02-4782863470932474414?project=apache-beam-testing
Worker logs: https://console.cloud.google.com/dataflow/jobs/us-central1/2020-08-18_23_26_34-14057978560945717243?project=apache-beam-testing
Worker logs: https://console.cloud.google.com/dataflow/jobs/us-central1/2020-08-18_23_35_01-13814001621351198609?project=apache-beam-testing
Worker logs: https://console.cloud.google.com/dataflow/jobs/us-central1/2020-08-18_23_43_43-4362657244761123266?project=apache-beam-testing
Worker logs: https://console.cloud.google.com/dataflow/jobs/us-central1/2020-08-18_23_26_32-2562768231453941259?project=apache-beam-testing
Worker logs: https://console.cloud.google.com/dataflow/jobs/us-central1/2020-08-18_23_34_00-17635701278610492664?project=apache-beam-testing
Worker logs: https://console.cloud.google.com/dataflow/jobs/us-central1/2020-08-18_23_42_30-13768342825124010080?project=apache-beam-testing
Worker logs: https://console.cloud.google.com/dataflow/jobs/us-central1/2020-08-18_23_26_35-1617958518204569828?project=apache-beam-testing
Worker logs: https://console.cloud.google.com/dataflow/jobs/us-central1/2020-08-18_23_34_59-3363605271664293396?project=apache-beam-testing
Worker logs: https://console.cloud.google.com/dataflow/jobs/us-central1/2020-08-18_23_43_30-4382525450271094332?project=apache-beam-testing
Worker logs: https://console.cloud.google.com/dataflow/jobs/us-central1/2020-08-18_23_26_33-17711046316202672284?project=apache-beam-testing
Worker logs: https://console.cloud.google.com/dataflow/jobs/us-central1/2020-08-18_23_36_30-5492720047027898158?project=apache-beam-testing
Worker logs: https://console.cloud.google.com/dataflow/jobs/us-central1/2020-08-18_23_45_07-3779296490531987110?project=apache-beam-testing

FAILURE: Build failed with an exception.

* Where:
Script '<https://ci-beam.apache.org/job/beam_PostCommit_Py_VR_Dataflow_V2/ws/src/sdks/python/test-suites/dataflow/common.gradle'> line: 146

* What went wrong:
Execution failed for task ':sdks:python:test-suites:dataflow:py2:validatesRunnerBatchTests'.
> Process 'command 'sh'' finished with non-zero exit value 1

* Try:
Run with --stacktrace option to get the stack trace. Run with --info or --debug option to get more log output. Run with --scan to get full insights.

* Get more help at https://help.gradle.org

Deprecated Gradle features were used in this build, making it incompatible with Gradle 6.0.
Use '--warning-mode all' to show the individual deprecation warnings.
See https://docs.gradle.org/5.2.1/userguide/command_line_interface.html#sec:command_line_warnings

BUILD FAILED in 1h 2m 32s
65 actionable tasks: 47 executed, 18 from cache

Publishing build scan...
https://gradle.com/s/lqvw5gbw66pkc

Build step 'Invoke Gradle script' changed build result to FAILURE
Build step 'Invoke Gradle script' marked build as failure

---------------------------------------------------------------------
To unsubscribe, e-mail: builds-unsubscribe@beam.apache.org
For additional commands, e-mail: builds-help@beam.apache.org