You are viewing a plain text version of this content. The canonical link for it is here.
Posted to yarn-dev@hadoop.apache.org by Apache Jenkins Server <je...@builds.apache.org> on 2014/10/10 02:47:13 UTC
Failed: YARN-2502 PreCommit Build #5351
Jira: https://issues.apache.org/jira/browse/YARN-2502
Build: https://builds.apache.org/job/PreCommit-YARN-Build/5351/
###################################################################################
########################## LAST 60 LINES OF THE CONSOLE ###########################
[...truncated 3095 lines...]
against trunk revision d8d628d.
{color:green}+1 @author{color}. The patch does not contain any @author tags.
{color:red}-1 tests included{color}. The patch doesn't appear to include any new or modified tests.
Please justify why no new tests are needed for this patch.
Also please list what manual steps were performed to verify this patch.
{color:green}+1 javac{color}. The applied patch does not increase the total number of javac compiler warnings.
{color:green}+1 javadoc{color}. There were no new javadoc warning messages.
{color:green}+1 eclipse:eclipse{color}. The patch built with eclipse:eclipse.
{color:green}+1 findbugs{color}. The patch does not introduce any new Findbugs (version 2.0.3) warnings.
{color:red}-1 release audit{color}. The applied patch generated 1 release audit warnings.
{color:green}+1 core tests{color}. The patch passed unit tests in hadoop-yarn-project/hadoop-yarn/hadoop-yarn-applications/hadoop-yarn-applications-distributedshell.
{color:green}+1 contrib tests{color}. The patch passed contrib unit tests.
Test results: https://builds.apache.org/job/PreCommit-YARN-Build/5351//testReport/
Release audit warnings: https://builds.apache.org/job/PreCommit-YARN-Build/5351//artifact/patchprocess/patchReleaseAuditProblems.txt
Console output: https://builds.apache.org/job/PreCommit-YARN-Build/5351//console
This message is automatically generated.
======================================================================
======================================================================
Adding comment to Jira.
======================================================================
======================================================================
Comment added.
98af86ca809796754a46842e0bc0a33a372934ed logged out
======================================================================
======================================================================
Finished build.
======================================================================
======================================================================
Build step 'Execute shell' marked build as failure
Archiving artifacts
Sending artifact delta relative to PreCommit-YARN-Build #4749
Archived 16 artifacts
Archive block size is 32768
Received 0 blocks and 8233822 bytes
Compression is 0.0%
Took 2.9 sec
[description-setter] Could not determine description.
Recording test results
Email was triggered for: Failure
Sending email for trigger: Failure
###################################################################################
############################## FAILED TESTS (if any) ##############################
No tests ran.
Failed: YARN-2672 PreCommit Build #5353
Posted by Apache Jenkins Server <je...@builds.apache.org>.
Jira: https://issues.apache.org/jira/browse/YARN-2672
Build: https://builds.apache.org/job/PreCommit-YARN-Build/5353/
###################################################################################
########################## LAST 60 LINES OF THE CONSOLE ###########################
[...truncated 34 lines...]
(use "git pull" to update your local branch)
First, rewinding head to replay your work on top of it...
Fast-forwarded trunk to e532ed8faa8db4b008a5b8d3f82b48a1b314fa6c.
YARN-2672 patch is being downloaded at Fri Oct 10 01:01:12 UTC 2014 from
http://issues.apache.org/jira/secure/attachment/12674061/YARN-2672.patch
cp: cannot stat '/home/jenkins/buildSupport/lib/*': No such file or directory
======================================================================
======================================================================
Pre-build trunk to verify trunk stability and javac warnings
======================================================================
======================================================================
Compiling /home/jenkins/jenkins-slave/workspace/PreCommit-YARN-Build
/home/jenkins/tools/maven/latest/bin/mvn clean test -DskipTests -DHadoopPatchProcess -Ptest-patch > /home/jenkins/jenkins-slave/workspace/PreCommit-YARN-Build/../patchprocess/trunkJavacWarnings.txt 2>&1
/home/jenkins/tools/maven/latest/bin/mvn clean test javadoc:javadoc -DskipTests -Pdocs -DHadoopPatchProcess > /home/jenkins/jenkins-slave/workspace/PreCommit-YARN-Build/../patchprocess/trunkJavadocWarnings.txt 2>&1
/home/jenkins/jenkins-slave/workspace/PreCommit-YARN-Build/dev-support/test-patch.sh: line 306: /home/jenkins/jenkins-slave/workspace/PreCommit-YARN-Build/../patchprocess/trunkJavadocWarnings.txt: No such file or directory
Trunk javadoc compilation is broken?
{color:red}-1 overall{color}. Here are the results of testing the latest attachment
http://issues.apache.org/jira/secure/attachment/12674061/YARN-2672.patch
against trunk revision e532ed8.
{color:red}-1 patch{color}. Trunk compilation may be broken.
Console output: https://builds.apache.org/job/PreCommit-YARN-Build/5353//console
This message is automatically generated.
======================================================================
======================================================================
Adding comment to Jira.
======================================================================
======================================================================
Comment added.
911279648c216d734f5a56dbae388684ebf18f43 logged out
======================================================================
======================================================================
Finished build.
======================================================================
======================================================================
Build step 'Execute shell' marked build as failure
Archiving artifacts
[description-setter] Could not determine description.
Recording test results
Email was triggered for: Failure
Sending email for trigger: Failure
###################################################################################
############################## FAILED TESTS (if any) ##############################
No tests ran.
Failed: YARN-2501 PreCommit Build #5352
Posted by Apache Jenkins Server <je...@builds.apache.org>.
Jira: https://issues.apache.org/jira/browse/YARN-2501
Build: https://builds.apache.org/job/PreCommit-YARN-Build/5352/
###################################################################################
########################## LAST 60 LINES OF THE CONSOLE ###########################
[...truncated 3132 lines...]
{color:red}-1 overall{color}. Here are the results of testing the latest attachment
http://issues.apache.org/jira/secure/attachment/12674060/YARN-2501-20141009.1.patch
against trunk revision d8d628d.
{color:green}+1 @author{color}. The patch does not contain any @author tags.
{color:green}+1 tests included{color}. The patch appears to include 1 new or modified test files.
{color:green}+1 javac{color}. The applied patch does not increase the total number of javac compiler warnings.
{color:green}+1 javadoc{color}. There were no new javadoc warning messages.
{color:green}+1 eclipse:eclipse{color}. The patch built with eclipse:eclipse.
{color:green}+1 findbugs{color}. The patch does not introduce any new Findbugs (version 2.0.3) warnings.
{color:red}-1 release audit{color}. The applied patch generated 1 release audit warnings.
{color:green}+1 core tests{color}. The patch passed unit tests in hadoop-yarn-project/hadoop-yarn/hadoop-yarn-client.
{color:green}+1 contrib tests{color}. The patch passed contrib unit tests.
Test results: https://builds.apache.org/job/PreCommit-YARN-Build/5352//testReport/
Release audit warnings: https://builds.apache.org/job/PreCommit-YARN-Build/5352//artifact/patchprocess/patchReleaseAuditProblems.txt
Console output: https://builds.apache.org/job/PreCommit-YARN-Build/5352//console
This message is automatically generated.
======================================================================
======================================================================
Adding comment to Jira.
======================================================================
======================================================================
Comment added.
ddc2bdaab4c6a4e4f7426341e4671078d1a42592 logged out
======================================================================
======================================================================
Finished build.
======================================================================
======================================================================
Build step 'Execute shell' marked build as failure
Archiving artifacts
Sending artifact delta relative to PreCommit-YARN-Build #4749
Archived 16 artifacts
Archive block size is 32768
Received 0 blocks and 8250388 bytes
Compression is 0.0%
Took 2.9 sec
[description-setter] Could not determine description.
Recording test results
Email was triggered for: Failure
Sending email for trigger: Failure
###################################################################################
############################## FAILED TESTS (if any) ##############################
No tests ran.