You are viewing a plain text version of this content. The canonical link for it is here.
Posted to builds@beam.apache.org by Apache Jenkins Server <je...@builds.apache.org> on 2022/07/30 17:51:46 UTC

Build failed in Jenkins: beam_PostCommit_Java_Examples_Dataflow_V2_java11 #2410

See <https://ci-beam.apache.org/job/beam_PostCommit_Java_Examples_Dataflow_V2_java11/2410/display/redirect>

Changes:


------------------------------------------
[...truncated 38.47 KB...]
go: added github.com/apache/beam/sdks/v2 v2.40.0
go: added github.com/golang/protobuf v1.5.2
go: added golang.org/x/net v0.0.0-20220607020251-c690dde0001d
go: added golang.org/x/sys v0.0.0-20220520151302-bc2c85ada10a
go: added golang.org/x/text v0.3.7
go: added google.golang.org/genproto v0.0.0-20220602131408-e326c6e8e9c8
go: added google.golang.org/grpc v1.47.0
go: added google.golang.org/protobuf v1.28.0
+ go-licenses save github.com/apache/beam/sdks/v2/java/container --save_path=/output/licenses
W0730 17:45:40.321943      32 library.go:94] "golang.org/x/sys/unix" contains non-Go code that can't be inspected for further dependencies:
/go/pkg/mod/golang.org/x/sys@v0.0.0-20220520151302-bc2c85ada10a/unix/asm_linux_amd64.s
+ go-licenses csv github.com/apache/beam/sdks/v2/java/container
+ tee /output/licenses/list.csv
W0730 17:45:44.376122     189 library.go:94] "golang.org/x/sys/unix" contains non-Go code that can't be inspected for further dependencies:
/go/pkg/mod/golang.org/x/sys@v0.0.0-20220520151302-bc2c85ada10a/unix/asm_linux_amd64.s
github.com/apache/beam/sdks/v2/go/pkg/beam,https://github.com/apache/beam/blob/sdks/v2.40.0/sdks/go/README.md,Apache-2.0
github.com/apache/beam/sdks/v2/java/container,https://github.com/apache/beam/blob/sdks/v2.40.0/sdks/LICENSE,Apache-2.0
github.com/golang/protobuf,https://github.com/golang/protobuf/blob/v1.5.2/LICENSE,BSD-3-Clause
golang.org/x/net,https://cs.opensource.google/go/x/net/+/c690dde0:LICENSE,BSD-3-Clause
golang.org/x/sys,https://cs.opensource.google/go/x/sys/+/bc2c85ad:LICENSE,BSD-3-Clause
golang.org/x/text,https://cs.opensource.google/go/x/text/+/v0.3.7:LICENSE,BSD-3-Clause
google.golang.org/genproto/googleapis/rpc/status,https://github.com/googleapis/go-genproto/blob/e326c6e8e9c8/LICENSE,Apache-2.0
google.golang.org/grpc,https://github.com/grpc/grpc-go/blob/v1.47.0/LICENSE,Apache-2.0
google.golang.org/protobuf,https://github.com/protocolbuffers/protobuf-go/blob/v1.28.0/LICENSE,BSD-3-Clause
+ chmod -R a+w /output/licenses

> Task :sdks:java:container:java11:copyJavaThirdPartyLicenses

> Task :sdks:java:container:goBuild
/home/jenkins/go/bin/go1.18.1 build -o ./build/target/linux_amd64/boot boot.go boot_test.go

> Task :release:go-licenses:java:createLicenses

> Task :sdks:java:container:java11:copySdkHarnessLauncher
Execution optimizations have been disabled for task ':sdks:java:container:java11:copySdkHarnessLauncher' to ensure correctness due to the following reasons:
  - Gradle detected a problem with the following location: '<https://ci-beam.apache.org/job/beam_PostCommit_Java_Examples_Dataflow_V2_java11/ws/src/sdks/java/container/build/target'.> Reason: Task ':sdks:java:container:java11:copySdkHarnessLauncher' uses this output of task ':sdks:java:container:downloadCloudProfilerAgent' without declaring an explicit or implicit dependency. This can lead to incorrect results being produced, depending on what order the tasks are executed. Please refer to https://docs.gradle.org/7.4/userguide/validation_problems.html#implicit_dependency for more details about this problem.
  - Gradle detected a problem with the following location: '<https://ci-beam.apache.org/job/beam_PostCommit_Java_Examples_Dataflow_V2_java11/ws/src/sdks/java/container/build/target'.> Reason: Task ':sdks:java:container:java11:copySdkHarnessLauncher' uses this output of task ':sdks:java:container:pullLicenses' without declaring an explicit or implicit dependency. This can lead to incorrect results being produced, depending on what order the tasks are executed. Please refer to https://docs.gradle.org/7.4/userguide/validation_problems.html#implicit_dependency for more details about this problem.

> Task :sdks:java:container:java11:copyGolangLicenses
> Task :sdks:java:container:java11:dockerPrepare
> Task :sdks:java:container:java11:docker

> Task :runners:google-cloud-dataflow-java:buildAndPushDockerJavaContainer
WARNING: `gcloud docker` will not be supported for Docker client versions above 18.03.

As an alternative, use `gcloud auth configure-docker` to configure `docker` to
use `gcloud` as a credential helper, then use `docker` as you would for non-GCR
registries, e.g. `docker pull gcr.io/project-id/my-image`. Add
`--verbosity=error` to silence this warning: `gcloud docker
--verbosity=error -- pull gcr.io/project-id/my-image`.

See: https://cloud.google.com/container-registry/docs/support/deprecation-notices#gcloud-docker

The push refers to repository [us.gcr.io/apache-beam-testing/java-postcommit-it/java]
20ef242dd096: Preparing
d750677de200: Preparing
a6a81ef8800e: Preparing
b9c4fb5b95a1: Preparing
5ba9e5de3df6: Preparing
47298a19108b: Preparing
a450647aa15e: Preparing
ba7187ea5511: Preparing
f5ea8f1baad1: Preparing
94e5983042bd: Preparing
9254ad57db67: Preparing
75320b3eb65d: Preparing
e70e29c4566b: Preparing
2524ac20d10d: Preparing
47298a19108b: Waiting
e45c4d54067a: Preparing
d638d10edc43: Preparing
2f1e2f8ca577: Preparing
4dc3dda529a0: Preparing
7372faf8e603: Preparing
9be7f4e74e71: Preparing
f5ea8f1baad1: Waiting
a450647aa15e: Waiting
36cd374265f4: Preparing
94e5983042bd: Waiting
ba7187ea5511: Waiting
5bdeef4a08f3: Preparing
9254ad57db67: Waiting
e45c4d54067a: Waiting
9be7f4e74e71: Waiting
4dc3dda529a0: Waiting
36cd374265f4: Waiting
75320b3eb65d: Waiting
7372faf8e603: Waiting
d638d10edc43: Waiting
5bdeef4a08f3: Waiting
2524ac20d10d: Waiting
2f1e2f8ca577: Waiting
5ba9e5de3df6: Pushed
a6a81ef8800e: Pushed
d750677de200: Pushed
b9c4fb5b95a1: Pushed
20ef242dd096: Pushed
a450647aa15e: Pushed
ba7187ea5511: Pushed
f5ea8f1baad1: Pushed
94e5983042bd: Pushed
47298a19108b: Pushed
75320b3eb65d: Pushed
d638d10edc43: Layer already exists
2f1e2f8ca577: Layer already exists
4dc3dda529a0: Layer already exists
7372faf8e603: Layer already exists
9be7f4e74e71: Layer already exists
36cd374265f4: Layer already exists
5bdeef4a08f3: Layer already exists
9254ad57db67: Pushed
2524ac20d10d: Pushed
e45c4d54067a: Pushed
e70e29c4566b: Pushed
20220730174527: digest: sha256:ac4047840250fabb97c934d41e09e6390e024382eb9fbcafda13dfb9073cc4f5 size: 4935

> Task :runners:google-cloud-dataflow-java:examplesJavaRunnerV2IntegrationTest
Could not stop org.gradle.internal.actor.internal.DefaultActorFactory$NonBlockingActor@7ab38a2e.
org.gradle.internal.dispatch.DispatchException: Could not dispatch message [MethodInvocation method: stop()].
	at org.gradle.internal.dispatch.ExceptionTrackingFailureHandler.dispatchFailed(ExceptionTrackingFailureHandler.java:35)
	at org.gradle.internal.dispatch.FailureHandlingDispatch.dispatch(FailureHandlingDispatch.java:32)
	at org.gradle.internal.dispatch.AsyncDispatch.dispatchMessages(AsyncDispatch.java:87)
	at org.gradle.internal.dispatch.AsyncDispatch.access$000(AsyncDispatch.java:36)
	at org.gradle.internal.dispatch.AsyncDispatch$1.run(AsyncDispatch.java:71)
	at org.gradle.internal.concurrent.InterruptibleRunnable.run(InterruptibleRunnable.java:42)
	at org.gradle.internal.operations.CurrentBuildOperationPreservingRunnable.run(CurrentBuildOperationPreservingRunnable.java:42)
	at org.gradle.internal.concurrent.ExecutorPolicy$CatchAndRecordFailures.onExecute(ExecutorPolicy.java:64)
	at org.gradle.internal.concurrent.ManagedExecutorImpl$1.run(ManagedExecutorImpl.java:48)
	at java.util.concurrent.ThreadPoolExecutor.runWorker(ThreadPoolExecutor.java:1149)
	at java.util.concurrent.ThreadPoolExecutor$Worker.run(ThreadPoolExecutor.java:624)
	at java.lang.Thread.run(Thread.java:748)
Caused by: org.gradle.process.internal.ExecException: Process 'Gradle Test Executor 2' finished with non-zero exit value 143
This problem might be caused by incorrect test process configuration.
Please refer to the test execution section in the User Manual at https://docs.gradle.org/7.4/userguide/java_testing.html#sec:test_execution
	at org.gradle.api.internal.tasks.testing.worker.ForkingTestClassProcessor.stop(ForkingTestClassProcessor.java:186)
	at org.gradle.api.internal.tasks.testing.processors.RestartEveryNTestClassProcessor.endBatch(RestartEveryNTestClassProcessor.java:77)
	at org.gradle.api.internal.tasks.testing.processors.RestartEveryNTestClassProcessor.stop(RestartEveryNTestClassProcessor.java:62)
	at sun.reflect.NativeMethodAccessorImpl.invoke0(Native Method)
	at sun.reflect.NativeMethodAccessorImpl.invoke(NativeMethodAccessorImpl.java:62)
	at sun.reflect.DelegatingMethodAccessorImpl.invoke(DelegatingMethodAccessorImpl.java:43)
	at java.lang.reflect.Method.invoke(Method.java:498)
	at org.gradle.internal.dispatch.ReflectionDispatch.dispatch(ReflectionDispatch.java:36)
	at org.gradle.internal.dispatch.ReflectionDispatch.dispatch(ReflectionDispatch.java:24)
	at org.gradle.internal.dispatch.FailureHandlingDispatch.dispatch(FailureHandlingDispatch.java:30)
	... 10 more
Could not stop org.gradle.internal.actor.internal.DefaultActorFactory$NonBlockingActor@24c8eee6.
org.gradle.internal.dispatch.DispatchException: Could not dispatch message [MethodInvocation method: stop()].
	at org.gradle.internal.dispatch.ExceptionTrackingFailureHandler.dispatchFailed(ExceptionTrackingFailureHandler.java:35)
	at org.gradle.internal.dispatch.FailureHandlingDispatch.dispatch(FailureHandlingDispatch.java:32)
	at org.gradle.internal.dispatch.AsyncDispatch.dispatchMessages(AsyncDispatch.java:87)
	at org.gradle.internal.dispatch.AsyncDispatch.access$000(AsyncDispatch.java:36)
	at org.gradle.internal.dispatch.AsyncDispatch$1.run(AsyncDispatch.java:71)
	at org.gradle.internal.concurrent.InterruptibleRunnable.run(InterruptibleRunnable.java:42)
	at org.gradle.internal.operations.CurrentBuildOperationPreservingRunnable.run(CurrentBuildOperationPreservingRunnable.java:42)
	at org.gradle.internal.concurrent.ExecutorPolicy$CatchAndRecordFailures.onExecute(ExecutorPolicy.java:64)
	at org.gradle.internal.concurrent.ManagedExecutorImpl$1.run(ManagedExecutorImpl.java:48)
	at java.util.concurrent.ThreadPoolExecutor.runWorker(ThreadPoolExecutor.java:1149)
	at java.util.concurrent.ThreadPoolExecutor$Worker.run(ThreadPoolExecutor.java:624)
	at java.lang.Thread.run(Thread.java:748)
Caused by: org.gradle.process.internal.ExecException: Process 'Gradle Test Executor 1' finished with non-zero exit value 143
This problem might be caused by incorrect test process configuration.
Please refer to the test execution section in the User Manual at https://docs.gradle.org/7.4/userguide/java_testing.html#sec:test_execution
	at org.gradle.api.internal.tasks.testing.worker.ForkingTestClassProcessor.stop(ForkingTestClassProcessor.java:186)
	at org.gradle.api.internal.tasks.testing.processors.RestartEveryNTestClassProcessor.endBatch(RestartEveryNTestClassProcessor.java:77)
	at org.gradle.api.internal.tasks.testing.processors.RestartEveryNTestClassProcessor.stop(RestartEveryNTestClassProcessor.java:62)
	at sun.reflect.NativeMethodAccessorImpl.invoke0(Native Method)
	at sun.reflect.NativeMethodAccessorImpl.invoke(NativeMethodAccessorImpl.java:62)
	at sun.reflect.DelegatingMethodAccessorImpl.invoke(DelegatingMethodAccessorImpl.java:43)
	at java.lang.reflect.Method.invoke(Method.java:498)
	at org.gradle.internal.dispatch.ReflectionDispatch.dispatch(ReflectionDispatch.java:36)
	at org.gradle.internal.dispatch.ReflectionDispatch.dispatch(ReflectionDispatch.java:24)
	at org.gradle.internal.dispatch.FailureHandlingDispatch.dispatch(FailureHandlingDispatch.java:30)
	... 10 more
Could not stop org.gradle.internal.actor.internal.DefaultActorFactory$NonBlockingActor@175346ad.
org.gradle.internal.dispatch.DispatchException: Could not dispatch message [MethodInvocation method: stop()].
	at org.gradle.internal.dispatch.ExceptionTrackingFailureHandler.dispatchFailed(ExceptionTrackingFailureHandler.java:35)
	at org.gradle.internal.dispatch.FailureHandlingDispatch.dispatch(FailureHandlingDispatch.java:32)
	at org.gradle.internal.dispatch.AsyncDispatch.dispatchMessages(AsyncDispatch.java:87)
	at org.gradle.internal.dispatch.AsyncDispatch.access$000(AsyncDispatch.java:36)
	at org.gradle.internal.dispatch.AsyncDispatch$1.run(AsyncDispatch.java:71)
	at org.gradle.internal.concurrent.InterruptibleRunnable.run(InterruptibleRunnable.java:42)
	at org.gradle.internal.operations.CurrentBuildOperationPreservingRunnable.run(CurrentBuildOperationPreservingRunnable.java:42)
	at org.gradle.internal.concurrent.ExecutorPolicy$CatchAndRecordFailures.onExecute(ExecutorPolicy.java:64)
	at org.gradle.internal.concurrent.ManagedExecutorImpl$1.run(ManagedExecutorImpl.java:48)
	at java.util.concurrent.ThreadPoolExecutor.runWorker(ThreadPoolExecutor.java:1149)
	at java.util.concurrent.ThreadPoolExecutor$Worker.run(ThreadPoolExecutor.java:624)
	at java.lang.Thread.run(Thread.java:748)
Caused by: org.gradle.process.internal.ExecException: Process 'Gradle Test Executor 3' finished with non-zero exit value 143
This problem might be caused by incorrect test process configuration.
Please refer to the test execution section in the User Manual at https://docs.gradle.org/7.4/userguide/java_testing.html#sec:test_execution
	at org.gradle.api.internal.tasks.testing.worker.ForkingTestClassProcessor.stop(ForkingTestClassProcessor.java:186)
	at org.gradle.api.internal.tasks.testing.processors.RestartEveryNTestClassProcessor.endBatch(RestartEveryNTestClassProcessor.java:77)
	at org.gradle.api.internal.tasks.testing.processors.RestartEveryNTestClassProcessor.stop(RestartEveryNTestClassProcessor.java:62)
	at sun.reflect.NativeMethodAccessorImpl.invoke0(Native Method)
	at sun.reflect.NativeMethodAccessorImpl.invoke(NativeMethodAccessorImpl.java:62)
	at sun.reflect.DelegatingMethodAccessorImpl.invoke(DelegatingMethodAccessorImpl.java:43)
	at java.lang.reflect.Method.invoke(Method.java:498)
	at org.gradle.internal.dispatch.ReflectionDispatch.dispatch(ReflectionDispatch.java:36)
	at org.gradle.internal.dispatch.ReflectionDispatch.dispatch(ReflectionDispatch.java:24)
	at org.gradle.internal.dispatch.FailureHandlingDispatch.dispatch(FailureHandlingDispatch.java:30)
	... 10 more

> Task :runners:google-cloud-dataflow-java:examplesJavaRunnerV2IntegrationTest FAILED
The message received from the daemon indicates that the daemon has disappeared.
Build request sent: Build{id=349ea8b0-f4e2-4217-a839-a0fd5c7bcb69, currentDir=<https://ci-beam.apache.org/job/beam_PostCommit_Java_Examples_Dataflow_V2_java11/ws/src}>
Attempting to read last messages from the daemon log...
Daemon pid: 2928648
  log file: /home/jenkins/.gradle/daemon/7.4/daemon-2928648.out.log
----- Last  20 lines from daemon log file - daemon-2928648.out.log -----
	at org.gradle.internal.dispatch.FailureHandlingDispatch.dispatch(FailureHandlingDispatch.java:30)
	... 10 more
Untagged: us.gcr.io/apache-beam-testing/java-postcommit-it/java:20220730174527
Untagged: us.gcr.io/apache-beam-testing/java-postcommit-it/java@sha256:ac4047840250fabb97c934d41e09e6390e024382eb9fbcafda13dfb9073cc4f5
Daemon vm is shutting down... The daemon has exited normally or was terminated in response to a user interrupt.
Remove shutdown hook failed
java.lang.IllegalStateException: Shutdown in progress
	at java.lang.ApplicationShutdownHooks.remove(ApplicationShutdownHooks.java:82)
	at java.lang.Runtime.removeShutdownHook(Runtime.java:239)
	at org.gradle.process.internal.shutdown.ShutdownHooks.removeShutdownHook(ShutdownHooks.java:38)
	at org.gradle.process.internal.DefaultExecHandle.setEndStateInfo(DefaultExecHandle.java:208)
	at org.gradle.process.internal.DefaultExecHandle.aborted(DefaultExecHandle.java:365)
	at org.gradle.process.internal.ExecHandleRunner.completed(ExecHandleRunner.java:108)
	at org.gradle.process.internal.ExecHandleRunner.run(ExecHandleRunner.java:84)
	at org.gradle.internal.operations.CurrentBuildOperationPreservingRunnable.run(CurrentBuildOperationPreservingRunnable.java:42)
	at org.gradle.internal.concurrent.ExecutorPolicy$CatchAndRecordFailures.onExecute(ExecutorPolicy.java:64)
	at org.gradle.internal.concurrent.ManagedExecutorImpl$1.run(ManagedExecutorImpl.java:48)
	at java.util.concurrent.ThreadPoolExecutor.runWorker(ThreadPoolExecutor.java:1149)
	at java.util.concurrent.ThreadPoolExecutor$Worker.run(ThreadPoolExecutor.java:624)
	at java.lang.Thread.run(Thread.java:748)
----- End of the daemon log -----


FAILURE: Build failed with an exception.

* What went wrong:
Gradle build daemon disappeared unexpectedly (it may have been killed or may have crashed)

* Try:
> Run with --stacktrace option to get the stack trace.
> Run with --info or --debug option to get more log output.
> Run with --scan to get full insights.

* Get more help at https://help.gradle.org

> Task :runners:google-cloud-dataflow-java:cleanUpDockerJavaImages
Untagged: us.gcr.io/apache-beam-testing/java-postcommit-it/java:20220730174527
Untagged: us.gcr.io/apache-beam-testing/java-postcommit-it/java@sha256:ac4047840250fabb97c934d41e09e6390e024382eb9fbcafda13dfb9073cc4f5
Build step 'Invoke Gradle script' changed build result to FAILURE
Build step 'Invoke Gradle script' marked build as failure

---------------------------------------------------------------------
To unsubscribe, e-mail: builds-unsubscribe@beam.apache.org
For additional commands, e-mail: builds-help@beam.apache.org


Jenkins build is back to normal : beam_PostCommit_Java_Examples_Dataflow_V2_java11 #2411

Posted by Apache Jenkins Server <je...@builds.apache.org>.
See <https://ci-beam.apache.org/job/beam_PostCommit_Java_Examples_Dataflow_V2_java11/2411/display/redirect>


---------------------------------------------------------------------
To unsubscribe, e-mail: builds-unsubscribe@beam.apache.org
For additional commands, e-mail: builds-help@beam.apache.org