You are viewing a plain text version of this content. The canonical link for it is here.
Posted to issues@ozone.apache.org by "Chung En Lee (Jira)" <ji...@apache.org> on 2025/10/21 20:56:01 UTC
[jira] [Updated] (HDDS-11564) Intermittent failure in TestBlockOutputStream
[ https://issues.apache.org/jira/browse/HDDS-11564?page=com.atlassian.jira.plugin.system.issuetabpanels:all-tabpanel ]
Chung En Lee updated HDDS-11564:
--------------------------------
Target Version/s: 2.2.0
2.2.0 (was: 2.1.0)
<<Bulk update>>
Apache Ozone 2.1.0 release is in progress. I'm updating all unresolved jiras targeting 2.1.0 to retarget 2.2.0.
> Intermittent failure in TestBlockOutputStream
> ---------------------------------------------
>
> Key: HDDS-11564
> URL: https://issues.apache.org/jira/browse/HDDS-11564
> Project: Apache Ozone
> Issue Type: Sub-task
> Reporter: Attila Doroszlai
> Assignee: Wei-Chiu Chuang
> Priority: Major
>
> {code}
> Tests run: 24, Failures: 1, Errors: 0, Skipped: 0, Time elapsed: 26.951 s <<< FAILURE! - in org.apache.hadoop.ozone.client.rpc.TestBlockOutputStream
> org.apache.hadoop.ozone.client.rpc.TestBlockOutputStream.testWriteMoreThanMaxFlushSize(boolean, boolean)[2] Time elapsed: 0.071 s <<< FAILURE!
> org.opentest4j.AssertionFailedError: expected: <0> but was: <1>
> ...
> at org.junit.jupiter.api.Assertions.assertEquals(Assertions.java:632)
> at org.apache.hadoop.ozone.client.rpc.TestBlockOutputStream.testWriteMoreThanMaxFlushSize(TestBlockOutputStream.java:729)
> {code}
> {code}
> Tests run: 24, Failures: 1, Errors: 0, Skipped: 0, Time elapsed: 24.3 s <<< FAILURE! - in org.apache.hadoop.ozone.client.rpc.TestBlockOutputStream
> org.apache.hadoop.ozone.client.rpc.TestBlockOutputStream.testWriteMoreThanFlushSize(boolean, boolean)[3] Time elapsed: 0.051 s <<< FAILURE!
> org.opentest4j.AssertionFailedError: expected: <250> but was: <50>
> ...
> at org.junit.jupiter.api.Assertions.assertEquals(Assertions.java:632)
> at org.apache.hadoop.ozone.client.rpc.TestBlockOutputStream.testWriteMoreThanFlushSize(TestBlockOutputStream.java:543)
> {code}
> {code}
> Tests run: 24, Failures: 1, Errors: 0, Skipped: 0, Time elapsed: 28.79 s <<< FAILURE! - in org.apache.hadoop.ozone.client.rpc.TestBlockOutputStream
> org.apache.hadoop.ozone.client.rpc.TestBlockOutputStream.testWriteExactlyMaxFlushSize(boolean, boolean)[3] Time elapsed: 0.079 s <<< FAILURE!
> org.opentest4j.AssertionFailedError: expected: <4> but was: <3>
> ...
> at org.junit.jupiter.api.Assertions.assertEquals(Assertions.java:531)
> at org.apache.hadoop.ozone.client.rpc.TestBlockOutputStream.testWriteExactlyMaxFlushSize(TestBlockOutputStream.java:611)
> {code}
> {code}
> Tests run: 24, Failures: 1, Errors: 0, Skipped: 0, Time elapsed: 29.929 s <<< FAILURE! - in org.apache.hadoop.ozone.client.rpc.TestBlockOutputStream
> org.apache.hadoop.ozone.client.rpc.TestBlockOutputStream.testWriteExactlyFlushSize(boolean, boolean)[1] Time elapsed: 0.078 s <<< FAILURE!
> org.opentest4j.AssertionFailedError: expected: <1> but was: <0>
> ...
> at org.junit.jupiter.api.Assertions.assertEquals(Assertions.java:531)
> at org.apache.hadoop.ozone.client.rpc.TestBlockOutputStream.testWriteExactlyFlushSize(TestBlockOutputStream.java:365)
> {code}
--
This message was sent by Atlassian Jira
(v8.20.10#820010)
---------------------------------------------------------------------
To unsubscribe, e-mail: issues-unsubscribe@ozone.apache.org
For additional commands, e-mail: issues-help@ozone.apache.org