You are viewing a plain text version of this content. The canonical link for it is here.
Posted to dev@jmeter.apache.org by Apache Jenkins Server <je...@builds.apache.org> on 2022/07/23 15:28:34 UTC
Build failed in Jenkins: JMeter » JMeter Ubuntu #323
See <https://ci-builds.apache.org/job/JMeter/job/JMeter%20Ubuntu/323/display/redirect?page=changes>
Changes:
[Felix Schumacher] Update XPathUtilTest.java
[Felix Schumacher] Update XPathUtilTest.java
[Felix Schumacher] Add test for broken xpath in XPathUtil#selectNodeList
------------------------------------------
[...truncated 196.80 KB...]
No errors present in the logfile <https://ci-builds.apache.org/job/JMeter/job/JMeter%20Ubuntu/ws/bin/Bug56811.log> (the file is empty)
> Task :src:protocol:http:compileTestGroovy
> Task :src:protocol:http:testClasses
> Task :src:protocol:http:testJar UP-TO-DATE
> Task :src:protocol:http:spotbugsTest SKIPPED
> Task :src:dist-check:batchBug62239
Creating summariser <summary>
Created the tree successfully using <https://ci-builds.apache.org/job/JMeter/job/JMeter%20Ubuntu/ws/bin/testfiles/Bug62239.jmx>
Starting standalone test @ July 23, 2022 3:27:33 PM UTC (1658590053979)
Waiting for possible Shutdown/StopTestNow/HeapDump/ThreadDump message on port 4445
summary + 1 in 00:00:00 = 7.5/s Avg: 3 Min: 3 Max: 3 Err: 0 (0.00%) Active: 1 Started: 1 Finished: 0
summary + 107 in 00:00:00 = 497.7/s Avg: 0 Min: 0 Max: 1 Err: 0 (0.00%) Active: 0 Started: 6 Finished: 6
summary = 108 in 00:00:00 = 310.3/s Avg: 0 Min: 0 Max: 3 Err: 0 (0.00%)
Tidying up ... @ July 23, 2022 3:27:34 PM UTC (1658590054432)
... end of run
No errors present in the logfile <https://ci-builds.apache.org/job/JMeter/job/JMeter%20Ubuntu/ws/bin/Bug62239.log> (the file is empty)
> Task :src:protocol:http:test
Gradle Test Executor 20 STANDARD_OUT
Setting JMeterHome: <https://ci-builds.apache.org/job/JMeter/job/JMeter%20Ubuntu/ws/src/protocol/http/../../../.>
Initializing Properties: ../../.././bin/jmeter.properties
JMeterVersion=5.5.1-SNAPSHOT b73f690
java.version=1.8.0_291
java.vm.name=Java HotSpot(TM) 64-Bit Server VM
java.vendor=Oracle Corporation
java.home=/usr/local/asfpackages/java/oraclejdk-1.8.0-291/jre
file.encoding=ISO-8859-1
default encoding=ISO-8859-1
user.home=/home/jenkins
user.dir=<https://ci-builds.apache.org/job/JMeter/job/JMeter%20Ubuntu/ws/src/protocol/http>
user.language=en
user.region=null
user.country=US
user.variant=
Locale=en_US
java.class.version=52.0
java.awt.headless=true
os.name=Linux
os.version=4.15.0-112-generic
os.arch=amd64
0.4sec, 12 completed, 0 failed, 0 skipped, org.apache.jmeter.protocol.http.control.DNSCacheManagerSpec
0.1sec, 8 completed, 0 failed, 0 skipped, getEncoding returns #expectedEncoding from #contentType
0.0sec, 7 completed, 0 failed, 0 skipped, makeRelativeURL works with a trailing file
0.0sec, 7 completed, 0 failed, 0 skipped, makeRelativeURL works with a trailing directory
0.1sec, 4 completed, 0 failed, 0 skipped, makeRelativeURL given invalid path '#path' returns '#path'
0.0sec, 17 completed, 0 failed, 0 skipped, removeSlashDotDot given a url or path #urlOrPath returns #expectedUrl
0.0sec, 15 completed, 0 failed, 0 skipped, testSanitizeUrl
0.2sec, 58 completed, 0 failed, 0 skipped, org.apache.jmeter.protocol.http.util.HTTPUtilsSpec
0.4sec, 66 completed, 0 failed, 0 skipped, org.apache.jmeter.curl.BasicCurlParserTest
1.1sec, 5 completed, 0 failed, 0 skipped, org.apache.jmeter.protocol.http.sampler.TestHTTPHC4Impl
1.6sec, 22 completed, 0 failed, 0 skipped, org.apache.jmeter.gui.action.ParseCurlCommandActionTest
0.1sec, 2 completed, 0 failed, 0 skipped, testParseArgumentsQuotingStyle(String, String, HTTPFileArgs, List)
0.1sec, 5 completed, 0 failed, 0 skipped, org.apache.jmeter.protocol.http.config.MultipartUrlConfigTest
0.0sec, 2 completed, 0 failed, 0 skipped, org.apache.jmeter.protocol.http.config.UrlConfigTest
2.3sec, 10 completed, 0 failed, 0 skipped, org.apache.jmeter.protocol.http.proxy.TestHttpRequestHdr
[0;1m 2.2sec[0m, org.apache.jmeter.protocol.http.control.[0;1mTestCacheManagerUrlConnection[0m > [0;1mtestExpiresBug59962()[0m
[0;1m 2.2sec[0m, org.apache.jmeter.protocol.http.control.[0;1mTestCacheManagerHC4[0m > [0;1mtestExpiresBug59962()[0m
[0;1m 2.4sec[0m, org.apache.jmeter.protocol.http.control.[0;1mTestCacheManagerHC4[0m > [0;1mtestCacheHttpClientBug51932()[0m
[0;1m 2.3sec[0m, org.apache.jmeter.protocol.http.control.[0;1mTestCacheManagerHC4[0m > [0;1mtestExpires()[0m
[0;1m 2.2sec[0m, org.apache.jmeter.protocol.http.control.[0;1mTestCacheManagerUrlConnection[0m > [0;1mtestCacheControl()[0m
[0;1m 2.2sec[0m, org.apache.jmeter.protocol.http.control.[0;1mTestCacheManagerHC4[0m > [0;1mtestPrivateCache()[0m
[0;1m 2.2sec[0m, org.apache.jmeter.protocol.http.control.[0;1mTestCacheManagerUrlConnection[0m > [0;1mtestExpires()[0m
[0;1m 2.4sec[0m, org.apache.jmeter.protocol.http.control.[0;1mTestCacheManagerUrlConnection[0m > [0;1mtestCacheHttpClientBug51932()[0m
[0;1m 2.4sec[0m, org.apache.jmeter.protocol.http.control.[0;1mTestCacheManagerUrlConnection[0m > [0;1mtestPrivateCache()[0m
[0;1m 2.2sec[0m, org.apache.jmeter.protocol.http.control.[0;1mTestCacheManagerHC4[0m > [0;1mtestCacheControl()[0m
[0;1m 2.2sec[0m, org.apache.jmeter.protocol.http.control.[0;1mTestCacheManagerUrlConnection[0m > [0;1mtestPrivateCacheExpireNoMaxAge()[0m
> Task :src:dist-check:batchFTP_TESTS
Creating summariser <summary>
Created the tree successfully using <https://ci-builds.apache.org/job/JMeter/job/JMeter%20Ubuntu/ws/bin/testfiles/FTP_TESTS.jmx>
Starting standalone test @ July 23, 2022 3:27:36 PM UTC (1658590056334)
Waiting for possible Shutdown/StopTestNow/HeapDump/ThreadDump message on port 4445
summary = 6 in 00:00:03 = 1.9/s Avg: 334 Min: 12 Max: 1773 Err: 0 (0.00%)
Tidying up ... @ July 23, 2022 3:27:40 PM UTC (1658590060481)
... end of run
No errors present in the logfile <https://ci-builds.apache.org/job/JMeter/job/JMeter%20Ubuntu/ws/bin/FTP_TESTS.log> (the file is empty)
> Task :src:protocol:http:test
[0;1m 2.5sec[0m, org.apache.jmeter.protocol.http.control.[0;1mTestCacheManagerHC4[0m > [0;1mtestPrivateCacheExpireNoMaxAge()[0m
[0;1m 4.2sec[0m, org.apache.jmeter.protocol.http.control.[0;1mTestCacheManagerHC4[0m > [0;1mtestNoCacheControlNoMaxAgeNoExpire()[0m
[0;1m 4.2sec[0m, org.apache.jmeter.protocol.http.control.[0;1mTestCacheManagerUrlConnection[0m > [0;1mtestNoCacheControlNoMaxAgeNoExpire()[0m
> Task :src:dist-check:batchHTMLParserTestFile_2
Creating summariser <summary>
Created the tree successfully using <https://ci-builds.apache.org/job/JMeter/job/JMeter%20Ubuntu/ws/bin/testfiles/HTMLParserTestFile_2.jmx>
Starting standalone test @ July 23, 2022 3:27:42 PM UTC (1658590062625)
Waiting for possible Shutdown/StopTestNow/HeapDump/ThreadDump message on port 4445
summary = 1 in 00:00:00 = 4.4/s Avg: 113 Min: 113 Max: 113 Err: 0 (0.00%)
Tidying up ... @ July 23, 2022 3:27:43 PM UTC (1658590063316)
... end of run
No errors present in the logfile <https://ci-builds.apache.org/job/JMeter/job/JMeter%20Ubuntu/ws/bin/HTMLParserTestFile_2.log> (the file is empty)
> Task :src:dist-check:batchHttp4ImplDigestAuth SKIPPED
> Task :src:protocol:http:test
[0;1m 5.0sec[0m, org.apache.jmeter.protocol.http.control.[0;1mTestCacheManagerUrlConnection[0m > [0;1mtestPrivateCacheNoMaxAgeNoExpire()[0m
[0;1m 5.0sec[0m, org.apache.jmeter.protocol.http.control.[0;1mTestCacheManagerHC4[0m > [0;1mtestPrivateCacheNoMaxAgeNoExpire()[0m
7.3sec, 25 completed, 0 failed, 0 skipped, org.apache.jmeter.protocol.http.control.TestCacheManagerUrlConnection
7.3sec, 26 completed, 0 failed, 0 skipped, org.apache.jmeter.protocol.http.control.TestCacheManagerHC4
[0;1m 6.4sec[0m, org.apache.jmeter.protocol.http.control.[0;1mDnsManagerTest[0m > [0;1mbadDnsInCustomResolverShouldFailHttpSampler(String,[0m WireMockServer)[1], [1] HttpClient4
[0;34;1mWARNING[0m 6.4sec, 2 completed, 0 failed, [0;34;1m 1[0m skipped, [0;34;1mbadDnsInCustomResolverShouldFailHttpSampler(String, WireMockServer)[0m
[0;34;1mWARNING[0m 7.3sec, 2 completed, 0 failed, [0;34;1m 1[0m skipped, org.apache.jmeter.protocol.http.control.[0;34;1mDnsManagerTest[0m
0.0sec, 6 completed, 0 failed, 0 skipped, org.apache.jmeter.protocol.http.control.TestAuthManager
0.0sec, 2 completed, 0 failed, 0 skipped, org.apache.jmeter.protocol.http.control.TestAuthManagerThreadIteration
0.0sec, 1 completed, 0 failed, 0 skipped, org.apache.jmeter.protocol.http.control.TestAuthorization
0.1sec, 5 completed, 0 failed, 0 skipped, org.apache.jmeter.protocol.http.control.TestCacheManagerThreadIteration
0.1sec, 4 completed, 0 failed, 0 skipped, org.apache.jmeter.protocol.http.control.TestCookieManagerThreadIteration
0.1sec, 33 completed, 0 failed, 0 skipped, org.apache.jmeter.protocol.http.control.TestHC4CookieManager
0.0sec, 1 completed, 0 failed, 0 skipped, org.apache.jmeter.protocol.http.control.gui.TestHttpTestSampleGui
0.4sec, 18 completed, 0 failed, 0 skipped, org.apache.jmeter.protocol.http.modifier.TestAnchorModifier
0.0sec, 17 completed, 0 failed, 0 skipped, org.apache.jmeter.protocol.http.modifier.TestURLRewritingModifier
0.0sec, 2 completed, 0 failed, 0 skipped, org.apache.jmeter.protocol.http.parser.TestBaseParser
0.3sec, 50 completed, 0 failed, 0 skipped, testGetEmbeddedResourceURLsStringByteArrayURLURLCollectionString(HTMLParser, String, Collection)
0.3sec, 50 completed, 0 failed, 0 skipped, org.apache.jmeter.protocol.http.parser.TestBug60842HtmlParser
0.3sec, 4 completed, 0 failed, 0 skipped, org.apache.jmeter.protocol.http.parser.TestCssParser
0.0sec, 6 completed, 0 failed, 0 skipped, org.apache.jmeter.protocol.http.parser.TestHtmlParsingUtils
0.2sec, 7 completed, 0 failed, 0 skipped, org.apache.jmeter.protocol.http.proxy.TestProxyControl
0.1sec, 1 completed, 0 failed, 0 skipped, org.apache.jmeter.protocol.http.sampler.PackageTest
0.6sec, 16 completed, 0 failed, 0 skipped, test(String, String, InetAddress, WireMockServer, JMeterVariables, TestInfo)
0.6sec, 16 completed, 0 failed, 0 skipped, org.apache.jmeter.protocol.http.sampler.ParallelResourcesAndIpSource
0.1sec, 8 completed, 0 failed, 0 skipped, org.apache.jmeter.protocol.http.sampler.PostWriterTest
0.0sec, 2 completed, 0 failed, 0 skipped, org.apache.jmeter.protocol.http.sampler.PutWriterTest
[0;1m 3.6sec[0m, org.apache.jmeter.protocol.http.sampler.[0;1mSamplingNamingTest[0m > [0;1mtestBug63364(String)[0m[1], Run 1: implementation:HttpClient4
> Task :src:dist-check:batchHttp4ImplPreemptiveBasicAuth
Creating summariser <summary>
Created the tree successfully using <https://ci-builds.apache.org/job/JMeter/job/JMeter%20Ubuntu/ws/bin/testfiles/Http4ImplPreemptiveBasicAuth.jmx>
Starting standalone test @ July 23, 2022 3:27:45 PM UTC (1658590065469)
Waiting for possible Shutdown/StopTestNow/HeapDump/ThreadDump message on port 4445
summary = 12 in 00:00:07 = 1.7/s Avg: 259 Min: 83 Max: 929 Err: 0 (0.00%)
Tidying up ... @ July 23, 2022 3:27:53 PM UTC (1658590073174)
... end of run
No errors present in the logfile <https://ci-builds.apache.org/job/JMeter/job/JMeter%20Ubuntu/ws/bin/Http4ImplPreemptiveBasicAuth.log> (the file is empty)
> Task :src:dist-check:batchHttp4ImplPreemptiveBasicAuthJava SKIPPED
> Task :src:protocol:http:test
[0;1m 2.7sec[0m, org.apache.jmeter.protocol.http.sampler.[0;1mSamplingNamingTest[0m > [0;1mtestBug63364(String)[0m[2], Run 2: implementation:Java
6.3sec, 2 completed, 0 failed, 0 skipped, testBug63364(String)
6.3sec, 2 completed, 0 failed, 0 skipped, org.apache.jmeter.protocol.http.sampler.SamplingNamingTest
0.2sec, 8 completed, 0 failed, 0 skipped, mockServer(String, ClientGzip, ServerGzip)
0.2sec, 8 completed, 0 failed, 0 skipped, org.apache.jmeter.protocol.http.sampler.TestDecompression
0.0sec, 18 completed, 0 failed, 0 skipped, org.apache.jmeter.protocol.http.sampler.TestHTTPSamplers
0.0sec, 2 completed, 0 failed, 0 skipped, org.apache.jmeter.protocol.http.sampler.TestHttpWebdav
> Task :src:dist-check:batchJDBC_TESTS
Creating summariser <summary>
Created the tree successfully using <https://ci-builds.apache.org/job/JMeter/job/JMeter%20Ubuntu/ws/bin/testfiles/JDBC_TESTS.jmx>
Starting standalone test @ July 23, 2022 3:27:55 PM UTC (1658590075109)
Waiting for possible Shutdown/StopTestNow/HeapDump/ThreadDump message on port 4445
summary = 27 in 00:00:02 = 15.0/s Avg: 28 Min: 0 Max: 714 Err: 0 (0.00%)
Tidying up ... @ July 23, 2022 3:27:58 PM UTC (1658590078070)
... end of run
WARNING: the task was configured to ignore errors in the output log
Logfile contents (errors during the test, see <https://ci-builds.apache.org/job/JMeter/job/JMeter%20Ubuntu/ws/bin/JDBC_TESTS.log)>:
2022-07-23 15:27:58,040 ERROR o.a.j.t.JMeterThread: Error while processing sampler: 'JDBC_With_Failing_PreProcessor'.
java.lang.IllegalArgumentException: Name for DataSoure must not be empty in JDBC PreProcessor
at org.apache.jmeter.protocol.jdbc.processor.AbstractJDBCProcessor.process(AbstractJDBCProcessor.java:44) ~[ApacheJMeter_jdbc.jar:5.5.1-SNAPSHOT]
at org.apache.jmeter.protocol.jdbc.processor.JDBCPreProcessor.process(JDBCPreProcessor.java:34) ~[ApacheJMeter_jdbc.jar:5.5.1-SNAPSHOT]
at org.apache.jmeter.threads.JMeterThread.runPreProcessors(JMeterThread.java:978) ~[ApacheJMeter_core.jar:5.5.1-SNAPSHOT]
at org.apache.jmeter.threads.JMeterThread.executeSamplePackage(JMeterThread.java:561) ~[ApacheJMeter_core.jar:5.5.1-SNAPSHOT]
at org.apache.jmeter.threads.JMeterThread.processSampler(JMeterThread.java:501) ~[ApacheJMeter_core.jar:5.5.1-SNAPSHOT]
at org.apache.jmeter.threads.JMeterThread.run(JMeterThread.java:268) ~[ApacheJMeter_core.jar:5.5.1-SNAPSHOT]
at java.lang.Thread.run(Thread.java:748) ~[?:1.8.0_291]
2022-07-23 15:27:58,048 ERROR o.a.j.t.JMeterThread: Error while processing sampler: 'JDBC_With_Failing_PostProcessor'.
java.lang.IllegalArgumentException: Name for DataSoure must not be empty in JDBC PostProcessor
at org.apache.jmeter.protocol.jdbc.processor.AbstractJDBCProcessor.process(AbstractJDBCProcessor.java:44) ~[ApacheJMeter_jdbc.jar:5.5.1-SNAPSHOT]
at org.apache.jmeter.protocol.jdbc.processor.JDBCPostProcessor.process(JDBCPostProcessor.java:34) ~[ApacheJMeter_jdbc.jar:5.5.1-SNAPSHOT]
at org.apache.jmeter.threads.JMeterThread.runPostProcessors(JMeterThread.java:968) ~[ApacheJMeter_core.jar:5.5.1-SNAPSHOT]
at org.apache.jmeter.threads.JMeterThread.executeSamplePackage(JMeterThread.java:585) ~[ApacheJMeter_core.jar:5.5.1-SNAPSHOT]
at org.apache.jmeter.threads.JMeterThread.processSampler(JMeterThread.java:501) ~[ApacheJMeter_core.jar:5.5.1-SNAPSHOT]
at org.apache.jmeter.threads.JMeterThread.run(JMeterThread.java:268) ~[ApacheJMeter_core.jar:5.5.1-SNAPSHOT]
at java.lang.Thread.run(Thread.java:748) ~[?:1.8.0_291]
2022-07-23 15:27:58,049 WARN o.a.j.p.j.p.AbstractJDBCProcessor: SQL Problem in JDBC PreProcessor: java.sql.SQLSyntaxErrorException: unexpected token: USERS
2022-07-23 15:27:58,063 WARN o.a.j.p.j.p.AbstractJDBCProcessor: SQL Problem in JDBC PostProcessor: java.sql.SQLSyntaxErrorException: unexpected token: USERS
> Task :src:dist-check:batchJMS_TESTS
Creating summariser <summary>
Created the tree successfully using <https://ci-builds.apache.org/job/JMeter/job/JMeter%20Ubuntu/ws/bin/testfiles/JMS_TESTS.jmx>
Starting standalone test @ July 23, 2022 3:27:59 PM UTC (1658590079955)
Waiting for possible Shutdown/StopTestNow/HeapDump/ThreadDump message on port 4445
summary + 1 in 00:00:02 = 0.4/s Avg: 2315 Min: 2315 Max: 2315 Err: 0 (0.00%) Active: 1 Started: 1 Finished: 0
> Task :src:protocol:http:test FAILED
[0;31;1mFAILURE[0m [0;1m 6.0sec[0m, org.apache.jmeter.protocol.http.sampler.[0;1mTestRedirects[0m > [0;1mtestRedirect(String,[0m int, boolean, String)[16], [16] HttpClient4, 307, true, HEAD
org.opentest4j.AssertionFailedError: expected: <http://localhost:42407/redirected> but was: <null>
[0;0;90mat org.junit.jupiter.api.AssertionUtils.fail(AssertionUtils.java:55)
[0m [0;0;90mat org.junit.jupiter.api.AssertionUtils.failNotEqual(AssertionUtils.java:62)
[0m [0;0;90mat org.junit.jupiter.api.AssertEquals.assertEquals(AssertEquals.java:182)
[0m [0;0;90mat org.junit.jupiter.api.AssertEquals.assertEquals(AssertEquals.java:177)
[0m [0;0;90mat org.junit.jupiter.api.Assertions.assertEquals(Assertions.java:1141)
[0m [0;1mat org.apache.jmeter.protocol.http.sampler.TestRedirects.testRedirect(TestRedirects.java:73)
[0m
[0;31;1mFAILURE[0m 7.7sec, 90 completed, [0;31;1m 1[0m failed, 0 skipped, [0;31;1mtestRedirect(String, int, boolean, String)[0m
[0;31;1mFAILURE[0m 7.7sec, 90 completed, [0;31;1m 1[0m failed, 0 skipped, org.apache.jmeter.protocol.http.sampler.[0;31;1mTestRedirects[0m
0.3sec, 1 completed, 0 failed, 0 skipped, org.apache.jmeter.protocol.http.sampler.TestSerializedHTTPSampler
0.0sec, 3 completed, 0 failed, 0 skipped, testInvalidGraphQueryParam(String)
0.0sec, 3 completed, 0 failed, 0 skipped, testIsGraphQLContentType(String)
0.0sec, 4 completed, 0 failed, 0 skipped, testInvalidGraphQLContentType(String)
0.0sec, 2 completed, 0 failed, 0 skipped, testInvalidJsonData(String)
0.0sec, 3 completed, 0 failed, 0 skipped, testFieldInJsonFromToPostBodyString(String, JsonNode, JsonNode)
0.1sec, 22 completed, 0 failed, 0 skipped, org.apache.jmeter.protocol.http.util.TestGraphQLRequestParamUtils
0.0sec, 3 completed, 0 failed, 0 skipped, org.apache.jmeter.protocol.http.util.TestHTTPArgument
0.0sec, 3 completed, 0 failed, 0 skipped, org.apache.jmeter.protocol.http.util.TestHTTPFileArg
0.0sec, 5 completed, 0 failed, 0 skipped, org.apache.jmeter.protocol.http.util.TestHTTPFileArgs
0.0sec, 6 completed, 0 failed, 0 skipped, org.apache.jmeter.protocol.http.util.accesslog.TestLogFilter
0.0sec, 3 completed, 0 failed, 0 skipped, org.apache.jmeter.protocol.http.util.accesslog.TestSessionFilter
0.0sec, 4 completed, 0 failed, 0 skipped, org.apache.jmeter.protocol.http.util.accesslog.TestTCLogParser
0.0sec, 7 completed, 0 failed, 0 skipped, org.apache.jmeter.protocol.http.visualizers.RequestViewHTTPTest
0.1sec, 1 completed, 0 failed, 0 skipped, org.apache.jmeter.resources.ResourceKeyUsageTestHttp
0.0sec, 2 completed, 0 failed, 0 skipped, org.apache.jmeter.testelement.TestHeaderManager
0.9sec, 9 completed, 0 failed, 0 skipped, org.apache.jmeter.protocol.http.control.TestHTTPMirrorThread
0.3sec, 103 completed, 0 failed, 0 skipped, org.apache.jmeter.protocol.http.parser.TestHTMLParser
0.3sec, 53 completed, 0 failed, 0 skipped, org.apache.jmeter.protocol.http.sampler.TestHTTPSamplersAgainstHttpMirrorServer
0.0sec, 7 completed, 0 failed, 0 skipped, org.apache.jmeter.protocol.http.visualizers.RequestViewHTTPTest
[0;31;1mFAILURE[0m 32.3sec, 765 completed, [0;31;1m 1[0m failed, [0;34;1m 1[0m skipped, [0;31;1mGradle Test Run :src:protocol:http:test[0m
765 tests completed, 1 failed, 1 skipped
> Task :src:dist-check:batchJMS_TESTS
summary + 24 in 00:00:28 = 0.8/s Avg: 574 Min: 0 Max: 3000 Err: 0 (0.00%) Active: 1 Started: 6 Finished: 5
summary = 25 in 00:00:31 = 0.8/s Avg: 644 Min: 0 Max: 3000 Err: 0 (0.00%)
summary + 2 in 00:00:00 = 22.5/s Avg: 32 Min: 1 Max: 63 Err: 0 (0.00%) Active: 0 Started: 1 Finished: 1
summary = 27 in 00:00:31 = 0.9/s Avg: 599 Min: 0 Max: 3000 Err: 0 (0.00%)
Tidying up ... @ July 23, 2022 3:28:31 PM UTC (1658590111333)
... end of run
No errors present in the logfile <https://ci-builds.apache.org/job/JMeter/job/JMeter%20Ubuntu/ws/bin/JMS_TESTS.log> (the file is empty)
checksum-dependency elapsed time: 10944ms, configurations processed: 274 (add -PchecksumTimingsPrint to print detailed timings)
FAILURE: Build failed with an exception.
* What went wrong:
Execution failed for task ':src:protocol:http:test'.
> There were failing tests. See the report at: file:///home/jenkins/jenkins-agent/workspace/JMeter/JMeter%20Ubuntu/src/protocol/http/build/reports/tests/test/index.html
* Try:
> Run with --stacktrace option to get the stack trace.
> Run with --info or --debug option to get more log output.
> Run with --scan to get full insights.
* Get more help at https://help.gradle.org
BUILD FAILED in 2m 11s
265 actionable tasks: 118 executed, 147 up-to-date
Build step 'Invoke Gradle script' changed build result to FAILURE
Build step 'Invoke Gradle script' marked build as failure
Jenkins build is back to normal : JMeter » JMeter Ubuntu #324
Posted by Apache Jenkins Server <je...@builds.apache.org>.
See <https://ci-builds.apache.org/job/JMeter/job/JMeter%20Ubuntu/324/display/redirect>