You are viewing a plain text version of this content. The canonical link for it is here.
Posted to yarn-dev@hadoop.apache.org by Apache Jenkins Server <je...@builds.apache.org> on 2015/04/30 11:01:26 UTC
Failed: YARN-3552 PreCommit Build #7552
Jira: https://issues.apache.org/jira/browse/YARN-3552
Build: https://builds.apache.org/job/PreCommit-YARN-Build/7552/
###################################################################################
########################## LAST 60 LINES OF THE CONSOLE ###########################
[...truncated 278 lines...]
| -1 | checkstyle | 3m 56s | The applied patch generated 2
| | | | additional checkstyle issues.
| +1 | install | 1m 32s | mvn install still works.
| +1 | eclipse:eclipse | 0m 33s | The patch built with
| | | | eclipse:eclipse.
| +1 | findbugs | 1m 15s | The patch does not introduce any
| | | | new Findbugs (version 2.0.3)
| | | | warnings.
| -1 | yarn tests | 52m 27s | Tests failed in
| | | | hadoop-yarn-server-resourcemanager.
| | | 92m 35s |
Reason | Tests
Failed unit tests | hadoop.yarn.server.resourcemanager.scheduler.capacity.TestContainerAllocation
|| Subsystem || Report/Notes ||
============================================================================
| Patch URL | http://issues.apache.org/jira/secure/attachment/12729420/0001-YARN-3552.patch |
| Optional Tests | javadoc javac unit findbugs checkstyle |
| git revision | trunk / f5b3847 |
| checkstyle | /home/jenkins/jenkins-slave/workspace/PreCommit-YARN-Build/../patchprocess/checkstyle-result-diff.txt |
| hadoop-yarn-server-resourcemanager test log | /home/jenkins/jenkins-slave/workspace/PreCommit-YARN-Build/../patchprocess/testrun_hadoop-yarn-server-resourcemanager.txt |
| Test Results | https://builds.apache.org/job/PreCommit-YARN-Build/7552/testReport/ |
| Java | 1.7.0_55 |
| uname | Linux asf903.gq1.ygridcore.net 3.13.0-36-lowlatency #63-Ubuntu SMP PREEMPT Wed Sep 3 21:56:12 UTC 2014 x86_64 x86_64 x86_64 GNU/Linux |
============================================================================
============================================================================
Adding comment to JIRA
============================================================================
============================================================================
Comment added.
e7ec02f120580d545cd6acf5e2bca181ce5d863c logged out
============================================================================
============================================================================
Finished build.
============================================================================
============================================================================
Build step 'Execute shell' marked build as failure
Archiving artifacts
Sending artifact delta relative to PreCommit-YARN-Build #7545
Archived 21 artifacts
Archive block size is 32768
Received 463 blocks and 80329802 bytes
Compression is 15.9%
Took 36 sec
Description set: MAPREDUCE-6339
Recording test results
Email was triggered for: Failure
Sending email for trigger: Failure
###################################################################################
############################## FAILED TESTS (if any) ##############################
1 tests failed.
FAILED: org.apache.hadoop.yarn.server.resourcemanager.scheduler.capacity.TestContainerAllocation.testAMContainerAllocationWhenDNSUnavailable
Error Message:
test timed out after 30000 milliseconds
Stack Trace:
java.lang.Exception: test timed out after 30000 milliseconds
at java.lang.Thread.sleep(Native Method)
at org.apache.hadoop.yarn.server.resourcemanager.MockRM.waitForState(MockRM.java:151)
at org.apache.hadoop.yarn.server.resourcemanager.MockRM.launchAM(MockRM.java:692)
at org.apache.hadoop.yarn.server.resourcemanager.MockRM.launchAndRegisterAM(MockRM.java:702)
at org.apache.hadoop.yarn.server.resourcemanager.scheduler.capacity.TestContainerAllocation.testAMContainerAllocationWhenDNSUnavailable(TestContainerAllocation.java:329)
Failed: YARN-3521 PreCommit Build #7557
Posted by Apache Jenkins Server <je...@builds.apache.org>.
Jira: https://issues.apache.org/jira/browse/YARN-3521
Build: https://builds.apache.org/job/PreCommit-YARN-Build/7557/
###################################################################################
########################## LAST 60 LINES OF THE CONSOLE ###########################
[...truncated 307 lines...]
| | | | additional checkstyle issues.
| +1 | install | 1m 34s | mvn install still works.
| +1 | eclipse:eclipse | 0m 33s | The patch built with
| | | | eclipse:eclipse.
| +1 | findbugs | 1m 14s | The patch does not introduce any
| | | | new Findbugs (version 2.0.3)
| | | | warnings.
| -1 | yarn tests | 63m 37s | Tests failed in
| | | | hadoop-yarn-server-resourcemanager.
| | | 104m 45s |
Reason | Tests
Timed out tests | org.apache.hadoop.yarn.server.resourcemanager.scheduler.capacity.TestNodeLabelContainerAllocation
|| Subsystem || Report/Notes ||
============================================================================
| Patch URL | http://issues.apache.org/jira/secure/attachment/12729530/0002-YARN-3521.patch |
| Optional Tests | javadoc javac unit findbugs checkstyle |
| git revision | trunk / e2e8f77 |
| whitespace | /home/jenkins/jenkins-slave/workspace/PreCommit-YARN-Build/../patchprocess/whitespace.txt |
| checkstyle | /home/jenkins/jenkins-slave/workspace/PreCommit-YARN-Build/../patchprocess/checkstyle-result-diff.txt |
| hadoop-yarn-server-resourcemanager test log | /home/jenkins/jenkins-slave/workspace/PreCommit-YARN-Build/../patchprocess/testrun_hadoop-yarn-server-resourcemanager.txt |
| Test Results | https://builds.apache.org/job/PreCommit-YARN-Build/7557/testReport/ |
| Java | 1.7.0_55 |
| uname | Linux asf905.gq1.ygridcore.net 3.13.0-36-lowlatency #63-Ubuntu SMP PREEMPT Wed Sep 3 21:56:12 UTC 2014 x86_64 x86_64 x86_64 GNU/Linux |
============================================================================
============================================================================
Adding comment to JIRA
============================================================================
============================================================================
Comment added.
ce102760250b62251a987eb8817a10c9cddba779 logged out
============================================================================
============================================================================
Finished build.
============================================================================
============================================================================
Build step 'Execute shell' marked build as failure
Archiving artifacts
Sending artifact delta relative to PreCommit-YARN-Build #7545
Archived 21 artifacts
Archive block size is 32768
Received 3093 blocks and 73290751 bytes
Compression is 58.0%
Took 34 sec
[description-setter] Could not determine description.
Recording test results
Email was triggered for: Failure
Sending email for trigger: Failure
###################################################################################
############################## FAILED TESTS (if any) ##############################
All tests passed
Failed: YARN-3539 PreCommit Build #7556
Posted by Apache Jenkins Server <je...@builds.apache.org>.
Jira: https://issues.apache.org/jira/browse/YARN-3539
Build: https://builds.apache.org/job/PreCommit-YARN-Build/7556/
###################################################################################
########################## LAST 60 LINES OF THE CONSOLE ###########################
[...truncated 187 lines...]
-1 overall
| Vote | Subsystem | Runtime | Comment
============================================================================
| 0 | pre-patch | 3m 38s | Pre-patch trunk compilation is
| | | | healthy.
| +1 | @author | 0m 0s | The patch does not contain any
| | | | @author tags.
| -1 | whitespace | 0m 0s | The patch has 4 line(s) that end in
| | | | whitespace.
| +1 | release audit | 0m 20s | The applied patch does not increase
| | | | the total number of release audit
| | | | warnings.
| -1 | site | 1m 56s | Site compilation is broken.
| | | 5m 59s |
|| Subsystem || Report/Notes ||
============================================================================
| Patch URL | http://issues.apache.org/jira/secure/attachment/12729541/YARN-3539-005.patch |
| Optional Tests | site |
| git revision | trunk / de9404f |
| whitespace | /home/jenkins/jenkins-slave/workspace/PreCommit-YARN-Build/../patchprocess/whitespace.txt |
| site | /home/jenkins/jenkins-slave/workspace/PreCommit-YARN-Build/../patchprocess/patchSiteWarnings.txt |
| Java | 1.7.0_55 |
| uname | Linux asf907.gq1.ygridcore.net 3.13.0-36-lowlatency #63-Ubuntu SMP PREEMPT Wed Sep 3 21:56:12 UTC 2014 x86_64 x86_64 x86_64 GNU/Linux |
============================================================================
============================================================================
Adding comment to JIRA
============================================================================
============================================================================
Comment added.
a69207eed7130475b4c8b9c0df828cd4a587ea20 logged out
============================================================================
============================================================================
Finished build.
============================================================================
============================================================================
Build step 'Execute shell' marked build as failure
Archiving artifacts
Sending artifact delta relative to PreCommit-YARN-Build #7545
Archived 5 artifacts
Archive block size is 32768
Received 1 blocks and 2272953 bytes
Compression is 1.4%
Took 28 sec
[description-setter] Could not determine description.
Recording test results
Email was triggered for: Failure
Sending email for trigger: Failure
###################################################################################
############################## FAILED TESTS (if any) ##############################
No tests ran.
Failed: YARN-3544 PreCommit Build #7555
Posted by Apache Jenkins Server <je...@builds.apache.org>.
Jira: https://issues.apache.org/jira/browse/YARN-3544
Build: https://builds.apache.org/job/PreCommit-YARN-Build/7555/
###################################################################################
########################## LAST 60 LINES OF THE CONSOLE ###########################
[...truncated 135 lines...]
-1 overall
| Vote | Subsystem | Runtime | Comment
============================================================================
| 0 | pre-patch | 14m 0s | Pre-patch branch-2.7 compilation is
| | | | healthy.
| +1 | @author | 0m 0s | The patch does not contain any
| | | | @author tags.
| -1 | tests included | 0m 0s | The patch doesn't appear to include
| | | | any new or modified tests. Please
| | | | justify why no new tests are needed
| | | | for this patch. Also please list what
| | | | manual steps were performed to verify
| | | | this patch.
| +1 | whitespace | 0m 0s | The patch has no lines that end in
| | | | whitespace.
| -1 | patch | 0m 0s | The patch command could not apply
| | | | the patch.
|| Subsystem || Report/Notes ||
============================================================================
| Patch URL | http://issues.apache.org/jira/secure/attachment/12729519/YARN-3544-branch-2.7-1.2.patch |
| Optional Tests | javadoc javac unit findbugs checkstyle |
| git revision | branch-2.7 / 185a1ff |
============================================================================
============================================================================
Adding comment to JIRA
============================================================================
============================================================================
Comment added.
95f81119fec53f0783c719c9e35e36107ecc88b4 logged out
============================================================================
============================================================================
Finished build.
============================================================================
============================================================================
Build step 'Execute shell' marked build as failure
Archiving artifacts
Sending artifact delta relative to PreCommit-YARN-Build #7545
Archived 5 artifacts
Archive block size is 32768
Received 1475 blocks and 36692963 bytes
Compression is 56.8%
Took 39 sec
[description-setter] Could not determine description.
Recording test results
Email was triggered for: Failure
Sending email for trigger: Failure
###################################################################################
############################## FAILED TESTS (if any) ##############################
No tests ran.
Failed: YARN-3476 PreCommit Build #7554
Posted by Apache Jenkins Server <je...@builds.apache.org>.
Jira: https://issues.apache.org/jira/browse/YARN-3476
Build: https://builds.apache.org/job/PreCommit-YARN-Build/7554/
###################################################################################
########################## LAST 60 LINES OF THE CONSOLE ###########################
[...truncated 276 lines...]
| +1 | release audit | 0m 23s | The applied patch does not increase
| | | | the total number of release audit
| | | | warnings.
| -1 | checkstyle | 7m 40s | The applied patch generated 1
| | | | additional checkstyle issues.
| +1 | install | 1m 34s | mvn install still works.
| +1 | eclipse:eclipse | 0m 32s | The patch built with
| | | | eclipse:eclipse.
| +1 | findbugs | 1m 1s | The patch does not introduce any
| | | | new Findbugs (version 2.0.3)
| | | | warnings.
| +1 | yarn tests | 5m 58s | Tests passed in
| | | | hadoop-yarn-server-nodemanager.
| | | 48m 51s |
|| Subsystem || Report/Notes ||
============================================================================
| Patch URL | http://issues.apache.org/jira/secure/attachment/12729459/0001-YARN-3476.patch |
| Optional Tests | javadoc javac unit findbugs checkstyle |
| git revision | trunk / de9404f |
| whitespace | /home/jenkins/jenkins-slave/workspace/PreCommit-YARN-Build/../patchprocess/whitespace.txt |
| checkstyle | /home/jenkins/jenkins-slave/workspace/PreCommit-YARN-Build/../patchprocess/checkstyle-result-diff.txt |
| hadoop-yarn-server-nodemanager test log | /home/jenkins/jenkins-slave/workspace/PreCommit-YARN-Build/../patchprocess/testrun_hadoop-yarn-server-nodemanager.txt |
| Test Results | https://builds.apache.org/job/PreCommit-YARN-Build/7554/testReport/ |
| Java | 1.7.0_55 |
| uname | Linux asf902.gq1.ygridcore.net 3.13.0-36-lowlatency #63-Ubuntu SMP PREEMPT Wed Sep 3 21:56:12 UTC 2014 x86_64 x86_64 x86_64 GNU/Linux |
============================================================================
============================================================================
Adding comment to JIRA
============================================================================
============================================================================
Comment added.
e5cf2766f7f9f170ea258647522503d0757075fc logged out
============================================================================
============================================================================
Finished build.
============================================================================
============================================================================
Build step 'Execute shell' marked build as failure
Archiving artifacts
Sending artifact delta relative to PreCommit-YARN-Build #7545
Archived 21 artifacts
Archive block size is 32768
Received 786 blocks and 151181513 bytes
Compression is 14.6%
Took 32 sec
[description-setter] Could not determine description.
Recording test results
Email was triggered for: Failure
Sending email for trigger: Failure
###################################################################################
############################## FAILED TESTS (if any) ##############################
All tests passed
Failed: YARN-3271 PreCommit Build #7553
Posted by Apache Jenkins Server <je...@builds.apache.org>.
Jira: https://issues.apache.org/jira/browse/YARN-3271
Build: https://builds.apache.org/job/PreCommit-YARN-Build/7553/
###################################################################################
########################## LAST 60 LINES OF THE CONSOLE ###########################
[...truncated 257 lines...]
| | | | warnings.
| +1 | checkstyle | 5m 32s | There were no new checkstyle
| | | | issues.
| +1 | install | 1m 32s | mvn install still works.
| +1 | eclipse:eclipse | 0m 32s | The patch built with
| | | | eclipse:eclipse.
| +1 | findbugs | 1m 15s | The patch does not introduce any
| | | | new Findbugs (version 2.0.3)
| | | | warnings.
| -1 | yarn tests | 52m 56s | Tests failed in
| | | | hadoop-yarn-server-resourcemanager.
| | | 74m 59s |
Reason | Tests
Failed unit tests | hadoop.yarn.server.resourcemanager.scheduler.capacity.TestContainerAllocation
|| Subsystem || Report/Notes ||
============================================================================
| Patch URL | http://issues.apache.org/jira/secure/attachment/12729453/YARN-3271.3.patch |
| Optional Tests | javac unit findbugs checkstyle |
| git revision | trunk / de9404f |
| hadoop-yarn-server-resourcemanager test log | /home/jenkins/jenkins-slave/workspace/PreCommit-YARN-Build/../patchprocess/testrun_hadoop-yarn-server-resourcemanager.txt |
| Test Results | https://builds.apache.org/job/PreCommit-YARN-Build/7553/testReport/ |
| Java | 1.7.0_55 |
| uname | Linux asf904.gq1.ygridcore.net 3.13.0-36-lowlatency #63-Ubuntu SMP PREEMPT Wed Sep 3 21:56:12 UTC 2014 x86_64 x86_64 x86_64 GNU/Linux |
============================================================================
============================================================================
Adding comment to JIRA
============================================================================
============================================================================
Comment added.
a5fa6631a37332f854b256498c3aba606ed8d135 logged out
============================================================================
============================================================================
Finished build.
============================================================================
============================================================================
Build step 'Execute shell' marked build as failure
Archiving artifacts
Sending artifact delta relative to PreCommit-YARN-Build #7545
Archived 19 artifacts
Archive block size is 32768
Received 3083 blocks and 68523623 bytes
Compression is 59.6%
Took 52 sec
[description-setter] Could not determine description.
Recording test results
Email was triggered for: Failure
Sending email for trigger: Failure
###################################################################################
############################## FAILED TESTS (if any) ##############################
1 tests failed.
FAILED: org.apache.hadoop.yarn.server.resourcemanager.scheduler.capacity.TestContainerAllocation.testAMContainerAllocationWhenDNSUnavailable
Error Message:
test timed out after 30000 milliseconds
Stack Trace:
java.lang.Exception: test timed out after 30000 milliseconds
at java.lang.Thread.sleep(Native Method)
at org.apache.hadoop.yarn.server.resourcemanager.MockRM.waitForState(MockRM.java:151)
at org.apache.hadoop.yarn.server.resourcemanager.MockRM.launchAM(MockRM.java:692)
at org.apache.hadoop.yarn.server.resourcemanager.MockRM.launchAndRegisterAM(MockRM.java:702)
at org.apache.hadoop.yarn.server.resourcemanager.scheduler.capacity.TestContainerAllocation.testAMContainerAllocationWhenDNSUnavailable(TestContainerAllocation.java:329)