You are viewing a plain text version of this content. The canonical link for it is here.
Posted to builds@beam.apache.org by Apache Jenkins Server <je...@builds.apache.org> on 2019/07/29 17:07:02 UTC
Build failed in Jenkins: beam_PostCommit_Python37 #78
See <https://builds.apache.org/job/beam_PostCommit_Python37/78/display/redirect?page=changes>
Changes:
[mxm] [BEAM-7366] Restore Spotless check for Flink Runner
------------------------------------------
[...truncated 294.70 KB...]
"component_encodings": []
}
],
"is_pair_like": true
},
{
"@type": "kind:global_window"
}
],
"is_wrapper": true
},
"output_name": "out",
"user_name": "create/Read.out"
}
],
"user_name": "create/Read"
}
},
{
"kind": "ParallelWrite",
"name": "s2",
"properties": {
"create_disposition": "CREATE_IF_NEEDED",
"dataset": "python_write_to_table_15644193689239",
"display_data": [],
"encoding": {
"@type": "kind:windowed_value",
"component_encodings": [
{
"@type": "RowAsDictJsonCoder$eNprYE5OLEhMzkiNT0pNzNXLzNdLTy7QS8pMLyxNLaqML8nPzynmCsovdyx2yUwu8SrOz3POT0kt4ipk0GwsZKwtZErSAwBK5xfp",
"component_encodings": []
},
{
"@type": "kind:global_window"
}
],
"is_wrapper": true
},
"format": "bigquery",
"parallel_input": {
"@type": "OutputReference",
"output_name": "out",
"step_name": "s1"
},
"table": "python_no_schema_table",
"user_name": "write/WriteToBigQuery/NativeWrite",
"write_disposition": "WRITE_APPEND"
}
}
],
"type": "JOB_TYPE_BATCH"
}
root: INFO: Create job: <Job
createTime: '2019-07-29T16:56:18.950914Z'
currentStateTime: '1970-01-01T00:00:00Z'
id: '2019-07-29_09_56_17-8158665006933192379'
location: 'us-central1'
name: 'beamapp-jenkins-0729165608-913143'
projectId: 'apache-beam-testing'
stageStates: []
startTime: '2019-07-29T16:56:18.950914Z'
steps: []
tempFiles: []
type: TypeValueValuesEnum(JOB_TYPE_BATCH, 1)>
root: INFO: Created job with id: [2019-07-29_09_56_17-8158665006933192379]
root: INFO: To access the Dataflow monitoring console, please navigate to https://console.cloud.google.com/dataflow/jobsDetail/locations/us-central1/jobs/2019-07-29_09_56_17-8158665006933192379?project=apache-beam-testing
root: INFO: Job 2019-07-29_09_56_17-8158665006933192379 is in state JOB_STATE_RUNNING
root: INFO: 2019-07-29T16:56:17.625Z: JOB_MESSAGE_DETAILED: Autoscaling is enabled for job 2019-07-29_09_56_17-8158665006933192379. The number of workers will be between 1 and 1000.
root: INFO: 2019-07-29T16:56:17.768Z: JOB_MESSAGE_DETAILED: Autoscaling was automatically enabled for job 2019-07-29_09_56_17-8158665006933192379.
root: INFO: 2019-07-29T16:56:21.277Z: JOB_MESSAGE_DETAILED: Checking permissions granted to controller Service Account.
root: INFO: 2019-07-29T16:56:21.954Z: JOB_MESSAGE_BASIC: Worker configuration: n1-standard-1 in us-central1-a.
root: INFO: 2019-07-29T16:56:22.628Z: JOB_MESSAGE_DETAILED: Expanding CoGroupByKey operations into optimizable parts.
root: INFO: 2019-07-29T16:56:22.669Z: JOB_MESSAGE_DETAILED: Expanding GroupByKey operations into optimizable parts.
root: INFO: 2019-07-29T16:56:22.709Z: JOB_MESSAGE_DETAILED: Lifting ValueCombiningMappingFns into MergeBucketsMappingFns
root: INFO: 2019-07-29T16:56:22.747Z: JOB_MESSAGE_DEBUG: Annotating graph with Autotuner information.
root: INFO: 2019-07-29T16:56:22.787Z: JOB_MESSAGE_DETAILED: Fusing adjacent ParDo, Read, Write, and Flatten operations
root: INFO: 2019-07-29T16:56:22.819Z: JOB_MESSAGE_DETAILED: Fusing consumer write/WriteToBigQuery/NativeWrite into create/Read
root: INFO: 2019-07-29T16:56:22.855Z: JOB_MESSAGE_DEBUG: Workflow config is missing a default resource spec.
root: INFO: 2019-07-29T16:56:22.889Z: JOB_MESSAGE_DEBUG: Adding StepResource setup and teardown to workflow graph.
root: INFO: 2019-07-29T16:56:22.925Z: JOB_MESSAGE_DEBUG: Adding workflow start and stop steps.
root: INFO: 2019-07-29T16:56:22.960Z: JOB_MESSAGE_DEBUG: Assigning stage ids.
root: INFO: 2019-07-29T16:56:23.089Z: JOB_MESSAGE_DEBUG: Executing wait step start3
root: INFO: 2019-07-29T16:56:23.154Z: JOB_MESSAGE_BASIC: Executing operation create/Read+write/WriteToBigQuery/NativeWrite
root: INFO: 2019-07-29T16:56:23.202Z: JOB_MESSAGE_DEBUG: Starting worker pool setup.
root: INFO: 2019-07-29T16:56:23.240Z: JOB_MESSAGE_BASIC: Starting 1 workers in us-central1-a...
root: INFO: 2019-07-29T16:56:23.697Z: JOB_MESSAGE_BASIC: Worker configuration: n1-standard-1 in us-central1-a.
root: INFO: 2019-07-29T16:57:18.011Z: JOB_MESSAGE_DETAILED: Autoscaling: Raised the number of workers to 1 based on the rate of progress in the currently running step(s).
root: INFO: 2019-07-29T16:58:10.404Z: JOB_MESSAGE_DETAILED: Workers have started successfully.
root: INFO: 2019-07-29T16:58:10.439Z: JOB_MESSAGE_DETAILED: Workers have started successfully.
root: INFO: 2019-07-29T16:59:23.733Z: JOB_MESSAGE_BASIC: Worker configuration: n1-standard-1 in us-central1-a.
root: INFO: 2019-07-29T17:02:12.779Z: JOB_MESSAGE_BASIC: Executing BigQuery import job "dataflow_job_11494169093265054838". You can check its status with the bq tool: "bq show -j --project_id=apache-beam-testing dataflow_job_11494169093265054838".
root: INFO: 2019-07-29T17:02:23.073Z: JOB_MESSAGE_DETAILED: Checking permissions granted to controller Service Account.
root: INFO: 2019-07-29T17:02:23.558Z: JOB_MESSAGE_BASIC: BigQuery import job "dataflow_job_11494169093265054838" done.
root: INFO: 2019-07-29T17:02:23.681Z: JOB_MESSAGE_BASIC: Worker configuration: n1-standard-1 in us-central1-a.
root: INFO: 2019-07-29T17:02:24.406Z: JOB_MESSAGE_BASIC: Finished operation create/Read+write/WriteToBigQuery/NativeWrite
root: INFO: 2019-07-29T17:02:24.628Z: JOB_MESSAGE_DEBUG: Executing success step success1
root: INFO: 2019-07-29T17:02:24.792Z: JOB_MESSAGE_DETAILED: Cleaning up.
root: INFO: 2019-07-29T17:02:24.862Z: JOB_MESSAGE_DEBUG: Starting worker pool teardown.
root: INFO: 2019-07-29T17:02:24.908Z: JOB_MESSAGE_BASIC: Stopping worker pool...
root: INFO: Deleting dataset python_write_to_table_15644193689239 in project apache-beam-testing
--------------------- >> end captured logging << ---------------------
Found: https://console.cloud.google.com/dataflow/jobsDetail/locations/us-central1/jobs/2019-07-29_09_12_36-2262009159315752449?project=apache-beam-testing.
<https://builds.apache.org/job/beam_PostCommit_Python37/ws/src/sdks/python/apache_beam/io/gcp/bigquery.py>:1150: BeamDeprecationWarning: options is deprecated since First stable release. References to <pipeline>.options will not be supported
Found: https://console.cloud.google.com/dataflow/jobsDetail/locations/us-central1/jobs/2019-07-29_09_28_17-13982998923996127343?project=apache-beam-testing.
experiments = p.options.view_as(DebugOptions).experiments or []
Found: https://console.cloud.google.com/dataflow/jobsDetail/locations/us-central1/jobs/2019-07-29_09_38_09-14059512910926332336?project=apache-beam-testing.
Found: https://console.cloud.google.com/dataflow/jobsDetail/locations/us-central1/jobs/2019-07-29_09_48_14-96005673616190507?project=apache-beam-testing.
Found: https://console.cloud.google.com/dataflow/jobsDetail/locations/us-central1/jobs/2019-07-29_09_12_34-8525997408996263660?project=apache-beam-testing.
<https://builds.apache.org/job/beam_PostCommit_Python37/ws/src/sdks/python/apache_beam/runners/dataflow/dataflow_runner.py>:686: BeamDeprecationWarning: BigQuerySink is deprecated since 2.11.0. Use WriteToBigQuery instead.
Found: https://console.cloud.google.com/dataflow/jobsDetail/locations/us-central1/jobs/2019-07-29_09_38_25-14091181257658774340?project=apache-beam-testing.
Found: https://console.cloud.google.com/dataflow/jobsDetail/locations/us-central1/jobs/2019-07-29_09_48_02-13494099607048595655?project=apache-beam-testing.
kms_key=transform.kms_key))
Found: https://console.cloud.google.com/dataflow/jobsDetail/locations/us-central1/jobs/2019-07-29_09_12_35-18287093649772145631?project=apache-beam-testing.
Found: https://console.cloud.google.com/dataflow/jobsDetail/locations/us-central1/jobs/2019-07-29_09_26_37-14220471825145417403?project=apache-beam-testing.
<https://builds.apache.org/job/beam_PostCommit_Python37/ws/src/sdks/python/apache_beam/io/gcp/bigquery.py>:1150: BeamDeprecationWarning: options is deprecated since First stable release. References to <pipeline>.options will not be supported
experiments = p.options.view_as(DebugOptions).experiments or []
Found: https://console.cloud.google.com/dataflow/jobsDetail/locations/us-central1/jobs/2019-07-29_09_35_44-8551781394067307158?project=apache-beam-testing.
<https://builds.apache.org/job/beam_PostCommit_Python37/ws/src/sdks/python/apache_beam/io/gcp/bigquery_file_loads.py>:638: BeamDeprecationWarning: options is deprecated since First stable release. References to <pipeline>.options will not be supported
Found: https://console.cloud.google.com/dataflow/jobsDetail/locations/us-central1/jobs/2019-07-29_09_44_49-6400656882238669992?project=apache-beam-testing.
temp_location = p.options.view_as(GoogleCloudOptions).temp_location
Found: https://console.cloud.google.com/dataflow/jobsDetail/locations/us-central1/jobs/2019-07-29_09_12_33-3812162100961238845?project=apache-beam-testing.
<https://builds.apache.org/job/beam_PostCommit_Python37/ws/src/sdks/python/apache_beam/runners/dataflow/dataflow_runner.py>:686: BeamDeprecationWarning: BigQuerySink is deprecated since 2.11.0. Use WriteToBigQuery instead.
Found: https://console.cloud.google.com/dataflow/jobsDetail/locations/us-central1/jobs/2019-07-29_09_36_36-5499061886017352923?project=apache-beam-testing.
Found: https://console.cloud.google.com/dataflow/jobsDetail/locations/us-central1/jobs/2019-07-29_09_46_28-9880943818853548096?project=apache-beam-testing.
kms_key=transform.kms_key))
Found: https://console.cloud.google.com/dataflow/jobsDetail/locations/us-central1/jobs/2019-07-29_09_56_17-8158665006933192379?project=apache-beam-testing.
Exception in thread Thread-4:
Traceback (most recent call last):
File "/usr/lib/python3.7/threading.py", line 917, in _bootstrap_inner
self.run()
File "/usr/lib/python3.7/threading.py", line 865, in run
self._target(*self._args, **self._kwargs)
File "<https://builds.apache.org/job/beam_PostCommit_Python37/ws/src/sdks/python/apache_beam/runners/dataflow/dataflow_runner.py",> line 157, in poll_for_job_completion
response = runner.dataflow_client.get_job(job_id)
File "<https://builds.apache.org/job/beam_PostCommit_Python37/ws/src/sdks/python/apache_beam/utils/retry.py",> line 197, in wrapper
return fun(*args, **kwargs)
File "<https://builds.apache.org/job/beam_PostCommit_Python37/ws/src/sdks/python/apache_beam/runners/dataflow/internal/apiclient.py",> line 670, in get_job
response = self._client.projects_locations_jobs.Get(request)
File "<https://builds.apache.org/job/beam_PostCommit_Python37/ws/src/sdks/python/apache_beam/runners/dataflow/internal/clients/dataflow/dataflow_v1b3_client.py",> line 689, in Get
config, request, global_params=global_params)
File "<https://builds.apache.org/job/beam_PostCommit_Python37/ws/src/build/gradleenv/-1734967052/lib/python3.7/site-packages/apitools/base/py/base_api.py",> line 731, in _RunMethod
return self.ProcessHttpResponse(method_config, http_response, request)
File "<https://builds.apache.org/job/beam_PostCommit_Python37/ws/src/build/gradleenv/-1734967052/lib/python3.7/site-packages/apitools/base/py/base_api.py",> line 737, in ProcessHttpResponse
self.__ProcessHttpResponse(method_config, http_response, request))
File "<https://builds.apache.org/job/beam_PostCommit_Python37/ws/src/build/gradleenv/-1734967052/lib/python3.7/site-packages/apitools/base/py/base_api.py",> line 604, in __ProcessHttpResponse
http_response, method_config=method_config, request=request)
apitools.base.py.exceptions.HttpNotFoundError: HttpError accessing <https://dataflow.googleapis.com/v1b3/projects/apache-beam-testing/locations/us-central1/jobs/2019-07-29_09_56_17-8158665006933192379?alt=json>: response: <{'vary': 'Origin, X-Origin, Referer', 'content-type': 'application/json; charset=UTF-8', 'date': 'Mon, 29 Jul 2019 17:04:37 GMT', 'server': 'ESF', 'cache-control': 'private', 'x-xss-protection': '0', 'x-frame-options': 'SAMEORIGIN', 'x-content-type-options': 'nosniff', 'transfer-encoding': 'chunked', 'status': '404', 'content-length': '279', '-content-encoding': 'gzip'}>, content <{
"error": {
"code": 404,
"message": "(56dded4fc317fbfa): Information about job 2019-07-29_09_56_17-8158665006933192379 could not be found in our system. Please double check the id is correct. If it is please contact customer support.",
"status": "NOT_FOUND"
}
}
>
Found: https://console.cloud.google.com/dataflow/jobsDetail/locations/us-central1/jobs/2019-07-29_09_12_33-1153570849090606732?project=apache-beam-testing.
Found: https://console.cloud.google.com/dataflow/jobsDetail/locations/us-central1/jobs/2019-07-29_09_22_25-17025732721872617316?project=apache-beam-testing.
<https://builds.apache.org/job/beam_PostCommit_Python37/ws/src/sdks/python/apache_beam/runners/dataflow/dataflow_runner.py>:686: BeamDeprecationWarning: BigQuerySink is deprecated since 2.11.0. Use WriteToBigQuery instead.
Found: https://console.cloud.google.com/dataflow/jobsDetail/locations/us-central1/jobs/2019-07-29_09_31_33-3429088545745425205?project=apache-beam-testing.
kms_key=transform.kms_key))
Found: https://console.cloud.google.com/dataflow/jobsDetail/locations/us-central1/jobs/2019-07-29_09_41_02-2656591801765888054?project=apache-beam-testing.
<https://builds.apache.org/job/beam_PostCommit_Python37/ws/src/sdks/python/apache_beam/io/gcp/bigquery_test.py>:572: BeamDeprecationWarning: options is deprecated since First stable release. References to <pipeline>.options will not be supported
streaming = self.test_pipeline.options.view_as(StandardOptions).streaming
<https://builds.apache.org/job/beam_PostCommit_Python37/ws/src/sdks/python/apache_beam/io/gcp/bigquery.py>:1150: BeamDeprecationWarning: options is deprecated since First stable release. References to <pipeline>.options will not be supported
experiments = p.options.view_as(DebugOptions).experiments or []
<https://builds.apache.org/job/beam_PostCommit_Python37/ws/src/sdks/python/apache_beam/io/fileio_test.py>:232: FutureWarning: MatchAll is experimental.
| 'GetPath' >> beam.Map(lambda metadata: metadata.path))
<https://builds.apache.org/job/beam_PostCommit_Python37/ws/src/sdks/python/apache_beam/io/fileio_test.py>:243: FutureWarning: MatchAll is experimental.
| 'Checksums' >> beam.Map(compute_hash))
<https://builds.apache.org/job/beam_PostCommit_Python37/ws/src/sdks/python/apache_beam/io/fileio_test.py>:243: FutureWarning: ReadMatches is experimental.
| 'Checksums' >> beam.Map(compute_hash))
Found: https://console.cloud.google.com/dataflow/jobsDetail/locations/us-central1/jobs/2019-07-29_09_12_34-1253476723782374428?project=apache-beam-testing.
<https://builds.apache.org/job/beam_PostCommit_Python37/ws/src/sdks/python/apache_beam/runners/dataflow/dataflow_runner.py>:686: BeamDeprecationWarning: BigQuerySink is deprecated since 2.11.0. Use WriteToBigQuery instead.
kms_key=transform.kms_key))
<https://builds.apache.org/job/beam_PostCommit_Python37/ws/src/sdks/python/apache_beam/io/gcp/big_query_query_to_table_pipeline.py>:73: BeamDeprecationWarning: BigQuerySink is deprecated since 2.11.0. Use WriteToBigQuery instead.
kms_key=kms_key))
Found: https://console.cloud.google.com/dataflow/jobsDetail/locations/us-central1/jobs/2019-07-29_09_23_35-18399626533738404855?project=apache-beam-testing.
Found: https://console.cloud.google.com/dataflow/jobsDetail/locations/us-central1/jobs/2019-07-29_09_32_03-877750766566216948?project=apache-beam-testing.
Found: https://console.cloud.google.com/dataflow/jobsDetail/locations/us-central1/jobs/2019-07-29_09_40_27-9666779233979159181?project=apache-beam-testing.
Found: https://console.cloud.google.com/dataflow/jobsDetail/locations/us-central1/jobs/2019-07-29_09_50_20-16656344792219670768?project=apache-beam-testing.
Found: https://console.cloud.google.com/dataflow/jobsDetail/locations/us-central1/jobs/2019-07-29_09_12_37-7578347070771101093?project=apache-beam-testing.
Found: https://console.cloud.google.com/dataflow/jobsDetail/locations/us-central1/jobs/2019-07-29_09_22_48-15373095152952845517?project=apache-beam-testing.
Found: https://console.cloud.google.com/dataflow/jobsDetail/locations/us-central1/jobs/2019-07-29_09_30_25-18361180125003725436?project=apache-beam-testing.
Found: https://console.cloud.google.com/dataflow/jobsDetail/locations/us-central1/jobs/2019-07-29_09_39_10-9211719399789921417?project=apache-beam-testing.
Found: https://console.cloud.google.com/dataflow/jobsDetail/locations/us-central1/jobs/2019-07-29_09_48_45-8268146640517563132?project=apache-beam-testing.
Found: https://console.cloud.google.com/dataflow/jobsDetail/locations/us-central1/jobs/2019-07-29_09_57_56-15638197133608346265?project=apache-beam-testing.
Found: https://console.cloud.google.com/dataflow/jobsDetail/locations/us-central1/jobs/2019-07-29_09_12_35-5165649351775344616?project=apache-beam-testing.
Found: https://console.cloud.google.com/dataflow/jobsDetail/locations/us-central1/jobs/2019-07-29_09_24_29-8350993304645462062?project=apache-beam-testing.
<https://builds.apache.org/job/beam_PostCommit_Python37/ws/src/sdks/python/apache_beam/io/gcp/bigquery.py>:1150: BeamDeprecationWarning: options is deprecated since First stable release. References to <pipeline>.options will not be supported
experiments = p.options.view_as(DebugOptions).experiments or []
Found: https://console.cloud.google.com/dataflow/jobsDetail/locations/us-central1/jobs/2019-07-29_09_36_47-855859294066556455?project=apache-beam-testing.
Found: https://console.cloud.google.com/dataflow/jobsDetail/locations/us-central1/jobs/2019-07-29_09_46_39-7109757960102448730?project=apache-beam-testing.
Found: https://console.cloud.google.com/dataflow/jobsDetail/locations/us-central1/jobs/2019-07-29_09_56_15-9457367387363853765?project=apache-beam-testing.
<https://builds.apache.org/job/beam_PostCommit_Python37/ws/src/sdks/python/apache_beam/io/gcp/bigquery_file_loads.py>:638: BeamDeprecationWarning: options is deprecated since First stable release. References to <pipeline>.options will not be supported
temp_location = p.options.view_as(GoogleCloudOptions).temp_location
----------------------------------------------------------------------
XML: nosetests-postCommitIT-df-py37.xml
----------------------------------------------------------------------
XML: <https://builds.apache.org/job/beam_PostCommit_Python37/ws/src/sdks/python/nosetests.xml>
----------------------------------------------------------------------
Ran 42 tests in 3277.265s
FAILED (SKIP=5, failures=1)
> Task :sdks:python:test-suites:dataflow:py37:postCommitIT FAILED
FAILURE: Build completed with 2 failures.
1: Task failed with an exception.
-----------
* Where:
Build file '<https://builds.apache.org/job/beam_PostCommit_Python37/ws/src/sdks/python/test-suites/direct/py37/build.gradle'> line: 49
* What went wrong:
Execution failed for task ':sdks:python:test-suites:direct:py37:postCommitIT'.
> Process 'command 'sh'' finished with non-zero exit value 1
* Try:
Run with --stacktrace option to get the stack trace. Run with --info or --debug option to get more log output. Run with --scan to get full insights.
==============================================================================
2: Task failed with an exception.
-----------
* Where:
Build file '<https://builds.apache.org/job/beam_PostCommit_Python37/ws/src/sdks/python/test-suites/dataflow/py37/build.gradle'> line: 80
* What went wrong:
Execution failed for task ':sdks:python:test-suites:dataflow:py37:postCommitIT'.
> Process 'command 'sh'' finished with non-zero exit value 1
* Try:
Run with --stacktrace option to get the stack trace. Run with --info or --debug option to get more log output. Run with --scan to get full insights.
==============================================================================
* Get more help at https://help.gradle.org
Deprecated Gradle features were used in this build, making it incompatible with Gradle 6.0.
Use '--warning-mode all' to show the individual deprecation warnings.
See https://docs.gradle.org/5.2.1/userguide/command_line_interface.html#sec:command_line_warnings
BUILD FAILED in 55m 52s
64 actionable tasks: 48 executed, 16 from cache
Publishing build scan...
https://gradle.com/s/ccnqrw6vltgku
Build step 'Invoke Gradle script' changed build result to FAILURE
Build step 'Invoke Gradle script' marked build as failure
---------------------------------------------------------------------
To unsubscribe, e-mail: builds-unsubscribe@beam.apache.org
For additional commands, e-mail: builds-help@beam.apache.org
Jenkins build is back to normal : beam_PostCommit_Python37 #81
Posted by Apache Jenkins Server <je...@builds.apache.org>.
See <https://builds.apache.org/job/beam_PostCommit_Python37/81/display/redirect?page=changes>
---------------------------------------------------------------------
To unsubscribe, e-mail: builds-unsubscribe@beam.apache.org
For additional commands, e-mail: builds-help@beam.apache.org
Build failed in Jenkins: beam_PostCommit_Python37 #80
Posted by Apache Jenkins Server <je...@builds.apache.org>.
See <https://builds.apache.org/job/beam_PostCommit_Python37/80/display/redirect?page=changes>
Changes:
[b_m.vishwas] [BEAM-7623] Add support to select MAP with Row as values in Beam SQL
------------------------------------------
[...truncated 299.67 KB...]
}
],
"is_wrapper": true
},
"output_name": "out",
"user_name": "add_attribute.out"
}
],
"parallel_input": {
"@type": "OutputReference",
"output_name": "out",
"step_name": "s2"
},
"serialized_fn": "ref_AppliedPTransform_add_attribute_5",
"user_name": "add_attribute"
}
},
{
"kind": "ParallelDo",
"name": "s4",
"properties": {
"display_data": [
{
"key": "fn",
"label": "Transform Function",
"namespace": "apache_beam.transforms.core.ParDo",
"shortValue": "CallableWrapperDoFn",
"type": "STRING",
"value": "apache_beam.transforms.core.CallableWrapperDoFn"
},
{
"key": "fn",
"label": "Transform Function",
"namespace": "apache_beam.transforms.core.CallableWrapperDoFn",
"type": "STRING",
"value": "to_proto_str"
}
],
"non_parallel_inputs": {},
"output_info": [
{
"encoding": {
"@type": "kind:windowed_value",
"component_encodings": [
{
"@type": "kind:bytes"
},
{
"@type": "kind:global_window"
}
],
"is_wrapper": true
},
"output_name": "out",
"user_name": "WriteToPubSub/ToProtobuf.out"
}
],
"parallel_input": {
"@type": "OutputReference",
"output_name": "out",
"step_name": "s3"
},
"serialized_fn": "ref_AppliedPTransform_WriteToPubSub/ToProtobuf_7",
"user_name": "WriteToPubSub/ToProtobuf"
}
},
{
"kind": "ParallelWrite",
"name": "s5",
"properties": {
"display_data": [],
"encoding": {
"@type": "kind:windowed_value",
"component_encodings": [
{
"@type": "kind:bytes"
},
{
"@type": "kind:global_window"
}
],
"is_wrapper": true
},
"format": "pubsub",
"parallel_input": {
"@type": "OutputReference",
"output_name": "out",
"step_name": "s4"
},
"pubsub_id_label": "id",
"pubsub_serialized_attributes_fn": "",
"pubsub_timestamp_label": "timestamp",
"pubsub_topic": "projects/apache-beam-testing/topics/psit_topic_output75f84f50-3f7b-4e2b-a3e5-e75a10e507f1",
"user_name": "WriteToPubSub/Write/NativeWrite"
}
}
],
"type": "JOB_TYPE_STREAMING"
}
root: INFO: Create job: <Job
createTime: '2019-07-29T18:58:21.212822Z'
currentStateTime: '1970-01-01T00:00:00Z'
id: '2019-07-29_11_58_20-439741093055160989'
location: 'us-central1'
name: 'beamapp-jenkins-0729185811-865814'
projectId: 'apache-beam-testing'
stageStates: []
startTime: '2019-07-29T18:58:21.212822Z'
steps: []
tempFiles: []
type: TypeValueValuesEnum(JOB_TYPE_STREAMING, 2)>
root: INFO: Created job with id: [2019-07-29_11_58_20-439741093055160989]
root: INFO: To access the Dataflow monitoring console, please navigate to https://console.cloud.google.com/dataflow/jobsDetail/locations/us-central1/jobs/2019-07-29_11_58_20-439741093055160989?project=apache-beam-testing
root: INFO: Job 2019-07-29_11_58_20-439741093055160989 is in state JOB_STATE_RUNNING
root: INFO: 2019-07-29T18:58:23.942Z: JOB_MESSAGE_DETAILED: Checking permissions granted to controller Service Account.
root: INFO: 2019-07-29T18:58:24.522Z: JOB_MESSAGE_BASIC: Worker configuration: n1-standard-4 in us-central1-a.
root: INFO: 2019-07-29T18:58:25.198Z: JOB_MESSAGE_DETAILED: Expanding SplittableParDo operations into optimizable parts.
root: INFO: 2019-07-29T18:58:25.201Z: JOB_MESSAGE_DETAILED: Expanding CollectionToSingleton operations into optimizable parts.
root: INFO: 2019-07-29T18:58:25.213Z: JOB_MESSAGE_DETAILED: Expanding CoGroupByKey operations into optimizable parts.
root: INFO: 2019-07-29T18:58:25.220Z: JOB_MESSAGE_DETAILED: Expanding SplittableProcessKeyed operations into optimizable parts.
root: INFO: 2019-07-29T18:58:25.224Z: JOB_MESSAGE_DETAILED: Expanding GroupByKey operations into streaming Read/Write steps
root: INFO: 2019-07-29T18:58:25.229Z: JOB_MESSAGE_DEBUG: Annotating graph with Autotuner information.
root: INFO: 2019-07-29T18:58:25.248Z: JOB_MESSAGE_DETAILED: Fusing adjacent ParDo, Read, Write, and Flatten operations
root: INFO: 2019-07-29T18:58:25.252Z: JOB_MESSAGE_DETAILED: Fusing consumer ReadFromPubSub/Map(_from_proto_str) into ReadFromPubSub/Read
root: INFO: 2019-07-29T18:58:25.256Z: JOB_MESSAGE_DETAILED: Fusing consumer WriteToPubSub/ToProtobuf into add_attribute
root: INFO: 2019-07-29T18:58:25.260Z: JOB_MESSAGE_DETAILED: Fusing consumer add_attribute into ReadFromPubSub/Map(_from_proto_str)
root: INFO: 2019-07-29T18:58:25.264Z: JOB_MESSAGE_DETAILED: Fusing consumer WriteToPubSub/Write/NativeWrite into WriteToPubSub/ToProtobuf
root: INFO: 2019-07-29T18:58:25.277Z: JOB_MESSAGE_BASIC: The pubsub read for: projects/apache-beam-testing/subscriptions/psit_subscription_input75f84f50-3f7b-4e2b-a3e5-e75a10e507f1 is configured to compute input data watermarks based on custom timestamp attribute timestamp. Cloud Dataflow has created an additional tracking subscription to do this, which will be cleaned up automatically. For details, see: https://cloud.google.com/dataflow/model/pubsub-io#timestamps-ids
root: INFO: 2019-07-29T18:58:25.279Z: JOB_MESSAGE_DEBUG: Adding StepResource setup and teardown to workflow graph.
root: INFO: 2019-07-29T18:58:25.326Z: JOB_MESSAGE_DEBUG: Adding workflow start and stop steps.
root: INFO: 2019-07-29T18:58:25.345Z: JOB_MESSAGE_DEBUG: Assigning stage ids.
root: INFO: 2019-07-29T18:58:25.540Z: JOB_MESSAGE_DEBUG: Executing wait step start2
root: INFO: 2019-07-29T18:58:25.559Z: JOB_MESSAGE_DEBUG: Starting worker pool setup.
root: INFO: 2019-07-29T18:58:25.569Z: JOB_MESSAGE_BASIC: Starting 1 workers...
root: INFO: 2019-07-29T18:58:27.344Z: JOB_MESSAGE_DETAILED: Pub/Sub resources set up for topic 'projects/apache-beam-testing/topics/psit_topic_input75f84f50-3f7b-4e2b-a3e5-e75a10e507f1'.
root: INFO: 2019-07-29T18:58:29.331Z: JOB_MESSAGE_BASIC: Executing operation ReadFromPubSub/Read+ReadFromPubSub/Map(_from_proto_str)+add_attribute+WriteToPubSub/ToProtobuf+WriteToPubSub/Write/NativeWrite
root: WARNING: Timing out on waiting for job 2019-07-29_11_58_20-439741093055160989 after 182 seconds
google.auth.transport._http_client: DEBUG: Making request: GET http://169.254.169.254
google.auth.transport._http_client: DEBUG: Making request: GET http://metadata.google.internal/computeMetadata/v1/project/project-id
google.auth.transport.requests: DEBUG: Making request: GET http://metadata.google.internal/computeMetadata/v1/instance/service-accounts/default/?recursive=true
urllib3.connectionpool: DEBUG: Starting new HTTP connection (1): metadata.google.internal:80
urllib3.connectionpool: DEBUG: http://metadata.google.internal:80 "GET /computeMetadata/v1/instance/service-accounts/default/?recursive=true HTTP/1.1" 200 144
google.auth.transport.requests: DEBUG: Making request: GET http://metadata.google.internal/computeMetadata/v1/instance/service-accounts/844138762903-compute@developer.gserviceaccount.com/token
urllib3.connectionpool: DEBUG: http://metadata.google.internal:80 "GET /computeMetadata/v1/instance/service-accounts/844138762903-compute@developer.gserviceaccount.com/token HTTP/1.1" 200 176
root: ERROR: Timeout after 300 sec. Received 0 messages from projects/apache-beam-testing/subscriptions/psit_subscription_output75f84f50-3f7b-4e2b-a3e5-e75a10e507f1.
--------------------- >> end captured logging << ---------------------
<https://builds.apache.org/job/beam_PostCommit_Python37/ws/src/sdks/python/apache_beam/runners/dataflow/dataflow_runner.py>:686: BeamDeprecationWarning: BigQuerySink is deprecated since 2.11.0. Use WriteToBigQuery instead.
kms_key=transform.kms_key))
Found: https://console.cloud.google.com/dataflow/jobsDetail/locations/us-central1/jobs/2019-07-29_11_26_21-2362307166382706658?project=apache-beam-testing.
Found: https://console.cloud.google.com/dataflow/jobsDetail/locations/us-central1/jobs/2019-07-29_11_50_04-10627403309185244461?project=apache-beam-testing.
Found: https://console.cloud.google.com/dataflow/jobsDetail/locations/us-central1/jobs/2019-07-29_11_58_20-439741093055160989?project=apache-beam-testing.
Found: https://console.cloud.google.com/dataflow/jobsDetail/locations/us-central1/jobs/2019-07-29_11_26_25-16319400763146412121?project=apache-beam-testing.
<https://builds.apache.org/job/beam_PostCommit_Python37/ws/src/sdks/python/apache_beam/io/gcp/bigquery.py>:1150: BeamDeprecationWarning: options is deprecated since First stable release. References to <pipeline>.options will not be supported
experiments = p.options.view_as(DebugOptions).experiments or []
Found: https://console.cloud.google.com/dataflow/jobsDetail/locations/us-central1/jobs/2019-07-29_11_42_27-944457793820176961?project=apache-beam-testing.
Found: https://console.cloud.google.com/dataflow/jobsDetail/locations/us-central1/jobs/2019-07-29_11_50_39-18161476792493181618?project=apache-beam-testing.
Found: https://console.cloud.google.com/dataflow/jobsDetail/locations/us-central1/jobs/2019-07-29_11_59_15-1674810652371334741?project=apache-beam-testing.
Found: https://console.cloud.google.com/dataflow/jobsDetail/locations/us-central1/jobs/2019-07-29_12_09_06-383415438963867343?project=apache-beam-testing.
Found: https://console.cloud.google.com/dataflow/jobsDetail/locations/us-central1/jobs/2019-07-29_11_26_24-1351911702818115571?project=apache-beam-testing.
<https://builds.apache.org/job/beam_PostCommit_Python37/ws/src/sdks/python/apache_beam/io/gcp/bigquery.py>:1150: BeamDeprecationWarning: options is deprecated since First stable release. References to <pipeline>.options will not be supported
Found: https://console.cloud.google.com/dataflow/jobsDetail/locations/us-central1/jobs/2019-07-29_11_39_15-9937855690695813721?project=apache-beam-testing.
experiments = p.options.view_as(DebugOptions).experiments or []
Found: https://console.cloud.google.com/dataflow/jobsDetail/locations/us-central1/jobs/2019-07-29_11_48_16-2223142060635969622?project=apache-beam-testing.
<https://builds.apache.org/job/beam_PostCommit_Python37/ws/src/sdks/python/apache_beam/io/gcp/bigquery_file_loads.py>:638: BeamDeprecationWarning: options is deprecated since First stable release. References to <pipeline>.options will not be supported
Found: https://console.cloud.google.com/dataflow/jobsDetail/locations/us-central1/jobs/2019-07-29_11_58_11-11262992747556541981?project=apache-beam-testing.
temp_location = p.options.view_as(GoogleCloudOptions).temp_location
Found: https://console.cloud.google.com/dataflow/jobsDetail/locations/us-central1/jobs/2019-07-29_11_26_22-12628488344689675804?project=apache-beam-testing.
<https://builds.apache.org/job/beam_PostCommit_Python37/ws/src/sdks/python/apache_beam/runners/dataflow/dataflow_runner.py>:686: BeamDeprecationWarning: BigQuerySink is deprecated since 2.11.0. Use WriteToBigQuery instead.
Found: https://console.cloud.google.com/dataflow/jobsDetail/locations/us-central1/jobs/2019-07-29_11_48_19-5549512355263787865?project=apache-beam-testing.
kms_key=transform.kms_key))
Found: https://console.cloud.google.com/dataflow/jobsDetail/locations/us-central1/jobs/2019-07-29_11_58_11-9229079292059453977?project=apache-beam-testing.
Found: https://console.cloud.google.com/dataflow/jobsDetail/locations/us-central1/jobs/2019-07-29_12_07_18-12759908313661965826?project=apache-beam-testing.
Found: https://console.cloud.google.com/dataflow/jobsDetail/locations/us-central1/jobs/2019-07-29_11_26_21-17001145458023264883?project=apache-beam-testing.
Found: https://console.cloud.google.com/dataflow/jobsDetail/locations/us-central1/jobs/2019-07-29_11_37_41-11502378860507417747?project=apache-beam-testing.
Found: https://console.cloud.google.com/dataflow/jobsDetail/locations/us-central1/jobs/2019-07-29_11_50_09-8725416255217643568?project=apache-beam-testing.
<https://builds.apache.org/job/beam_PostCommit_Python37/ws/src/sdks/python/apache_beam/io/gcp/bigquery.py>:1150: BeamDeprecationWarning: options is deprecated since First stable release. References to <pipeline>.options will not be supported
Found: https://console.cloud.google.com/dataflow/jobsDetail/locations/us-central1/jobs/2019-07-29_12_00_17-9974909034945534137?project=apache-beam-testing.
experiments = p.options.view_as(DebugOptions).experiments or []
<https://builds.apache.org/job/beam_PostCommit_Python37/ws/src/sdks/python/apache_beam/io/gcp/bigquery_file_loads.py>:638: BeamDeprecationWarning: options is deprecated since First stable release. References to <pipeline>.options will not be supported
temp_location = p.options.view_as(GoogleCloudOptions).temp_location
Found: https://console.cloud.google.com/dataflow/jobsDetail/locations/us-central1/jobs/2019-07-29_11_26_21-9663845930713219811?project=apache-beam-testing.
<https://builds.apache.org/job/beam_PostCommit_Python37/ws/src/sdks/python/apache_beam/runners/dataflow/dataflow_runner.py>:686: BeamDeprecationWarning: BigQuerySink is deprecated since 2.11.0. Use WriteToBigQuery instead.
Found: https://console.cloud.google.com/dataflow/jobsDetail/locations/us-central1/jobs/2019-07-29_11_36_03-5885121739174626801?project=apache-beam-testing.
Found: https://console.cloud.google.com/dataflow/jobsDetail/locations/us-central1/jobs/2019-07-29_11_46_20-13088583989824623917?project=apache-beam-testing.
Found: https://console.cloud.google.com/dataflow/jobsDetail/locations/us-central1/jobs/2019-07-29_11_55_34-17444631178041117192?project=apache-beam-testing.
kms_key=transform.kms_key))
<https://builds.apache.org/job/beam_PostCommit_Python37/ws/src/sdks/python/apache_beam/io/gcp/bigquery_test.py>:572: BeamDeprecationWarning: options is deprecated since First stable release. References to <pipeline>.options will not be supported
streaming = self.test_pipeline.options.view_as(StandardOptions).streaming
<https://builds.apache.org/job/beam_PostCommit_Python37/ws/src/sdks/python/apache_beam/io/gcp/bigquery.py>:1150: BeamDeprecationWarning: options is deprecated since First stable release. References to <pipeline>.options will not be supported
experiments = p.options.view_as(DebugOptions).experiments or []
<https://builds.apache.org/job/beam_PostCommit_Python37/ws/src/sdks/python/apache_beam/io/fileio_test.py>:232: FutureWarning: MatchAll is experimental.
| 'GetPath' >> beam.Map(lambda metadata: metadata.path))
<https://builds.apache.org/job/beam_PostCommit_Python37/ws/src/sdks/python/apache_beam/io/fileio_test.py>:243: FutureWarning: MatchAll is experimental.
| 'Checksums' >> beam.Map(compute_hash))
<https://builds.apache.org/job/beam_PostCommit_Python37/ws/src/sdks/python/apache_beam/io/fileio_test.py>:243: FutureWarning: ReadMatches is experimental.
| 'Checksums' >> beam.Map(compute_hash))
Found: https://console.cloud.google.com/dataflow/jobsDetail/locations/us-central1/jobs/2019-07-29_11_26_24-12693082036386694800?project=apache-beam-testing.
Found: https://console.cloud.google.com/dataflow/jobsDetail/locations/us-central1/jobs/2019-07-29_11_36_39-17660716350221015570?project=apache-beam-testing.
Found: https://console.cloud.google.com/dataflow/jobsDetail/locations/us-central1/jobs/2019-07-29_11_46_00-6866439536667358100?project=apache-beam-testing.
Found: https://console.cloud.google.com/dataflow/jobsDetail/locations/us-central1/jobs/2019-07-29_11_54_56-1187498908195518356?project=apache-beam-testing.
Found: https://console.cloud.google.com/dataflow/jobsDetail/locations/us-central1/jobs/2019-07-29_12_05_41-5675105801940167637?project=apache-beam-testing.
Found: https://console.cloud.google.com/dataflow/jobsDetail/locations/us-central1/jobs/2019-07-29_12_15_14-8826698086867202682?project=apache-beam-testing.
Found: https://console.cloud.google.com/dataflow/jobsDetail/locations/us-central1/jobs/2019-07-29_11_26_23-10393878284076236041?project=apache-beam-testing.
<https://builds.apache.org/job/beam_PostCommit_Python37/ws/src/sdks/python/apache_beam/runners/dataflow/dataflow_runner.py>:686: BeamDeprecationWarning: BigQuerySink is deprecated since 2.11.0. Use WriteToBigQuery instead.
kms_key=transform.kms_key))
Found: https://console.cloud.google.com/dataflow/jobsDetail/locations/us-central1/jobs/2019-07-29_11_37_30-7217485388143992264?project=apache-beam-testing.
<https://builds.apache.org/job/beam_PostCommit_Python37/ws/src/sdks/python/apache_beam/io/gcp/big_query_query_to_table_pipeline.py>:73: BeamDeprecationWarning: BigQuerySink is deprecated since 2.11.0. Use WriteToBigQuery instead.
kms_key=kms_key))
Found: https://console.cloud.google.com/dataflow/jobsDetail/locations/us-central1/jobs/2019-07-29_11_38_01-4581187788406281666?project=apache-beam-testing.
Found: https://console.cloud.google.com/dataflow/jobsDetail/locations/us-central1/jobs/2019-07-29_11_46_18-2113808349072242469?project=apache-beam-testing.
Found: https://console.cloud.google.com/dataflow/jobsDetail/locations/us-central1/jobs/2019-07-29_11_58_20-2295431719941525162?project=apache-beam-testing.
----------------------------------------------------------------------
XML: nosetests-postCommitIT-df-py37.xml
----------------------------------------------------------------------
XML: <https://builds.apache.org/job/beam_PostCommit_Python37/ws/src/sdks/python/nosetests.xml>
----------------------------------------------------------------------
Ran 42 tests in 3458.218s
FAILED (SKIP=5, failures=2)
> Task :sdks:python:test-suites:dataflow:py37:postCommitIT FAILED
FAILURE: Build failed with an exception.
* Where:
Build file '<https://builds.apache.org/job/beam_PostCommit_Python37/ws/src/sdks/python/test-suites/dataflow/py37/build.gradle'> line: 80
* What went wrong:
Execution failed for task ':sdks:python:test-suites:dataflow:py37:postCommitIT'.
> Process 'command 'sh'' finished with non-zero exit value 1
* Try:
Run with --stacktrace option to get the stack trace. Run with --info or --debug option to get more log output. Run with --scan to get full insights.
* Get more help at https://help.gradle.org
Deprecated Gradle features were used in this build, making it incompatible with Gradle 6.0.
Use '--warning-mode all' to show the individual deprecation warnings.
See https://docs.gradle.org/5.2.1/userguide/command_line_interface.html#sec:command_line_warnings
BUILD FAILED in 58m 37s
64 actionable tasks: 47 executed, 17 from cache
Publishing build scan...
https://gradle.com/s/bv3mi7tsjsl7i
Build step 'Invoke Gradle script' changed build result to FAILURE
Build step 'Invoke Gradle script' marked build as failure
---------------------------------------------------------------------
To unsubscribe, e-mail: builds-unsubscribe@beam.apache.org
For additional commands, e-mail: builds-help@beam.apache.org
Build failed in Jenkins: beam_PostCommit_Python37 #79
Posted by Apache Jenkins Server <je...@builds.apache.org>.
See <https://builds.apache.org/job/beam_PostCommit_Python37/79/display/redirect?page=changes>
Changes:
[iemejia] [BEAM-7807] Forbid TestNG imports on Beam classes
[iemejia] [BEAM-7807] Update Beam tests to not import TestNG related classes
[alireza4263] [BEAM-7783] BeamIOSourceRel using custom BeamStatistics
[pabloem] [BEAM-7814] Make BigqueryMatcher wait for results. (#9154)
------------------------------------------
[...truncated 559.19 KB...]
File "apache_beam/runners/common.py", line 610, in apache_beam.runners.common.PerWindowInvoker.invoke_process
File "apache_beam/runners/common.py", line 683, in apache_beam.runners.common.PerWindowInvoker._invoke_process_per_window
File "/usr/local/lib/python3.7/site-packages/apache_beam/io/gcp/bigquery_file_loads.py", line 447, in process
'BigQuery jobs failed. BQ error: %s', self._latest_error)
Exception: ('BigQuery jobs failed. BQ error: %s', <JobStatus
errorResult: <ErrorProto
message: 'Not found: Table apache-beam-testing:python_bq_file_loads_15644212118811.beam_load_2019_07_29_173254_13_70022e7829d624ab3408fff746262e16_1564421618 was not found in location US'
reason: 'notFound'>
errors: [<ErrorProto
message: 'Not found: Table apache-beam-testing:python_bq_file_loads_15644212118811.beam_load_2019_07_29_173254_13_70022e7829d624ab3408fff746262e16_1564421618 was not found in location US'
reason: 'notFound'>]
state: 'DONE'>)
During handling of the above exception, another exception occurred:
Traceback (most recent call last):
File "/usr/local/lib/python3.7/site-packages/dataflow_worker/batchworker.py", line 649, in do_work
work_executor.execute()
File "/usr/local/lib/python3.7/site-packages/dataflow_worker/executor.py", line 176, in execute
op.start()
File "dataflow_worker/native_operations.py", line 38, in dataflow_worker.native_operations.NativeReadOperation.start
File "dataflow_worker/native_operations.py", line 39, in dataflow_worker.native_operations.NativeReadOperation.start
File "dataflow_worker/native_operations.py", line 44, in dataflow_worker.native_operations.NativeReadOperation.start
File "dataflow_worker/native_operations.py", line 54, in dataflow_worker.native_operations.NativeReadOperation.start
File "apache_beam/runners/worker/operations.py", line 256, in apache_beam.runners.worker.operations.Operation.output
File "apache_beam/runners/worker/operations.py", line 143, in apache_beam.runners.worker.operations.SingletonConsumerSet.receive
File "apache_beam/runners/worker/operations.py", line 593, in apache_beam.runners.worker.operations.DoOperation.process
File "apache_beam/runners/worker/operations.py", line 594, in apache_beam.runners.worker.operations.DoOperation.process
File "apache_beam/runners/common.py", line 799, in apache_beam.runners.common.DoFnRunner.receive
File "apache_beam/runners/common.py", line 805, in apache_beam.runners.common.DoFnRunner.process
File "apache_beam/runners/common.py", line 872, in apache_beam.runners.common.DoFnRunner._reraise_augmented
File "/usr/local/lib/python3.7/site-packages/future/utils/__init__.py", line 421, in raise_with_traceback
raise exc.with_traceback(traceback)
File "apache_beam/runners/common.py", line 803, in apache_beam.runners.common.DoFnRunner.process
File "apache_beam/runners/common.py", line 610, in apache_beam.runners.common.PerWindowInvoker.invoke_process
File "apache_beam/runners/common.py", line 683, in apache_beam.runners.common.PerWindowInvoker._invoke_process_per_window
File "/usr/local/lib/python3.7/site-packages/apache_beam/io/gcp/bigquery_file_loads.py", line 447, in process
'BigQuery jobs failed. BQ error: %s', self._latest_error)
Exception: ("BigQuery jobs failed. BQ error: %s [while running 'WriteWithMultipleDestsFreely/BigQueryBatchFileLoads/WaitForCopyJobs/WaitForCopyJobs']", <JobStatus
errorResult: <ErrorProto
message: 'Not found: Table apache-beam-testing:python_bq_file_loads_15644212118811.beam_load_2019_07_29_173254_13_70022e7829d624ab3408fff746262e16_1564421618 was not found in location US'
reason: 'notFound'>
errors: [<ErrorProto
message: 'Not found: Table apache-beam-testing:python_bq_file_loads_15644212118811.beam_load_2019_07_29_173254_13_70022e7829d624ab3408fff746262e16_1564421618 was not found in location US'
reason: 'notFound'>]
state: 'DONE'>)
root: INFO: 2019-07-29T17:34:33.700Z: JOB_MESSAGE_BASIC: Finished operation WriteWithMultipleDests/BigQueryBatchFileLoads/ImpulseMonitorLoadJobs/Read+WriteWithMultipleDests/BigQueryBatchFileLoads/WaitForLoadJobs/WaitForLoadJobs+WriteWithMultipleDests/BigQueryBatchFileLoads/ParDo(TriggerCopyJobs)/ParDo(TriggerCopyJobs)
root: INFO: 2019-07-29T17:34:33.799Z: JOB_MESSAGE_DEBUG: Value "WriteWithMultipleDests/BigQueryBatchFileLoads/ParDo(TriggerCopyJobs).out" materialized.
root: INFO: 2019-07-29T17:34:33.895Z: JOB_MESSAGE_BASIC: Executing operation WriteWithMultipleDests/BigQueryBatchFileLoads/WaitForCopyJobs/_UnpickledSideInput(ParDo(TriggerCopyJobs).out.0)
root: INFO: 2019-07-29T17:34:33.955Z: JOB_MESSAGE_BASIC: Finished operation WriteWithMultipleDests/BigQueryBatchFileLoads/WaitForCopyJobs/_UnpickledSideInput(ParDo(TriggerCopyJobs).out.0)
root: INFO: 2019-07-29T17:34:34.050Z: JOB_MESSAGE_DEBUG: Value "WriteWithMultipleDests/BigQueryBatchFileLoads/WaitForCopyJobs/_UnpickledSideInput(ParDo(TriggerCopyJobs).out.0).output" materialized.
root: INFO: 2019-07-29T17:34:34.131Z: JOB_MESSAGE_BASIC: Executing operation WriteWithMultipleDests/BigQueryBatchFileLoads/ImpulseMonitorCopyJobs/Read+WriteWithMultipleDests/BigQueryBatchFileLoads/WaitForCopyJobs/WaitForCopyJobs+WriteWithMultipleDests/BigQueryBatchFileLoads/RemoveTempTables/PassTables/PassTables+WriteWithMultipleDests/BigQueryBatchFileLoads/RemoveTempTables/AddUselessValue+WriteWithMultipleDests/BigQueryBatchFileLoads/RemoveTempTables/DeduplicateTables/Reify+WriteWithMultipleDests/BigQueryBatchFileLoads/RemoveTempTables/DeduplicateTables/Write
root: INFO: 2019-07-29T17:34:35.581Z: JOB_MESSAGE_ERROR: Traceback (most recent call last):
File "apache_beam/runners/common.py", line 803, in apache_beam.runners.common.DoFnRunner.process
File "apache_beam/runners/common.py", line 610, in apache_beam.runners.common.PerWindowInvoker.invoke_process
File "apache_beam/runners/common.py", line 683, in apache_beam.runners.common.PerWindowInvoker._invoke_process_per_window
File "/usr/local/lib/python3.7/site-packages/apache_beam/io/gcp/bigquery_file_loads.py", line 447, in process
'BigQuery jobs failed. BQ error: %s', self._latest_error)
Exception: ('BigQuery jobs failed. BQ error: %s', <JobStatus
errorResult: <ErrorProto
message: 'Not found: Table apache-beam-testing:python_bq_file_loads_15644212118811.beam_load_2019_07_29_173254_13_70022e7829d624ab3408fff746262e16_1564421618 was not found in location US'
reason: 'notFound'>
errors: [<ErrorProto
message: 'Not found: Table apache-beam-testing:python_bq_file_loads_15644212118811.beam_load_2019_07_29_173254_13_70022e7829d624ab3408fff746262e16_1564421618 was not found in location US'
reason: 'notFound'>]
state: 'DONE'>)
During handling of the above exception, another exception occurred:
Traceback (most recent call last):
File "/usr/local/lib/python3.7/site-packages/dataflow_worker/batchworker.py", line 649, in do_work
work_executor.execute()
File "/usr/local/lib/python3.7/site-packages/dataflow_worker/executor.py", line 176, in execute
op.start()
File "dataflow_worker/native_operations.py", line 38, in dataflow_worker.native_operations.NativeReadOperation.start
File "dataflow_worker/native_operations.py", line 39, in dataflow_worker.native_operations.NativeReadOperation.start
File "dataflow_worker/native_operations.py", line 44, in dataflow_worker.native_operations.NativeReadOperation.start
File "dataflow_worker/native_operations.py", line 54, in dataflow_worker.native_operations.NativeReadOperation.start
File "apache_beam/runners/worker/operations.py", line 256, in apache_beam.runners.worker.operations.Operation.output
File "apache_beam/runners/worker/operations.py", line 143, in apache_beam.runners.worker.operations.SingletonConsumerSet.receive
File "apache_beam/runners/worker/operations.py", line 593, in apache_beam.runners.worker.operations.DoOperation.process
File "apache_beam/runners/worker/operations.py", line 594, in apache_beam.runners.worker.operations.DoOperation.process
File "apache_beam/runners/common.py", line 799, in apache_beam.runners.common.DoFnRunner.receive
File "apache_beam/runners/common.py", line 805, in apache_beam.runners.common.DoFnRunner.process
File "apache_beam/runners/common.py", line 872, in apache_beam.runners.common.DoFnRunner._reraise_augmented
File "/usr/local/lib/python3.7/site-packages/future/utils/__init__.py", line 421, in raise_with_traceback
raise exc.with_traceback(traceback)
File "apache_beam/runners/common.py", line 803, in apache_beam.runners.common.DoFnRunner.process
File "apache_beam/runners/common.py", line 610, in apache_beam.runners.common.PerWindowInvoker.invoke_process
File "apache_beam/runners/common.py", line 683, in apache_beam.runners.common.PerWindowInvoker._invoke_process_per_window
File "/usr/local/lib/python3.7/site-packages/apache_beam/io/gcp/bigquery_file_loads.py", line 447, in process
'BigQuery jobs failed. BQ error: %s', self._latest_error)
Exception: ("BigQuery jobs failed. BQ error: %s [while running 'WriteWithMultipleDestsFreely/BigQueryBatchFileLoads/WaitForCopyJobs/WaitForCopyJobs']", <JobStatus
errorResult: <ErrorProto
message: 'Not found: Table apache-beam-testing:python_bq_file_loads_15644212118811.beam_load_2019_07_29_173254_13_70022e7829d624ab3408fff746262e16_1564421618 was not found in location US'
reason: 'notFound'>
errors: [<ErrorProto
message: 'Not found: Table apache-beam-testing:python_bq_file_loads_15644212118811.beam_load_2019_07_29_173254_13_70022e7829d624ab3408fff746262e16_1564421618 was not found in location US'
reason: 'notFound'>]
state: 'DONE'>)
root: INFO: 2019-07-29T17:34:35.618Z: JOB_MESSAGE_BASIC: Finished operation WriteWithMultipleDestsFreely/BigQueryBatchFileLoads/ImpulseMonitorCopyJobs/Read+WriteWithMultipleDestsFreely/BigQueryBatchFileLoads/WaitForCopyJobs/WaitForCopyJobs+WriteWithMultipleDestsFreely/BigQueryBatchFileLoads/RemoveTempTables/PassTables/PassTables+WriteWithMultipleDestsFreely/BigQueryBatchFileLoads/RemoveTempTables/AddUselessValue+WriteWithMultipleDestsFreely/BigQueryBatchFileLoads/RemoveTempTables/DeduplicateTables/Reify+WriteWithMultipleDestsFreely/BigQueryBatchFileLoads/RemoveTempTables/DeduplicateTables/Write
root: INFO: 2019-07-29T17:34:35.708Z: JOB_MESSAGE_DEBUG: Executing failure step failure91
root: INFO: 2019-07-29T17:34:35.756Z: JOB_MESSAGE_ERROR: Workflow failed. Causes: S47:WriteWithMultipleDestsFreely/BigQueryBatchFileLoads/ImpulseMonitorCopyJobs/Read+WriteWithMultipleDestsFreely/BigQueryBatchFileLoads/WaitForCopyJobs/WaitForCopyJobs+WriteWithMultipleDestsFreely/BigQueryBatchFileLoads/RemoveTempTables/PassTables/PassTables+WriteWithMultipleDestsFreely/BigQueryBatchFileLoads/RemoveTempTables/AddUselessValue+WriteWithMultipleDestsFreely/BigQueryBatchFileLoads/RemoveTempTables/DeduplicateTables/Reify+WriteWithMultipleDestsFreely/BigQueryBatchFileLoads/RemoveTempTables/DeduplicateTables/Write failed., The job failed because a work item has failed 4 times. Look in previous log entries for the cause of each one of the 4 failures. For more information, see https://cloud.google.com/dataflow/docs/guides/common-errors. The work item was attempted on these workers:
beamapp-jenkins-072917265-07291027-hxmg-harness-29g5,
beamapp-jenkins-072917265-07291027-hxmg-harness-29g5,
beamapp-jenkins-072917265-07291027-hxmg-harness-29g5,
beamapp-jenkins-072917265-07291027-hxmg-harness-29g5
root: INFO: 2019-07-29T17:34:35.914Z: JOB_MESSAGE_BASIC: Finished operation WriteWithMultipleDests/BigQueryBatchFileLoads/ImpulseMonitorCopyJobs/Read+WriteWithMultipleDests/BigQueryBatchFileLoads/WaitForCopyJobs/WaitForCopyJobs+WriteWithMultipleDests/BigQueryBatchFileLoads/RemoveTempTables/PassTables/PassTables+WriteWithMultipleDests/BigQueryBatchFileLoads/RemoveTempTables/AddUselessValue+WriteWithMultipleDests/BigQueryBatchFileLoads/RemoveTempTables/DeduplicateTables/Reify+WriteWithMultipleDests/BigQueryBatchFileLoads/RemoveTempTables/DeduplicateTables/Write
root: INFO: 2019-07-29T17:34:36.081Z: JOB_MESSAGE_DETAILED: Cleaning up.
root: INFO: 2019-07-29T17:34:36.193Z: JOB_MESSAGE_DEBUG: Starting worker pool teardown.
root: INFO: 2019-07-29T17:34:36.231Z: JOB_MESSAGE_BASIC: Stopping worker pool...
root: INFO: 2019-07-29T17:37:23.274Z: JOB_MESSAGE_DETAILED: Autoscaling: Reduced the number of workers to 0 based on the rate of progress in the currently running step(s).
root: INFO: 2019-07-29T17:37:23.364Z: JOB_MESSAGE_BASIC: Worker pool stopped.
root: INFO: 2019-07-29T17:37:23.411Z: JOB_MESSAGE_DEBUG: Tearing down pending resources...
root: INFO: Job 2019-07-29_10_27_03-1376663787346676775 is in state JOB_STATE_FAILED
root: INFO: Deleting dataset python_bq_file_loads_15644212118811 in project apache-beam-testing
--------------------- >> end captured logging << ---------------------
<https://builds.apache.org/job/beam_PostCommit_Python37/ws/src/sdks/python/apache_beam/io/gcp/bigquery.py>:1150: BeamDeprecationWarning: options is deprecated since First stable release. References to <pipeline>.options will not be supported
Found: https://console.cloud.google.com/dataflow/jobsDetail/locations/us-central1/jobs/2019-07-29_10_16_34-6083316589704241900?project=apache-beam-testing.
experiments = p.options.view_as(DebugOptions).experiments or []
Found: https://console.cloud.google.com/dataflow/jobsDetail/locations/us-central1/jobs/2019-07-29_10_31_14-11621058008888262551?project=apache-beam-testing.
Found: https://console.cloud.google.com/dataflow/jobsDetail/locations/us-central1/jobs/2019-07-29_10_41_05-11281258556403149368?project=apache-beam-testing.
Found: https://console.cloud.google.com/dataflow/jobsDetail/locations/us-central1/jobs/2019-07-29_10_49_56-3670624071711804372?project=apache-beam-testing.
Found: https://console.cloud.google.com/dataflow/jobsDetail/locations/us-central1/jobs/2019-07-29_10_58_37-18026017018869700754?project=apache-beam-testing.
Found: https://console.cloud.google.com/dataflow/jobsDetail/locations/us-central1/jobs/2019-07-29_10_16_32-11866785947657227040?project=apache-beam-testing.
<https://builds.apache.org/job/beam_PostCommit_Python37/ws/src/sdks/python/apache_beam/runners/dataflow/dataflow_runner.py>:686: BeamDeprecationWarning: BigQuerySink is deprecated since 2.11.0. Use WriteToBigQuery instead.
kms_key=transform.kms_key))
Found: https://console.cloud.google.com/dataflow/jobsDetail/locations/us-central1/jobs/2019-07-29_10_40_39-16597314048025807016?project=apache-beam-testing.
Found: https://console.cloud.google.com/dataflow/jobsDetail/locations/us-central1/jobs/2019-07-29_10_51_12-14498282017794147634?project=apache-beam-testing.
Found: https://console.cloud.google.com/dataflow/jobsDetail/locations/us-central1/jobs/2019-07-29_11_00_45-15964906274215934289?project=apache-beam-testing.
Found: https://console.cloud.google.com/dataflow/jobsDetail/locations/us-central1/jobs/2019-07-29_10_16_33-11636709628751879806?project=apache-beam-testing.
Found: https://console.cloud.google.com/dataflow/jobsDetail/locations/us-central1/jobs/2019-07-29_10_30_20-12918297405955617357?project=apache-beam-testing.
<https://builds.apache.org/job/beam_PostCommit_Python37/ws/src/sdks/python/apache_beam/io/gcp/bigquery.py>:1150: BeamDeprecationWarning: options is deprecated since First stable release. References to <pipeline>.options will not be supported
Found: https://console.cloud.google.com/dataflow/jobsDetail/locations/us-central1/jobs/2019-07-29_10_40_31-8292458858253560365?project=apache-beam-testing.
experiments = p.options.view_as(DebugOptions).experiments or []
Found: https://console.cloud.google.com/dataflow/jobsDetail/locations/us-central1/jobs/2019-07-29_10_50_41-9109597452893282384?project=apache-beam-testing.
<https://builds.apache.org/job/beam_PostCommit_Python37/ws/src/sdks/python/apache_beam/io/gcp/bigquery_file_loads.py>:638: BeamDeprecationWarning: options is deprecated since First stable release. References to <pipeline>.options will not be supported
temp_location = p.options.view_as(GoogleCloudOptions).temp_location
Found: https://console.cloud.google.com/dataflow/jobsDetail/locations/us-central1/jobs/2019-07-29_10_16_31-8506969594525490518?project=apache-beam-testing.
Found: https://console.cloud.google.com/dataflow/jobsDetail/locations/us-central1/jobs/2019-07-29_10_41_22-17820499433329625860?project=apache-beam-testing.
Found: https://console.cloud.google.com/dataflow/jobsDetail/locations/us-central1/jobs/2019-07-29_10_49_36-7939102856431528061?project=apache-beam-testing.
Found: https://console.cloud.google.com/dataflow/jobsDetail/locations/us-central1/jobs/2019-07-29_10_16_32-1762185294938580216?project=apache-beam-testing.
<https://builds.apache.org/job/beam_PostCommit_Python37/ws/src/sdks/python/apache_beam/io/gcp/bigquery_test.py>:572: BeamDeprecationWarning: options is deprecated since First stable release. References to <pipeline>.options will not be supported
streaming = self.test_pipeline.options.view_as(StandardOptions).streaming
Found: https://console.cloud.google.com/dataflow/jobsDetail/locations/us-central1/jobs/2019-07-29_10_25_53-9265974275702023642?project=apache-beam-testing.
Found: https://console.cloud.google.com/dataflow/jobsDetail/locations/us-central1/jobs/2019-07-29_10_36_05-6925165053850288234?project=apache-beam-testing.
Found: https://console.cloud.google.com/dataflow/jobsDetail/locations/us-central1/jobs/2019-07-29_10_46_08-161172153055500750?project=apache-beam-testing.
<https://builds.apache.org/job/beam_PostCommit_Python37/ws/src/sdks/python/apache_beam/io/gcp/bigquery.py>:1150: BeamDeprecationWarning: options is deprecated since First stable release. References to <pipeline>.options will not be supported
experiments = p.options.view_as(DebugOptions).experiments or []
<https://builds.apache.org/job/beam_PostCommit_Python37/ws/src/sdks/python/apache_beam/io/fileio_test.py>:232: FutureWarning: MatchAll is experimental.
| 'GetPath' >> beam.Map(lambda metadata: metadata.path))
<https://builds.apache.org/job/beam_PostCommit_Python37/ws/src/sdks/python/apache_beam/io/fileio_test.py>:243: FutureWarning: MatchAll is experimental.
| 'Checksums' >> beam.Map(compute_hash))
<https://builds.apache.org/job/beam_PostCommit_Python37/ws/src/sdks/python/apache_beam/io/fileio_test.py>:243: FutureWarning: ReadMatches is experimental.
| 'Checksums' >> beam.Map(compute_hash))
Found: https://console.cloud.google.com/dataflow/jobsDetail/locations/us-central1/jobs/2019-07-29_10_16_31-14937389643902729190?project=apache-beam-testing.
Found: https://console.cloud.google.com/dataflow/jobsDetail/locations/us-central1/jobs/2019-07-29_10_25_53-12005116961934054627?project=apache-beam-testing.
Found: https://console.cloud.google.com/dataflow/jobsDetail/locations/us-central1/jobs/2019-07-29_10_34_59-8662343688141294826?project=apache-beam-testing.
<https://builds.apache.org/job/beam_PostCommit_Python37/ws/src/sdks/python/apache_beam/runners/dataflow/dataflow_runner.py>:686: BeamDeprecationWarning: BigQuerySink is deprecated since 2.11.0. Use WriteToBigQuery instead.
kms_key=transform.kms_key))
Found: https://console.cloud.google.com/dataflow/jobsDetail/locations/us-central1/jobs/2019-07-29_10_45_20-18117829301668528680?project=apache-beam-testing.
Found: https://console.cloud.google.com/dataflow/jobsDetail/locations/us-central1/jobs/2019-07-29_10_55_11-17064440992479956835?project=apache-beam-testing.
Found: https://console.cloud.google.com/dataflow/jobsDetail/locations/us-central1/jobs/2019-07-29_11_04_43-4827674394683465790?project=apache-beam-testing.
Found: https://console.cloud.google.com/dataflow/jobsDetail/locations/us-central1/jobs/2019-07-29_10_16_32-13659585956198580103?project=apache-beam-testing.
Found: https://console.cloud.google.com/dataflow/jobsDetail/locations/us-central1/jobs/2019-07-29_10_27_03-1376663787346676775?project=apache-beam-testing.
<https://builds.apache.org/job/beam_PostCommit_Python37/ws/src/sdks/python/apache_beam/io/gcp/bigquery.py>:1150: BeamDeprecationWarning: options is deprecated since First stable release. References to <pipeline>.options will not be supported
Found: https://console.cloud.google.com/dataflow/jobsDetail/locations/us-central1/jobs/2019-07-29_10_37_46-10627101044743539289?project=apache-beam-testing.
Found: https://console.cloud.google.com/dataflow/jobsDetail/locations/us-central1/jobs/2019-07-29_10_47_36-3417479109377768390?project=apache-beam-testing.
experiments = p.options.view_as(DebugOptions).experiments or []
<https://builds.apache.org/job/beam_PostCommit_Python37/ws/src/sdks/python/apache_beam/io/gcp/bigquery_file_loads.py>:638: BeamDeprecationWarning: options is deprecated since First stable release. References to <pipeline>.options will not be supported
temp_location = p.options.view_as(GoogleCloudOptions).temp_location
Found: https://console.cloud.google.com/dataflow/jobsDetail/locations/us-central1/jobs/2019-07-29_10_16_44-2549688761115778446?project=apache-beam-testing.
Found: https://console.cloud.google.com/dataflow/jobsDetail/locations/us-central1/jobs/2019-07-29_10_26_02-4898269836476495956?project=apache-beam-testing.
Found: https://console.cloud.google.com/dataflow/jobsDetail/locations/us-central1/jobs/2019-07-29_10_35_39-14501262455222274840?project=apache-beam-testing.
Found: https://console.cloud.google.com/dataflow/jobsDetail/locations/us-central1/jobs/2019-07-29_10_44_22-14805126353448162480?project=apache-beam-testing.
Found: https://console.cloud.google.com/dataflow/jobsDetail/locations/us-central1/jobs/2019-07-29_10_54_54-4779033689261288354?project=apache-beam-testing.
Exception in thread Thread-6:
Traceback (most recent call last):
File "/usr/lib/python3.7/threading.py", line 917, in _bootstrap_inner
self.run()
File "/usr/lib/python3.7/threading.py", line 865, in run
self._target(*self._args, **self._kwargs)
File "<https://builds.apache.org/job/beam_PostCommit_Python37/ws/src/sdks/python/apache_beam/runners/dataflow/dataflow_runner.py",> line 157, in poll_for_job_completion
response = runner.dataflow_client.get_job(job_id)
File "<https://builds.apache.org/job/beam_PostCommit_Python37/ws/src/sdks/python/apache_beam/utils/retry.py",> line 197, in wrapper
return fun(*args, **kwargs)
File "<https://builds.apache.org/job/beam_PostCommit_Python37/ws/src/sdks/python/apache_beam/runners/dataflow/internal/apiclient.py",> line 670, in get_job
response = self._client.projects_locations_jobs.Get(request)
File "<https://builds.apache.org/job/beam_PostCommit_Python37/ws/src/sdks/python/apache_beam/runners/dataflow/internal/clients/dataflow/dataflow_v1b3_client.py",> line 689, in Get
config, request, global_params=global_params)
File "<https://builds.apache.org/job/beam_PostCommit_Python37/ws/src/build/gradleenv/-1734967052/lib/python3.7/site-packages/apitools/base/py/base_api.py",> line 731, in _RunMethod
return self.ProcessHttpResponse(method_config, http_response, request)
File "<https://builds.apache.org/job/beam_PostCommit_Python37/ws/src/build/gradleenv/-1734967052/lib/python3.7/site-packages/apitools/base/py/base_api.py",> line 737, in ProcessHttpResponse
self.__ProcessHttpResponse(method_config, http_response, request))
File "<https://builds.apache.org/job/beam_PostCommit_Python37/ws/src/build/gradleenv/-1734967052/lib/python3.7/site-packages/apitools/base/py/base_api.py",> line 604, in __ProcessHttpResponse
http_response, method_config=method_config, request=request)
apitools.base.py.exceptions.HttpNotFoundError: HttpError accessing <https://dataflow.googleapis.com/v1b3/projects/apache-beam-testing/locations/us-central1/jobs/2019-07-29_10_16_44-2549688761115778446?alt=json>: response: <{'vary': 'Origin, X-Origin, Referer', 'content-type': 'application/json; charset=UTF-8', 'date': 'Mon, 29 Jul 2019 17:19:54 GMT', 'server': 'ESF', 'cache-control': 'private', 'x-xss-protection': '0', 'x-frame-options': 'SAMEORIGIN', 'x-content-type-options': 'nosniff', 'transfer-encoding': 'chunked', 'status': '404', 'content-length': '279', '-content-encoding': 'gzip'}>, content <{
"error": {
"code": 404,
"message": "(6f6153209108d8a3): Information about job 2019-07-29_10_16_44-2549688761115778446 could not be found in our system. Please double check the id is correct. If it is please contact customer support.",
"status": "NOT_FOUND"
}
}
>
<https://builds.apache.org/job/beam_PostCommit_Python37/ws/src/sdks/python/apache_beam/runners/dataflow/dataflow_runner.py>:686: BeamDeprecationWarning: BigQuerySink is deprecated since 2.11.0. Use WriteToBigQuery instead.
kms_key=transform.kms_key))
<https://builds.apache.org/job/beam_PostCommit_Python37/ws/src/sdks/python/apache_beam/io/gcp/big_query_query_to_table_pipeline.py>:73: BeamDeprecationWarning: BigQuerySink is deprecated since 2.11.0. Use WriteToBigQuery instead.
kms_key=kms_key))
----------------------------------------------------------------------
XML: nosetests-postCommitIT-df-py37.xml
----------------------------------------------------------------------
XML: <https://builds.apache.org/job/beam_PostCommit_Python37/ws/src/sdks/python/nosetests.xml>
----------------------------------------------------------------------
Ran 42 tests in 3513.033s
FAILED (SKIP=5, errors=1)
> Task :sdks:python:test-suites:dataflow:py37:postCommitIT FAILED
FAILURE: Build failed with an exception.
* Where:
Build file '<https://builds.apache.org/job/beam_PostCommit_Python37/ws/src/sdks/python/test-suites/dataflow/py37/build.gradle'> line: 80
* What went wrong:
Execution failed for task ':sdks:python:test-suites:dataflow:py37:postCommitIT'.
> Process 'command 'sh'' finished with non-zero exit value 1
* Try:
Run with --stacktrace option to get the stack trace. Run with --info or --debug option to get more log output. Run with --scan to get full insights.
* Get more help at https://help.gradle.org
Deprecated Gradle features were used in this build, making it incompatible with Gradle 6.0.
Use '--warning-mode all' to show the individual deprecation warnings.
See https://docs.gradle.org/5.2.1/userguide/command_line_interface.html#sec:command_line_warnings
BUILD FAILED in 59m 30s
64 actionable tasks: 47 executed, 17 from cache
Publishing build scan...
https://gradle.com/s/utp66ox27vjoi
Build step 'Invoke Gradle script' changed build result to FAILURE
Build step 'Invoke Gradle script' marked build as failure
---------------------------------------------------------------------
To unsubscribe, e-mail: builds-unsubscribe@beam.apache.org
For additional commands, e-mail: builds-help@beam.apache.org