You are viewing a plain text version of this content. The canonical link for it is here.
Posted to builds@beam.apache.org by Apache Jenkins Server <je...@builds.apache.org> on 2023/11/14 21:31:51 UTC
Build failed in Jenkins: beam_PostCommit_Python310 #1544
See <https://ci-beam.apache.org/job/beam_PostCommit_Python310/1544/display/redirect>
Changes:
------------------------------------------
[...truncated 11.94 MB...]
log_location: "/usr/local/lib/python3.10/site-packages/apache_beam/runners/worker/data_plane.py:770"
thread: "Thread-13"
INFO:root:severity: INFO
timestamp {
seconds: 1699997488
nanos: 838292121
}
message: "No more requests from control plane"
log_location: "/usr/local/lib/python3.10/site-packages/apache_beam/runners/worker/sdk_worker.py:274"
thread: "MainThread"
INFO:root:severity: INFO
timestamp {
seconds: 1699997488
nanos: 838458061
}
message: "SDK Harness waiting for in-flight requests to complete"
log_location: "/usr/local/lib/python3.10/site-packages/apache_beam/runners/worker/sdk_worker.py:275"
thread: "MainThread"
INFO:root:severity: INFO
timestamp {
seconds: 1699997488
nanos: 838530778
}
message: "Closing all cached grpc data channels."
log_location: "/usr/local/lib/python3.10/site-packages/apache_beam/runners/worker/data_plane.py:803"
thread: "MainThread"
INFO:root:severity: INFO
timestamp {
seconds: 1699997488
nanos: 838591575
}
message: "Closing all cached gRPC state handlers."
log_location: "/usr/local/lib/python3.10/site-packages/apache_beam/runners/worker/sdk_worker.py:904"
thread: "MainThread"
INFO:root:severity: INFO
timestamp {
seconds: 1699997488
nanos: 839451313
}
message: "Done consuming work."
log_location: "/usr/local/lib/python3.10/site-packages/apache_beam/runners/worker/sdk_worker.py:287"
thread: "MainThread"
INFO:root:severity: INFO
timestamp {
seconds: 1699997488
nanos: 839552879
}
message: "Python sdk harness exiting."
log_location: "/usr/local/lib/python3.10/site-packages/apache_beam/runners/worker/sdk_worker_main.py:213"
thread: "MainThread"
694660884f7426678534b1783df47a3e2e6e33077734dcfb3d6a2cdfddfb5365
INFO:apache_beam.runners.portability.local_job_service:Completed job in 25.46727418899536 seconds with state DONE.
INFO:root:Completed job in 25.46727418899536 seconds with state DONE.
INFO:apache_beam.runners.portability.portable_runner:Job state changed to DONE
> Task :sdks:python:test-suites:portable:py310:portableWordCountSparkRunnerBatch
INFO:apache_beam.runners.worker.worker_pool_main:Listening for workers at localhost:35249
INFO:apache_beam.runners.portability.fn_api_runner.translations:==================== <function pack_combiners at 0x7f08fde1a950> ====================
INFO:apache_beam.runners.portability.fn_api_runner.translations:==================== <function lift_combiners at 0x7f08fde1a9e0> ====================
INFO:apache_beam.runners.portability.fn_api_runner.translations:==================== <function sort_stages at 0x7f08fde1b130> ====================
INFO:apache_beam.utils.subprocess_server:Starting service with ['java' '-jar' '<https://ci-beam.apache.org/job/beam_PostCommit_Python310/ws/src/runners/spark/3/job-server/build/libs/beam-runners-spark-3-job-server-2.53.0-SNAPSHOT.jar'> '--spark-master-url' 'local[4]' '--artifacts-dir' '/tmp/beam-tempk03okcvs/artifactsw48vr0_u' '--job-port' '58721' '--artifact-port' '0' '--expansion-port' '0']
INFO:apache_beam.utils.subprocess_server:23/11/14 21:31:39 WARN software.amazon.awssdk.regions.internal.util.EC2MetadataUtils: Unable to retrieve the requested metadata.
INFO:apache_beam.utils.subprocess_server:23/11/14 21:31:40 INFO org.apache.beam.runners.jobsubmission.JobServerDriver: ArtifactStagingService started on localhost:44137
INFO:apache_beam.utils.subprocess_server:23/11/14 21:31:40 INFO org.apache.beam.runners.jobsubmission.JobServerDriver: Java ExpansionService started on localhost:37559
INFO:apache_beam.utils.subprocess_server:23/11/14 21:31:40 INFO org.apache.beam.runners.jobsubmission.JobServerDriver: JobService started on localhost:58721
INFO:apache_beam.utils.subprocess_server:23/11/14 21:31:40 INFO org.apache.beam.runners.jobsubmission.JobServerDriver: Job server now running, terminate with Ctrl+C
WARNING:root:Waiting for grpc channel to be ready at localhost:58721.
INFO:apache_beam.utils.subprocess_server:23/11/14 21:31:42 INFO org.apache.beam.runners.fnexecution.artifact.ArtifactStagingService: Staging artifacts for job_e3dee1f4-3ef8-44d5-90dc-65af425e738a.
INFO:apache_beam.utils.subprocess_server:23/11/14 21:31:42 INFO org.apache.beam.runners.fnexecution.artifact.ArtifactStagingService: Resolving artifacts for job_e3dee1f4-3ef8-44d5-90dc-65af425e738a.ref_Environment_default_environment_1.
INFO:apache_beam.utils.subprocess_server:23/11/14 21:31:42 INFO org.apache.beam.runners.fnexecution.artifact.ArtifactStagingService: Getting 1 artifacts for job_e3dee1f4-3ef8-44d5-90dc-65af425e738a.null.
INFO:apache_beam.utils.subprocess_server:23/11/14 21:31:42 INFO org.apache.beam.runners.fnexecution.artifact.ArtifactStagingService: Artifacts fully staged for job_e3dee1f4-3ef8-44d5-90dc-65af425e738a.
INFO:apache_beam.utils.subprocess_server:23/11/14 21:31:42 INFO org.apache.beam.runners.spark.SparkJobInvoker: Invoking job BeamApp-jenkins-1114213142-2cecaf08_50b5219a-5830-4ef8-9085-3b21c1f0be71
INFO:apache_beam.utils.subprocess_server:23/11/14 21:31:43 INFO org.apache.beam.runners.jobsubmission.JobInvocation: Starting job invocation BeamApp-jenkins-1114213142-2cecaf08_50b5219a-5830-4ef8-9085-3b21c1f0be71
INFO:apache_beam.runners.portability.portable_runner:Environment "LOOPBACK" has started a component necessary for the execution. Be sure to run the pipeline using
with Pipeline() as p:
p.apply(..)
This ensures that the pipeline finishes before this program exits.
INFO:apache_beam.runners.portability.portable_runner:Job state changed to STOPPED
INFO:apache_beam.runners.portability.portable_runner:Job state changed to STARTING
INFO:apache_beam.runners.portability.portable_runner:Job state changed to RUNNING
INFO:apache_beam.utils.subprocess_server:23/11/14 21:31:43 INFO org.apache.beam.runners.spark.translation.SparkContextFactory: Creating a brand new Spark Context.
INFO:apache_beam.utils.subprocess_server:23/11/14 21:31:43 WARN org.apache.hadoop.util.NativeCodeLoader: Unable to load native-hadoop library for your platform... using builtin-java classes where applicable
INFO:apache_beam.utils.subprocess_server:23/11/14 21:31:44 INFO org.sparkproject.jetty.util.log: Logging initialized @7312ms to org.sparkproject.jetty.util.log.Slf4jLog
INFO:apache_beam.utils.subprocess_server:23/11/14 21:31:44 INFO org.sparkproject.jetty.server.Server: jetty-9.4.44.v20210927; built: 2021-09-27T23:02:44.612Z; git: 8da83308eeca865e495e53ef315a249d63ba9332; jvm 1.8.0_382-8u382-ga-1~20.04.1-b05
INFO:apache_beam.utils.subprocess_server:23/11/14 21:31:44 INFO org.sparkproject.jetty.server.Server: Started @7405ms
INFO:apache_beam.utils.subprocess_server:23/11/14 21:31:44 INFO org.sparkproject.jetty.server.AbstractConnector: Started ServerConnector@4f61b7d4{HTTP/1.1, (http/1.1)}{127.0.0.1:4040}
INFO:apache_beam.utils.subprocess_server:23/11/14 21:31:44 INFO org.sparkproject.jetty.server.handler.ContextHandler: Started o.s.j.s.ServletContextHandler@3e966a95{/jobs,null,AVAILABLE,@Spark}
INFO:apache_beam.utils.subprocess_server:23/11/14 21:31:44 INFO org.sparkproject.jetty.server.handler.ContextHandler: Started o.s.j.s.ServletContextHandler@621fdd6a{/jobs/json,null,AVAILABLE,@Spark}
INFO:apache_beam.utils.subprocess_server:23/11/14 21:31:44 INFO org.sparkproject.jetty.server.handler.ContextHandler: Started o.s.j.s.ServletContextHandler@77d7ea21{/jobs/job,null,AVAILABLE,@Spark}
INFO:apache_beam.utils.subprocess_server:23/11/14 21:31:44 INFO org.sparkproject.jetty.server.handler.ContextHandler: Started o.s.j.s.ServletContextHandler@5f5df460{/jobs/job/json,null,AVAILABLE,@Spark}
INFO:apache_beam.utils.subprocess_server:23/11/14 21:31:44 INFO org.sparkproject.jetty.server.handler.ContextHandler: Started o.s.j.s.ServletContextHandler@72d5bb8e{/stages,null,AVAILABLE,@Spark}
INFO:apache_beam.utils.subprocess_server:23/11/14 21:31:44 INFO org.sparkproject.jetty.server.handler.ContextHandler: Started o.s.j.s.ServletContextHandler@7895bc3a{/stages/json,null,AVAILABLE,@Spark}
INFO:apache_beam.utils.subprocess_server:23/11/14 21:31:44 INFO org.sparkproject.jetty.server.handler.ContextHandler: Started o.s.j.s.ServletContextHandler@2c816d94{/stages/stage,null,AVAILABLE,@Spark}
INFO:apache_beam.utils.subprocess_server:23/11/14 21:31:44 INFO org.sparkproject.jetty.server.handler.ContextHandler: Started o.s.j.s.ServletContextHandler@54dcc8f{/stages/stage/json,null,AVAILABLE,@Spark}
INFO:apache_beam.utils.subprocess_server:23/11/14 21:31:44 INFO org.sparkproject.jetty.server.handler.ContextHandler: Started o.s.j.s.ServletContextHandler@584a9c8a{/stages/pool,null,AVAILABLE,@Spark}
INFO:apache_beam.utils.subprocess_server:23/11/14 21:31:44 INFO org.sparkproject.jetty.server.handler.ContextHandler: Started o.s.j.s.ServletContextHandler@2e5699c4{/stages/pool/json,null,AVAILABLE,@Spark}
INFO:apache_beam.utils.subprocess_server:23/11/14 21:31:44 INFO org.sparkproject.jetty.server.handler.ContextHandler: Started o.s.j.s.ServletContextHandler@62fe3bf8{/storage,null,AVAILABLE,@Spark}
INFO:apache_beam.utils.subprocess_server:23/11/14 21:31:44 INFO org.sparkproject.jetty.server.handler.ContextHandler: Started o.s.j.s.ServletContextHandler@1d6f948e{/storage/json,null,AVAILABLE,@Spark}
INFO:apache_beam.utils.subprocess_server:23/11/14 21:31:44 INFO org.sparkproject.jetty.server.handler.ContextHandler: Started o.s.j.s.ServletContextHandler@22edc1a{/storage/rdd,null,AVAILABLE,@Spark}
INFO:apache_beam.utils.subprocess_server:23/11/14 21:31:44 INFO org.sparkproject.jetty.server.handler.ContextHandler: Started o.s.j.s.ServletContextHandler@92bfe6e{/storage/rdd/json,null,AVAILABLE,@Spark}
INFO:apache_beam.utils.subprocess_server:23/11/14 21:31:44 INFO org.sparkproject.jetty.server.handler.ContextHandler: Started o.s.j.s.ServletContextHandler@c5dcb2f{/environment,null,AVAILABLE,@Spark}
INFO:apache_beam.utils.subprocess_server:23/11/14 21:31:44 INFO org.sparkproject.jetty.server.handler.ContextHandler: Started o.s.j.s.ServletContextHandler@3cd48c67{/environment/json,null,AVAILABLE,@Spark}
INFO:apache_beam.utils.subprocess_server:23/11/14 21:31:44 INFO org.sparkproject.jetty.server.handler.ContextHandler: Started o.s.j.s.ServletContextHandler@1e244b72{/executors,null,AVAILABLE,@Spark}
INFO:apache_beam.utils.subprocess_server:23/11/14 21:31:44 INFO org.sparkproject.jetty.server.handler.ContextHandler: Started o.s.j.s.ServletContextHandler@3a530c51{/executors/json,null,AVAILABLE,@Spark}
INFO:apache_beam.utils.subprocess_server:23/11/14 21:31:44 INFO org.sparkproject.jetty.server.handler.ContextHandler: Started o.s.j.s.ServletContextHandler@6d223fbb{/executors/threadDump,null,AVAILABLE,@Spark}
INFO:apache_beam.utils.subprocess_server:23/11/14 21:31:44 INFO org.sparkproject.jetty.server.handler.ContextHandler: Started o.s.j.s.ServletContextHandler@d51538c{/executors/threadDump/json,null,AVAILABLE,@Spark}
INFO:apache_beam.utils.subprocess_server:23/11/14 21:31:44 INFO org.sparkproject.jetty.server.handler.ContextHandler: Started o.s.j.s.ServletContextHandler@2cc76929{/static,null,AVAILABLE,@Spark}
INFO:apache_beam.utils.subprocess_server:23/11/14 21:31:44 INFO org.sparkproject.jetty.server.handler.ContextHandler: Started o.s.j.s.ServletContextHandler@718da9aa{/,null,AVAILABLE,@Spark}
INFO:apache_beam.utils.subprocess_server:23/11/14 21:31:44 INFO org.sparkproject.jetty.server.handler.ContextHandler: Started o.s.j.s.ServletContextHandler@4b2386d2{/api,null,AVAILABLE,@Spark}
INFO:apache_beam.utils.subprocess_server:23/11/14 21:31:44 INFO org.sparkproject.jetty.server.handler.ContextHandler: Started o.s.j.s.ServletContextHandler@6afd9ce1{/jobs/job/kill,null,AVAILABLE,@Spark}
INFO:apache_beam.utils.subprocess_server:23/11/14 21:31:44 INFO org.sparkproject.jetty.server.handler.ContextHandler: Started o.s.j.s.ServletContextHandler@4ff4d7dc{/stages/stage/kill,null,AVAILABLE,@Spark}
INFO:apache_beam.utils.subprocess_server:23/11/14 21:31:45 INFO org.sparkproject.jetty.server.handler.ContextHandler: Started o.s.j.s.ServletContextHandler@4cc538bc{/metrics/json,null,AVAILABLE,@Spark}
INFO:apache_beam.utils.subprocess_server:23/11/14 21:31:45 INFO org.apache.beam.runners.spark.metrics.MetricsAccumulator: Instantiated metrics accumulator: MetricQueryResults()
INFO:apache_beam.utils.subprocess_server:23/11/14 21:31:45 WARN software.amazon.awssdk.regions.internal.util.EC2MetadataUtils: Unable to retrieve the requested metadata.
INFO:apache_beam.utils.subprocess_server:23/11/14 21:31:45 INFO org.apache.beam.runners.spark.SparkPipelineRunner: Running job BeamApp-jenkins-1114213142-2cecaf08_50b5219a-5830-4ef8-9085-3b21c1f0be71 on Spark master local[4]
INFO:apache_beam.runners.worker.statecache:Creating state cache with size 104857600
INFO:apache_beam.runners.worker.sdk_worker:Creating insecure control channel for localhost:42959.
INFO:apache_beam.runners.worker.sdk_worker:Control channel established.
INFO:apache_beam.runners.worker.sdk_worker:Initializing SDKHarness with unbounded number of workers.
INFO:apache_beam.utils.subprocess_server:23/11/14 21:31:46 INFO org.apache.beam.runners.fnexecution.control.FnApiControlClientPoolService: Beam Fn Control client connected with id 1-1
INFO:apache_beam.utils.subprocess_server:23/11/14 21:31:46 INFO org.apache.beam.runners.fnexecution.control.FnApiControlClientPoolService: getProcessBundleDescriptor request with id 1-2
INFO:apache_beam.runners.worker.sdk_worker:Creating insecure state channel for localhost:38047.
INFO:apache_beam.runners.worker.sdk_worker:State channel established.
INFO:apache_beam.runners.worker.data_plane:Creating client data channel for localhost:45323
INFO:apache_beam.utils.subprocess_server:23/11/14 21:31:46 INFO org.apache.beam.runners.fnexecution.data.GrpcDataService: Beam Fn Data client connected.
INFO:apache_beam.utils.subprocess_server:23/11/14 21:31:46 INFO org.apache.beam.runners.fnexecution.control.FnApiControlClientPoolService: getProcessBundleDescriptor request with id 1-3
INFO:apache_beam.utils.subprocess_server:23/11/14 21:31:47 INFO org.apache.beam.runners.fnexecution.control.FnApiControlClientPoolService: getProcessBundleDescriptor request with id 1-4
INFO:apache_beam.utils.subprocess_server:23/11/14 21:31:47 INFO org.apache.beam.runners.fnexecution.control.FnApiControlClientPoolService: getProcessBundleDescriptor request with id 1-5
INFO:apache_beam.utils.subprocess_server:23/11/14 21:31:47 INFO org.apache.beam.runners.fnexecution.control.FnApiControlClientPoolService: getProcessBundleDescriptor request with id 1-8
INFO:apache_beam.utils.subprocess_server:23/11/14 21:31:47 INFO org.apache.beam.runners.fnexecution.control.FnApiControlClientPoolService: getProcessBundleDescriptor request with id 1-9
INFO:apache_beam.utils.subprocess_server:23/11/14 21:31:47 INFO org.apache.beam.runners.fnexecution.control.FnApiControlClientPoolService: getProcessBundleDescriptor request with id 1-6
INFO:apache_beam.utils.subprocess_server:23/11/14 21:31:47 INFO org.apache.beam.runners.fnexecution.control.FnApiControlClientPoolService: getProcessBundleDescriptor request with id 1-7
INFO:apache_beam.utils.subprocess_server:23/11/14 21:31:47 INFO org.apache.beam.runners.fnexecution.control.FnApiControlClientPoolService: getProcessBundleDescriptor request with id 1-10
INFO:apache_beam.utils.subprocess_server:23/11/14 21:31:47 INFO org.apache.beam.runners.fnexecution.control.FnApiControlClientPoolService: getProcessBundleDescriptor request with id 1-11
INFO:apache_beam.utils.subprocess_server:23/11/14 21:31:47 INFO org.apache.beam.runners.fnexecution.control.FnApiControlClientPoolService: getProcessBundleDescriptor request with id 1-13
INFO:apache_beam.utils.subprocess_server:23/11/14 21:31:47 INFO org.apache.beam.runners.fnexecution.control.FnApiControlClientPoolService: getProcessBundleDescriptor request with id 1-12
INFO:apache_beam.utils.subprocess_server:23/11/14 21:31:47 INFO org.apache.beam.runners.fnexecution.control.FnApiControlClientPoolService: getProcessBundleDescriptor request with id 1-14
INFO:apache_beam.utils.subprocess_server:23/11/14 21:31:47 INFO org.apache.beam.runners.fnexecution.control.FnApiControlClientPoolService: getProcessBundleDescriptor request with id 1-15
INFO:apache_beam.utils.subprocess_server:23/11/14 21:31:47 INFO org.apache.beam.runners.spark.SparkPipelineRunner: Job BeamApp-jenkins-1114213142-2cecaf08_50b5219a-5830-4ef8-9085-3b21c1f0be71: Pipeline translated successfully. Computing outputs
INFO:apache_beam.utils.subprocess_server:23/11/14 21:31:47 INFO org.apache.beam.runners.fnexecution.control.FnApiControlClientPoolService: getProcessBundleDescriptor request with id 1-16
INFO:apache_beam.io.filebasedsink:Starting finalize_write threads with num_shards: 4 (skipped: 0), batches: 4, num_threads: 4
INFO:apache_beam.io.filebasedsink:Renamed 4 shards in 0.00 seconds.
INFO:apache_beam.utils.subprocess_server:23/11/14 21:31:47 INFO org.apache.beam.runners.spark.SparkPipelineRunner: Job BeamApp-jenkins-1114213142-2cecaf08_50b5219a-5830-4ef8-9085-3b21c1f0be71 finished.
INFO:apache_beam.utils.subprocess_server:23/11/14 21:31:47 INFO org.sparkproject.jetty.server.AbstractConnector: Stopped Spark@4f61b7d4{HTTP/1.1, (http/1.1)}{127.0.0.1:4040}
INFO:apache_beam.runners.portability.portable_runner:Job state changed to DONE
Exception in thread read_state:
Exception in thread run_worker_1-1:
Traceback (most recent call last):
Traceback (most recent call last):
File "/usr/lib/python3.10/threading.py", line 1009, in _bootstrap_inner
File "/usr/lib/python3.10/threading.py", line 1009, in _bootstrap_inner
self.run()
File "/usr/lib/python3.10/threading.py", line 946, in run
self._target(*self._args, **self._kwargs)
File "<https://ci-beam.apache.org/job/beam_PostCommit_Python310/ws/src/sdks/python/apache_beam/runners/worker/sdk_worker.py",> line 262, in run
self.run()
File "/usr/lib/python3.10/threading.py", line 946, in run
ERROR:apache_beam.runners.worker.data_plane:Failed to read inputs in the data plane.
Traceback (most recent call last):
File "<https://ci-beam.apache.org/job/beam_PostCommit_Python310/ws/src/sdks/python/apache_beam/runners/worker/data_plane.py",> line 652, in _read_inputs
for elements in elements_iterator:
File "<https://ci-beam.apache.org/job/beam_PostCommit_Python310/ws/src/build/gradleenv/-1720702907/lib/python3.10/site-packages/grpc/_channel.py",> line 541, in __next__
return self._next()
File "<https://ci-beam.apache.org/job/beam_PostCommit_Python310/ws/src/build/gradleenv/-1720702907/lib/python3.10/site-packages/grpc/_channel.py",> line 967, in _next
raise self
grpc._channel._MultiThreadedRendezvous: <_MultiThreadedRendezvous of RPC that terminated with:
status = StatusCode.UNAVAILABLE
details = "recvmsg:Connection reset by peer"
debug_error_string = "UNKNOWN:Error received from peer ipv6:%5B::1%5D:45323 {grpc_message:"recvmsg:Connection reset by peer", grpc_status:14, created_time:"2023-11-14T21:31:48.440993139+00:00"}"
>
Exception in thread read_grpc_client_inputs:
Traceback (most recent call last):
File "/usr/lib/python3.10/threading.py", line 1009, in _bootstrap_inner
for work_request in self._control_stub.Control(get_responses()):
File "<https://ci-beam.apache.org/job/beam_PostCommit_Python310/ws/src/build/gradleenv/-1720702907/lib/python3.10/site-packages/grpc/_channel.py",> line 541, in __next__
self._target(*self._args, **self._kwargs)
File "<https://ci-beam.apache.org/job/beam_PostCommit_Python310/ws/src/sdks/python/apache_beam/runners/worker/sdk_worker.py",> line 1035, in pull_responses
self.run()
File "/usr/lib/python3.10/threading.py", line 946, in run
return self._next()
for response in responses:
File "<https://ci-beam.apache.org/job/beam_PostCommit_Python310/ws/src/build/gradleenv/-1720702907/lib/python3.10/site-packages/grpc/_channel.py",> line 541, in __next__
self._target(*self._args, **self._kwargs)
File "<https://ci-beam.apache.org/job/beam_PostCommit_Python310/ws/src/build/gradleenv/-1720702907/lib/python3.10/site-packages/grpc/_channel.py",> line 967, in _next
File "<https://ci-beam.apache.org/job/beam_PostCommit_Python310/ws/src/sdks/python/apache_beam/runners/worker/data_plane.py",> line 669, in <lambda>
return self._next()
raise self
File "<https://ci-beam.apache.org/job/beam_PostCommit_Python310/ws/src/build/gradleenv/-1720702907/lib/python3.10/site-packages/grpc/_channel.py",> line 967, in _next
target=lambda: self._read_inputs(elements_iterator),
File "<https://ci-beam.apache.org/job/beam_PostCommit_Python310/ws/src/sdks/python/apache_beam/runners/worker/data_plane.py",> line 652, in _read_inputs
grpc._channel._MultiThreadedRendezvous: <_MultiThreadedRendezvous of RPC that terminated with:
status = StatusCode.UNAVAILABLE
details = "recvmsg:Connection reset by peer"
debug_error_string = "UNKNOWN:Error received from peer ipv6:%5B::1%5D:42959 {created_time:"2023-11-14T21:31:48.441018642+00:00", grpc_status:14, grpc_message:"recvmsg:Connection reset by peer"}"
>
raise self
grpc._channel._MultiThreadedRendezvous: <_MultiThreadedRendezvous of RPC that terminated with:
status = StatusCode.UNAVAILABLE
details = "Socket closed"
debug_error_string = "UNKNOWN:Error received from peer ipv6:%5B::1%5D:38047 {created_time:"2023-11-14T21:31:48.441007133+00:00", grpc_status:14, grpc_message:"Socket closed"}"
>
for elements in elements_iterator:
File "<https://ci-beam.apache.org/job/beam_PostCommit_Python310/ws/src/build/gradleenv/-1720702907/lib/python3.10/site-packages/grpc/_channel.py",> line 541, in __next__
return self._next()
File "<https://ci-beam.apache.org/job/beam_PostCommit_Python310/ws/src/build/gradleenv/-1720702907/lib/python3.10/site-packages/grpc/_channel.py",> line 967, in _next
raise self
grpc._channel._MultiThreadedRendezvous: <_MultiThreadedRendezvous of RPC that terminated with:
status = StatusCode.UNAVAILABLE
details = "recvmsg:Connection reset by peer"
debug_error_string = "UNKNOWN:Error received from peer ipv6:%5B::1%5D:45323 {grpc_message:"recvmsg:Connection reset by peer", grpc_status:14, created_time:"2023-11-14T21:31:48.440993139+00:00"}"
>
> Task :sdks:python:test-suites:portable:py310:postCommitPy310
FAILURE: Build failed with an exception.
* Where:
Build file '<https://ci-beam.apache.org/job/beam_PostCommit_Python310/ws/src/sdks/python/build.gradle'> line: 97
* What went wrong:
Execution failed for task ':sdks:python:bdistPy310linux'.
> Process 'command 'sh'' finished with non-zero exit value 1
* Try:
> Run with --stacktrace option to get the stack trace.
> Run with --info or --debug option to get more log output.
> Get more help at https://help.gradle.org.
Deprecated Gradle features were used in this build, making it incompatible with Gradle 9.0.
You can use '--warning-mode all' to show the individual deprecation warnings and determine if they come from your own scripts or plugins.
For more on this, please refer to https://docs.gradle.org/8.4/userguide/command_line_interface.html#sec:command_line_warnings in the Gradle documentation.
BUILD FAILED in 28m 25s
212 actionable tasks: 148 executed, 60 from cache, 4 up-to-date
Publishing build scan...
https://ge.apache.org/s/owqge3ul2cwlc
Build step 'Invoke Gradle script' changed build result to FAILURE
Build step 'Invoke Gradle script' marked build as failure
---------------------------------------------------------------------
To unsubscribe, e-mail: builds-unsubscribe@beam.apache.org
For additional commands, e-mail: builds-help@beam.apache.org
Jenkins build is back to normal : beam_PostCommit_Python310 #1545
Posted by Apache Jenkins Server <je...@builds.apache.org>.
See <https://ci-beam.apache.org/job/beam_PostCommit_Python310/1545/display/redirect>
---------------------------------------------------------------------
To unsubscribe, e-mail: builds-unsubscribe@beam.apache.org
For additional commands, e-mail: builds-help@beam.apache.org