You are viewing a plain text version of this content. The canonical link for it is here.
Posted to builds@beam.apache.org by Apache Jenkins Server <je...@builds.apache.org> on 2023/02/09 15:32:41 UTC

Build failed in Jenkins: beam_PostCommit_Python310 #456

See <https://ci-beam.apache.org/job/beam_PostCommit_Python310/456/display/redirect?page=changes>

Changes:

[noreply] Bump google.golang.org/api from 0.108.0 to 0.109.0 in /sdks (#25250)

[noreply] Add min and max batch size args to model handler (#25395)

[noreply] Beam/sdks/io/gcp/java/healcare/hl7v2 io read (#25056)

[noreply] Remove reuse of GenericRecord instance when reading Avro from BigQuery

[noreply] fixed reading env variable (#25362)


------------------------------------------
[...truncated 648.77 KB...]
urllib3==1.26.14
websocket-client==1.4.2
Werkzeug==2.2.2
wheel==0.38.4
wrapt==1.14.1
zstandard==0.19.0
Removing intermediate container 41bbb4149a97
 ---> 6fe21980a051
Step 17/32 : COPY target/LICENSE /opt/apache/beam/
 ---> 0bb487dce0a5
Step 18/32 : COPY target/LICENSE.python /opt/apache/beam/
 ---> 2b43b3b49470
Step 19/32 : COPY target/NOTICE /opt/apache/beam/
 ---> e388941a96aa
Step 20/32 : COPY target/launcher/linux_amd64/boot /opt/apache/beam/
 ---> 2448a04911fb
Step 21/32 : ENTRYPOINT ["/opt/apache/beam/boot"]
 ---> Running in f1d078f4dd98
Removing intermediate container f1d078f4dd98
 ---> 28215c09b484
Step 22/32 : FROM beam as third_party_licenses
 ---> 28215c09b484
Step 23/32 : ARG pull_licenses
 ---> Running in f0815b845d89
Removing intermediate container f0815b845d89
 ---> 220e5344ad05
Step 24/32 : COPY target/license_scripts /tmp/license_scripts/
 ---> 55787f15cdba
Step 25/32 : COPY target/LICENSE target/go-licenses/* /opt/apache/beam/third_party_licenses/golang/
 ---> a116aab29251
Step 26/32 : RUN rm /opt/apache/beam/third_party_licenses/golang/LICENSE
 ---> Running in b648b90e79a7
Removing intermediate container b648b90e79a7
 ---> f9b015259f66
Step 27/32 : COPY target/license_scripts /tmp/license_scripts/
 ---> cf601a786ca1
Step 28/32 : RUN if [ "$pull_licenses" = "true" ] ; then       pip install 'pip-licenses<4.0.0' pyyaml tenacity &&       python /tmp/license_scripts/pull_licenses_py.py ;     fi
 ---> Running in 3e84bf0c9a6f
Collecting pip-licenses<4.0.0
  Downloading pip_licenses-3.5.5-py3-none-any.whl (17 kB)
Requirement already satisfied: pyyaml in /usr/local/lib/python3.10/site-packages (6.0)
Requirement already satisfied: tenacity in /usr/local/lib/python3.10/site-packages (5.1.5)
Collecting PTable
  Downloading PTable-0.9.2.tar.gz (31 kB)
  Preparing metadata (setup.py): started
  Preparing metadata (setup.py): finished with status 'done'
Requirement already satisfied: six>=1.9.0 in /usr/local/lib/python3.10/site-packages (from tenacity) (1.16.0)
Building wheels for collected packages: PTable
  Building wheel for PTable (setup.py): started
  Building wheel for PTable (setup.py): finished with status 'done'
  Created wheel for PTable: filename=PTable-0.9.2-py3-none-any.whl size=22908 sha256=39feafa2575faf690a27e1e039d4ada7edeb11c4cd1a5f19ce72e11d76da82c8
  Stored in directory: /root/.cache/pip/wheels/bc/88/52/f2e9fc70f3a657cf256e9b01a8a42938c4c5ee69118d51ed90
Successfully built PTable
Installing collected packages: PTable, pip-licenses
Successfully installed PTable-0.9.2 pip-licenses-3.5.5
WARNING: Running pip as the 'root' user can result in broken permissions and conflicting behaviour with the system package manager. It is recommended to use a virtual environment instead: https://pip.pypa.io/warnings/venv
INFO:root:Successfully pulled licenses for 134 dependencies
Skip pulling license for  bs4
Removing intermediate container 3e84bf0c9a6f
 ---> eb60e6437aa5
Step 29/32 : FROM beam
 ---> 28215c09b484
Step 30/32 : ARG pull_licenses
 ---> Running in cafae9824533
Removing intermediate container cafae9824533
 ---> 91229cf92fdc
Step 31/32 : COPY --from=third_party_licenses /opt/apache/beam/third_party_licenses /opt/apache/beam/third_party_licenses
 ---> fb98a3b36db2
Step 32/32 : RUN if [ "$pull_licenses" != "true" ] ; then       rm -rf /opt/apache/beam/third_party_licenses ;     fi
 ---> Running in c72d538b1332
Removing intermediate container c72d538b1332
 ---> c8a7822b2c75
Successfully built c8a7822b2c75
Successfully tagged apache/beam_python3.10_sdk:2.46.0.dev

> Task :sdks:python:test-suites:portable:py310:portableLocalRunnerJuliaSetWithSetupPy
Obtaining file://<https://ci-beam.apache.org/job/beam_PostCommit_Python310/ws/src/sdks/python>
  Preparing metadata (setup.py): started
  Preparing metadata (setup.py): finished with status 'done'
Requirement already satisfied: protobuf<4,>3.12.2 in <https://ci-beam.apache.org/job/beam_PostCommit_Python310/ws/src/build/gradleenv/-1720702907/lib/python3.10/site-packages> (from apache-beam==2.46.0.dev0) (3.20.3)
Collecting crcmod<2.0,>=1.7
  Using cached crcmod-1.7-cp310-cp310-linux_x86_64.whl
Collecting orjson<4.0
  Using cached orjson-3.8.6.tar.gz (655 kB)
  Installing build dependencies: started
  Installing build dependencies: finished with status 'done'
  Getting requirements to build wheel: started
  Getting requirements to build wheel: finished with status 'done'
  Preparing metadata (pyproject.toml): started
  Preparing metadata (pyproject.toml): finished with status 'error'
  error: subprocess-exited-with-error
  
  × Preparing metadata (pyproject.toml) did not run successfully.
  │ exit code: 1
  ╰─> [6 lines of output]
      
      Cargo, the Rust package manager, is not installed or is not on PATH.
      This package requires Rust and Cargo to compile extensions. Install it through
      the system's package manager or via https://rustup.rs/
      
      Checking for Rust toolchain....
      [end of output]
  
  note: This error originates from a subprocess, and is likely not a problem with pip.
error: metadata-generation-failed

× Encountered error while generating package metadata.
╰─> See above for output.

note: This is an issue with the package mentioned above, not pip.
hint: See above for details.

> Task :sdks:python:test-suites:portable:py310:portableLocalRunnerJuliaSetWithSetupPy FAILED

> Task :sdks:python:test-suites:portable:py310:portableLocalRunnerTestWithRequirementsFile
Obtaining file://<https://ci-beam.apache.org/job/beam_PostCommit_Python310/ws/src/sdks/python>
  Preparing metadata (setup.py): started
  Preparing metadata (setup.py): finished with status 'done'
Requirement already satisfied: protobuf<4,>3.12.2 in <https://ci-beam.apache.org/job/beam_PostCommit_Python310/ws/src/build/gradleenv/-1720702907/lib/python3.10/site-packages> (from apache-beam==2.46.0.dev0) (3.20.3)
Collecting crcmod<2.0,>=1.7
  Using cached crcmod-1.7-cp310-cp310-linux_x86_64.whl
Collecting orjson<4.0
  Using cached orjson-3.8.6.tar.gz (655 kB)
  Installing build dependencies: started
  Installing build dependencies: finished with status 'done'
  Getting requirements to build wheel: started
  Getting requirements to build wheel: finished with status 'done'
  Preparing metadata (pyproject.toml): started
  Preparing metadata (pyproject.toml): finished with status 'error'
  error: subprocess-exited-with-error
  
  × Preparing metadata (pyproject.toml) did not run successfully.
  │ exit code: 1
  ╰─> [6 lines of output]
      
      Cargo, the Rust package manager, is not installed or is not on PATH.
      This package requires Rust and Cargo to compile extensions. Install it through
      the system's package manager or via https://rustup.rs/
      
      Checking for Rust toolchain....
      [end of output]
  
  note: This error originates from a subprocess, and is likely not a problem with pip.
error: metadata-generation-failed

× Encountered error while generating package metadata.
╰─> See above for output.

note: This is an issue with the package mentioned above, not pip.
hint: See above for details.

> Task :sdks:python:test-suites:portable:py310:portableLocalRunnerTestWithRequirementsFile FAILED

FAILURE: Build completed with 6 failures.

1: Task failed with an exception.
-----------
* What went wrong:
Execution failed for task ':sdks:python:test-suites:dataflow:py310:installGcpTest'.
> Process 'command 'sh'' finished with non-zero exit value 1

* Try:
> Run with --stacktrace option to get the stack trace.
> Run with --info or --debug option to get more log output.
==============================================================================

2: Task failed with an exception.
-----------
* What went wrong:
Execution failed for task ':sdks:python:test-suites:portable:py310:installGcpTest'.
> Process 'command 'sh'' finished with non-zero exit value 1

* Try:
> Run with --stacktrace option to get the stack trace.
> Run with --info or --debug option to get more log output.
==============================================================================

3: Task failed with an exception.
-----------
* Where:
Script '<https://ci-beam.apache.org/job/beam_PostCommit_Python310/ws/src/sdks/python/test-suites/direct/common.gradle'> line: 185

* What went wrong:
Execution failed for task ':sdks:python:test-suites:direct:py310:hdfsIntegrationTest'.
> Process 'command 'sh'' finished with non-zero exit value 1

* Try:
> Run with --stacktrace option to get the stack trace.
> Run with --info or --debug option to get more log output.
==============================================================================

4: Task failed with an exception.
-----------
* What went wrong:
Execution failed for task ':sdks:python:test-suites:direct:py310:installGcpTest'.
> Process 'command 'sh'' finished with non-zero exit value 1

* Try:
> Run with --stacktrace option to get the stack trace.
> Run with --info or --debug option to get more log output.
==============================================================================

5: Task failed with an exception.
-----------
* Where:
Script '<https://ci-beam.apache.org/job/beam_PostCommit_Python310/ws/src/sdks/python/test-suites/portable/common.gradle'> line: 85

* What went wrong:
Execution failed for task ':sdks:python:test-suites:portable:py310:portableLocalRunnerJuliaSetWithSetupPy'.
> Process 'command 'sh'' finished with non-zero exit value 1

* Try:
> Run with --stacktrace option to get the stack trace.
> Run with --info or --debug option to get more log output.
==============================================================================

6: Task failed with an exception.
-----------
* Where:
Script '<https://ci-beam.apache.org/job/beam_PostCommit_Python310/ws/src/sdks/python/test-suites/portable/common.gradle'> line: 130

* What went wrong:
Execution failed for task ':sdks:python:test-suites:portable:py310:portableLocalRunnerTestWithRequirementsFile'.
> Process 'command 'sh'' finished with non-zero exit value 1

* Try:
> Run with --stacktrace option to get the stack trace.
> Run with --info or --debug option to get more log output.
==============================================================================

* Get more help at https://help.gradle.org

Deprecated Gradle features were used in this build, making it incompatible with Gradle 8.0.

You can use '--warning-mode all' to show the individual deprecation warnings and determine if they come from your own scripts or plugins.

See https://docs.gradle.org/7.5.1/userguide/command_line_interface.html#sec:command_line_warnings

Execution optimizations have been disabled for 1 invalid unit(s) of work during this build to ensure correctness.
Please consult deprecation warnings for more details.

BUILD FAILED in 15m 37s
200 actionable tasks: 141 executed, 53 from cache, 6 up-to-date

Publishing build scan...
https://gradle.com/s/cic6dal4pmtr2

Build step 'Invoke Gradle script' changed build result to FAILURE
Build step 'Invoke Gradle script' marked build as failure

---------------------------------------------------------------------
To unsubscribe, e-mail: builds-unsubscribe@beam.apache.org
For additional commands, e-mail: builds-help@beam.apache.org


Jenkins build is back to normal : beam_PostCommit_Python310 #458

Posted by Apache Jenkins Server <je...@builds.apache.org>.
See <https://ci-beam.apache.org/job/beam_PostCommit_Python310/458/display/redirect?page=changes>


---------------------------------------------------------------------
To unsubscribe, e-mail: builds-unsubscribe@beam.apache.org
For additional commands, e-mail: builds-help@beam.apache.org


Build failed in Jenkins: beam_PostCommit_Python310 #457

Posted by Apache Jenkins Server <je...@builds.apache.org>.
See <https://ci-beam.apache.org/job/beam_PostCommit_Python310/457/display/redirect?page=changes>

Changes:

[noreply] fix doc on bq sxtorage (#25353)

[noreply] [Playground] Fix Test_getRunOrTestCmd on Go 1.20 (#25379)

[noreply] Fix typo - metdata -> metadata (#25399)


------------------------------------------
[...truncated 5.63 MB...]
    self._target(*self._args, **self._kwargs)
  File "/home/jenkins/jenkins-slave/workspace/beam_PostCommit_Python310/src/sdks/python/apache_beam/runners/worker/sdk_worker.py", line 254, in run
    self._target(*self._args, **self._kwargs)
  File "/home/jenkins/jenkins-slave/workspace/beam_PostCommit_Python310/src/sdks/python/apache_beam/runners/worker/sdk_worker.py", line 1006, in pull_responses
    for response in responses:
    for work_request in self._control_stub.Control(get_responses()):
  File "/home/jenkins/jenkins-slave/workspace/beam_PostCommit_Python310/src/build/gradleenv/-1720702907/lib/python3.10/site-packages/grpc/_channel.py", line 426, in __next__
  File "/home/jenkins/jenkins-slave/workspace/beam_PostCommit_Python310/src/build/gradleenv/-1720702907/lib/python3.10/site-packages/grpc/_channel.py", line 426, in __next__
    return self._next()
  File "/home/jenkins/jenkins-slave/workspace/beam_PostCommit_Python310/src/build/gradleenv/-1720702907/lib/python3.10/site-packages/grpc/_channel.py", line 826, in _next
    return self._next()
    raise self
  File "/home/jenkins/jenkins-slave/workspace/beam_PostCommit_Python310/src/build/gradleenv/-1720702907/lib/python3.10/site-packages/grpc/_channel.py", line 826, in _next
grpc._channel._MultiThreadedRendezvous: <_MultiThreadedRendezvous of RPC that terminated with:
	status = StatusCode.UNAVAILABLE
	details = "recvmsg:Connection reset by peer"
	debug_error_string = "UNKNOWN:Error received from peer ipv6:%5B::1%5D:39061 {created_time:"2023-02-09T21:53:53.124789824+00:00", grpc_status:14, grpc_message:"recvmsg:Connection reset by peer"}"
>
ERROR:apache_beam.runners.worker.data_plane:Failed to read inputs in the data plane.
Traceback (most recent call last):
  File "/home/jenkins/jenkins-slave/workspace/beam_PostCommit_Python310/src/sdks/python/apache_beam/runners/worker/data_plane.py", line 654, in _read_inputs
    for elements in elements_iterator:
  File "/home/jenkins/jenkins-slave/workspace/beam_PostCommit_Python310/src/build/gradleenv/-1720702907/lib/python3.10/site-packages/grpc/_channel.py", line 426, in __next__
    return self._next()
  File "/home/jenkins/jenkins-slave/workspace/beam_PostCommit_Python310/src/build/gradleenv/-1720702907/lib/python3.10/site-packages/grpc/_channel.py", line 826, in _next
    raise self
grpc._channel._MultiThreadedRendezvous: <_MultiThreadedRendezvous of RPC that terminated with:
	status = StatusCode.UNAVAILABLE
	details = "Socket closed"
	debug_error_string = "UNKNOWN:Error received from peer ipv6:%5B::1%5D:41631 {grpc_message:"Socket closed", grpc_status:14, created_time:"2023-02-09T21:53:53.124724078+00:00"}"
>
Exception in thread read_grpc_client_inputs:
Traceback (most recent call last):
    raise self
  File "/usr/lib/python3.10/threading.py", line 1009, in _bootstrap_inner
grpc._channel._MultiThreadedRendezvous: <_MultiThreadedRendezvous of RPC that terminated with:
	status = StatusCode.UNAVAILABLE
	details = "recvmsg:Connection reset by peer"
	debug_error_string = "UNKNOWN:Error received from peer ipv6:%5B::1%5D:38955 {created_time:"2023-02-09T21:53:53.124715956+00:00", grpc_status:14, grpc_message:"recvmsg:Connection reset by peer"}"
>
    self.run()
  File "/usr/lib/python3.10/threading.py", line 946, in run
    self._target(*self._args, **self._kwargs)
  File "/home/jenkins/jenkins-slave/workspace/beam_PostCommit_Python310/src/sdks/python/apache_beam/runners/worker/data_plane.py", line 671, in <lambda>
    target=lambda: self._read_inputs(elements_iterator),
  File "/home/jenkins/jenkins-slave/workspace/beam_PostCommit_Python310/src/sdks/python/apache_beam/runners/worker/data_plane.py", line 654, in _read_inputs
    for elements in elements_iterator:
  File "/home/jenkins/jenkins-slave/workspace/beam_PostCommit_Python310/src/build/gradleenv/-1720702907/lib/python3.10/site-packages/grpc/_channel.py", line 426, in __next__
    return self._next()
  File "/home/jenkins/jenkins-slave/workspace/beam_PostCommit_Python310/src/build/gradleenv/-1720702907/lib/python3.10/site-packages/grpc/_channel.py", line 826, in _next
    raise self
grpc._channel._MultiThreadedRendezvous: <_MultiThreadedRendezvous of RPC that terminated with:
	status = StatusCode.UNAVAILABLE
	details = "Socket closed"
	debug_error_string = "UNKNOWN:Error received from peer ipv6:%5B::1%5D:41631 {grpc_message:"Socket closed", grpc_status:14, created_time:"2023-02-09T21:53:53.124724078+00:00"}"
>

> Task :sdks:python:test-suites:dataflow:py310:postCommitIT

[gw4] PASSED apache_beam/examples/complete/juliaset/juliaset/juliaset_test_it.py::JuliaSetTestIT::test_run_example_with_setup_file 
apache_beam/examples/inference/tfx_bsl/tfx_bsl_inference_it_test.py::TFXRunInferenceTests::test_tfx_run_inference_mobilenetv2 
[gw4] SKIPPED apache_beam/examples/inference/tfx_bsl/tfx_bsl_inference_it_test.py::TFXRunInferenceTests::test_tfx_run_inference_mobilenetv2 
apache_beam/io/gcp/bigquery_file_loads_test.py::BigQueryFileLoadsIT::test_bqfl_streaming 
[gw4] SKIPPED apache_beam/io/gcp/bigquery_file_loads_test.py::BigQueryFileLoadsIT::test_bqfl_streaming 
apache_beam/io/gcp/bigquery_file_loads_test.py::BigQueryFileLoadsIT::test_bqfl_streaming_with_copy_jobs 
[gw4] SKIPPED apache_beam/io/gcp/bigquery_file_loads_test.py::BigQueryFileLoadsIT::test_bqfl_streaming_with_copy_jobs 
apache_beam/io/gcp/bigquery_file_loads_test.py::BigQueryFileLoadsIT::test_bqfl_streaming_with_dynamic_destinations 
[gw4] SKIPPED apache_beam/io/gcp/bigquery_file_loads_test.py::BigQueryFileLoadsIT::test_bqfl_streaming_with_dynamic_destinations 
apache_beam/io/gcp/bigquery_file_loads_test.py::BigQueryFileLoadsIT::test_multiple_destinations_transform 
[gw3] PASSED apache_beam/examples/wordcount_it_test.py::WordCountIT::test_wordcount_impersonation_it 
apache_beam/examples/wordcount_it_test.py::WordCountIT::test_wordcount_it 
[gw0] PASSED apache_beam/examples/fastavro_it_test.py::FastavroIT::test_avro_it 
apache_beam/examples/complete/game/leader_board_it_test.py::LeaderBoardIT::test_leader_board_it 
[gw1] PASSED apache_beam/dataframe/io_it_test.py::ReadUsingReadGbqTests::test_ReadGbq_direct_read 
apache_beam/dataframe/io_it_test.py::ReadUsingReadGbqTests::test_ReadGbq_direct_read_with_project 
[gw5] PASSED apache_beam/examples/cookbook/bigquery_tornadoes_it_test.py::BigqueryTornadoesIT::test_bigquery_tornadoes_it 
apache_beam/io/gcp/big_query_query_to_table_it_test.py::BigQueryQueryToTableIT::test_big_query_legacy_sql 
[gw2] PASSED apache_beam/examples/complete/game/user_score_it_test.py::UserScoreIT::test_user_score_it 
apache_beam/examples/dataframe/flight_delays_it_test.py::FlightDelaysTest::test_flight_delays 
[gw7] PASSED apache_beam/examples/complete/game/hourly_team_score_it_test.py::HourlyTeamScoreIT::test_hourly_team_score_it 
apache_beam/examples/cookbook/datastore_wordcount_it_test.py::DatastoreWordCountIT::test_datastore_wordcount_it 
[gw6] PASSED apache_beam/examples/dataframe/taxiride_it_test.py::TaxirideIT::test_aggregation 
apache_beam/examples/dataframe/taxiride_it_test.py::TaxirideIT::test_enrich 
[gw4] PASSED apache_beam/io/gcp/bigquery_file_loads_test.py::BigQueryFileLoadsIT::test_multiple_destinations_transform 
apache_beam/io/gcp/bigquery_file_loads_test.py::BigQueryFileLoadsIT::test_one_job_fails_all_jobs_fail 
[gw1] PASSED apache_beam/dataframe/io_it_test.py::ReadUsingReadGbqTests::test_ReadGbq_direct_read_with_project 
apache_beam/dataframe/io_it_test.py::ReadUsingReadGbqTests::test_ReadGbq_export_with_project 
[gw3] PASSED apache_beam/examples/wordcount_it_test.py::WordCountIT::test_wordcount_it 
apache_beam/io/fileio_test.py::MatchIntegrationTest::test_transform_on_gcs 
[gw5] PASSED apache_beam/io/gcp/big_query_query_to_table_it_test.py::BigQueryQueryToTableIT::test_big_query_legacy_sql 
apache_beam/io/gcp/big_query_query_to_table_it_test.py::BigQueryQueryToTableIT::test_big_query_new_types 
[gw2] PASSED apache_beam/examples/dataframe/flight_delays_it_test.py::FlightDelaysTest::test_flight_delays 
apache_beam/io/gcp/bigquery_test.py::BigQueryStreamingInsertTransformIntegrationTests::test_multiple_destinations_transform 
[gw0] PASSED apache_beam/examples/complete/game/leader_board_it_test.py::LeaderBoardIT::test_leader_board_it 
apache_beam/io/gcp/bigquery_read_it_test.py::ReadTests::test_iobase_source 
[gw7] PASSED apache_beam/examples/cookbook/datastore_wordcount_it_test.py::DatastoreWordCountIT::test_datastore_wordcount_it 
apache_beam/io/gcp/bigquery_write_it_test.py::BigQueryWriteIntegrationTests::test_big_query_write 
[gw4] PASSED apache_beam/io/gcp/bigquery_file_loads_test.py::BigQueryFileLoadsIT::test_one_job_fails_all_jobs_fail 
apache_beam/io/gcp/bigquery_io_read_it_test.py::BigqueryIOReadIT::test_bigquery_read_1M_python 
[gw1] PASSED apache_beam/dataframe/io_it_test.py::ReadUsingReadGbqTests::test_ReadGbq_export_with_project 
apache_beam/dataframe/io_it_test.py::ReadUsingReadGbqTests::test_ReadGbq_with_computation 
[gw3] PASSED apache_beam/io/fileio_test.py::MatchIntegrationTest::test_transform_on_gcs 
apache_beam/io/gcp/bigquery_json_it_test.py::BigQueryJsonIT::test_direct_read 
[gw2] PASSED apache_beam/io/gcp/bigquery_test.py::BigQueryStreamingInsertTransformIntegrationTests::test_multiple_destinations_transform 
apache_beam/io/gcp/bigquery_test.py::BigQueryStreamingInsertTransformIntegrationTests::test_value_provider_transform 
[gw5] PASSED apache_beam/io/gcp/big_query_query_to_table_it_test.py::BigQueryQueryToTableIT::test_big_query_new_types 
apache_beam/io/gcp/big_query_query_to_table_it_test.py::BigQueryQueryToTableIT::test_big_query_new_types_avro 
[gw0] PASSED apache_beam/io/gcp/bigquery_read_it_test.py::ReadTests::test_iobase_source 
apache_beam/io/gcp/bigquery_read_it_test.py::ReadTests::test_native_source 
[gw7] PASSED apache_beam/io/gcp/bigquery_write_it_test.py::BigQueryWriteIntegrationTests::test_big_query_write 
apache_beam/io/gcp/bigquery_write_it_test.py::BigQueryWriteIntegrationTests::test_big_query_write_insert_errors_reporting 
[gw4] PASSED apache_beam/io/gcp/bigquery_io_read_it_test.py::BigqueryIOReadIT::test_bigquery_read_1M_python 
apache_beam/io/gcp/bigquery_io_read_it_test.py::BigqueryIOReadIT::test_bigquery_read_custom_1M_python 
[gw3] PASSED apache_beam/io/gcp/bigquery_json_it_test.py::BigQueryJsonIT::test_direct_read 
apache_beam/io/gcp/bigquery_json_it_test.py::BigQueryJsonIT::test_export_read 
[gw1] PASSED apache_beam/dataframe/io_it_test.py::ReadUsingReadGbqTests::test_ReadGbq_with_computation 
apache_beam/io/gcp/gcsio_integration_test.py::GcsIOIntegrationTest::test_copy 
[gw1] PASSED apache_beam/io/gcp/gcsio_integration_test.py::GcsIOIntegrationTest::test_copy 
apache_beam/io/gcp/gcsio_integration_test.py::GcsIOIntegrationTest::test_copy_batch 
[gw1] PASSED apache_beam/io/gcp/gcsio_integration_test.py::GcsIOIntegrationTest::test_copy_batch 
apache_beam/io/gcp/gcsio_integration_test.py::GcsIOIntegrationTest::test_copy_batch_kms 
[gw1] PASSED apache_beam/io/gcp/gcsio_integration_test.py::GcsIOIntegrationTest::test_copy_batch_kms 
apache_beam/io/gcp/gcsio_integration_test.py::GcsIOIntegrationTest::test_copy_batch_rewrite_token 
[gw1] PASSED apache_beam/io/gcp/gcsio_integration_test.py::GcsIOIntegrationTest::test_copy_batch_rewrite_token 
apache_beam/io/gcp/gcsio_integration_test.py::GcsIOIntegrationTest::test_copy_kms 
[gw1] PASSED apache_beam/io/gcp/gcsio_integration_test.py::GcsIOIntegrationTest::test_copy_kms 
apache_beam/io/gcp/gcsio_integration_test.py::GcsIOIntegrationTest::test_copy_rewrite_token 
[gw1] PASSED apache_beam/io/gcp/gcsio_integration_test.py::GcsIOIntegrationTest::test_copy_rewrite_token 
apache_beam/ml/gcp/cloud_dlp_it_test.py::CloudDLPIT::test_deidentification 
[gw7] PASSED apache_beam/io/gcp/bigquery_write_it_test.py::BigQueryWriteIntegrationTests::test_big_query_write_insert_errors_reporting 
apache_beam/io/gcp/bigquery_write_it_test.py::BigQueryWriteIntegrationTests::test_big_query_write_new_types 
[gw2] PASSED apache_beam/io/gcp/bigquery_test.py::BigQueryStreamingInsertTransformIntegrationTests::test_value_provider_transform 
apache_beam/io/gcp/bigquery_test.py::PubSubBigQueryIT::test_file_loads 
[gw5] PASSED apache_beam/io/gcp/big_query_query_to_table_it_test.py::BigQueryQueryToTableIT::test_big_query_new_types_avro 
apache_beam/io/gcp/big_query_query_to_table_it_test.py::BigQueryQueryToTableIT::test_big_query_standard_sql 
[gw0] PASSED apache_beam/io/gcp/bigquery_read_it_test.py::ReadTests::test_native_source 
apache_beam/io/gcp/bigquery_read_it_test.py::ReadTests::test_table_schema_retrieve 
[gw4] PASSED apache_beam/io/gcp/bigquery_io_read_it_test.py::BigqueryIOReadIT::test_bigquery_read_custom_1M_python 
apache_beam/io/gcp/pubsub_integration_test.py::PubSubIntegrationTest::test_streaming_data_only 
[gw3] PASSED apache_beam/io/gcp/bigquery_json_it_test.py::BigQueryJsonIT::test_export_read 
apache_beam/io/gcp/bigquery_json_it_test.py::BigQueryJsonIT::test_file_loads_write 
[gw3] PASSED apache_beam/io/gcp/bigquery_json_it_test.py::BigQueryJsonIT::test_file_loads_write 
apache_beam/io/gcp/bigquery_json_it_test.py::BigQueryJsonIT::test_query_read 
[gw6] PASSED apache_beam/examples/dataframe/taxiride_it_test.py::TaxirideIT::test_enrich 
apache_beam/io/parquetio_it_test.py::TestParquetIT::test_parquetio_it 
[gw1] PASSED apache_beam/ml/gcp/cloud_dlp_it_test.py::CloudDLPIT::test_deidentification 
apache_beam/ml/gcp/cloud_dlp_it_test.py::CloudDLPIT::test_inspection 
[gw7] PASSED apache_beam/io/gcp/bigquery_write_it_test.py::BigQueryWriteIntegrationTests::test_big_query_write_new_types 
apache_beam/io/gcp/bigquery_write_it_test.py::BigQueryWriteIntegrationTests::test_big_query_write_schema_autodetect 
[gw7] SKIPPED apache_beam/io/gcp/bigquery_write_it_test.py::BigQueryWriteIntegrationTests::test_big_query_write_schema_autodetect 
apache_beam/io/gcp/bigquery_write_it_test.py::BigQueryWriteIntegrationTests::test_big_query_write_without_schema 
[gw5] PASSED apache_beam/io/gcp/big_query_query_to_table_it_test.py::BigQueryQueryToTableIT::test_big_query_standard_sql 
apache_beam/io/gcp/datastore/v1new/datastore_write_it_test.py::DatastoreWriteIT::test_datastore_write_limit 
[gw0] PASSED apache_beam/io/gcp/bigquery_read_it_test.py::ReadTests::test_table_schema_retrieve 
apache_beam/io/gcp/bigquery_read_it_test.py::ReadTests::test_table_schema_retrieve_specifying_only_table 
[gw1] PASSED apache_beam/ml/gcp/cloud_dlp_it_test.py::CloudDLPIT::test_inspection 
apache_beam/ml/gcp/naturallanguageml_test_it.py::NaturalLanguageMlTestIT::test_analyzing_syntax 
[gw6] PASSED apache_beam/io/parquetio_it_test.py::TestParquetIT::test_parquetio_it 
apache_beam/io/gcp/dicomio_integration_test.py::DICOMIoIntegrationTest::test_dicom_search_instances 
[gw3] PASSED apache_beam/io/gcp/bigquery_json_it_test.py::BigQueryJsonIT::test_query_read 
apache_beam/io/gcp/bigquery_json_it_test.py::BigQueryJsonIT::test_streaming_inserts 
[gw4] PASSED apache_beam/io/gcp/pubsub_integration_test.py::PubSubIntegrationTest::test_streaming_data_only 
apache_beam/io/gcp/pubsub_integration_test.py::PubSubIntegrationTest::test_streaming_with_attributes 
[gw2] PASSED apache_beam/io/gcp/bigquery_test.py::PubSubBigQueryIT::test_file_loads 
apache_beam/io/gcp/bigquery_test.py::PubSubBigQueryIT::test_streaming_inserts 
[gw7] PASSED apache_beam/io/gcp/bigquery_write_it_test.py::BigQueryWriteIntegrationTests::test_big_query_write_without_schema 
apache_beam/ml/inference/pytorch_inference_it_test.py::PyTorchInference::test_torch_run_inference_bert_for_masked_lm 
[gw7] SKIPPED apache_beam/ml/inference/pytorch_inference_it_test.py::PyTorchInference::test_torch_run_inference_bert_for_masked_lm 
apache_beam/ml/inference/pytorch_inference_it_test.py::PyTorchInference::test_torch_run_inference_coco_maskrcnn_resnet50_fpn 
[gw7] SKIPPED apache_beam/ml/inference/pytorch_inference_it_test.py::PyTorchInference::test_torch_run_inference_coco_maskrcnn_resnet50_fpn 
apache_beam/ml/inference/pytorch_inference_it_test.py::PyTorchInference::test_torch_run_inference_imagenet_mobilenetv2 
[gw7] SKIPPED apache_beam/ml/inference/pytorch_inference_it_test.py::PyTorchInference::test_torch_run_inference_imagenet_mobilenetv2 
[gw0] PASSED apache_beam/io/gcp/bigquery_read_it_test.py::ReadTests::test_table_schema_retrieve_specifying_only_table 
apache_beam/io/gcp/bigquery_read_it_test.py::ReadTests::test_table_schema_retrieve_with_direct_read 
[gw6] PASSED apache_beam/io/gcp/dicomio_integration_test.py::DICOMIoIntegrationTest::test_dicom_search_instances 
apache_beam/io/gcp/dicomio_integration_test.py::DICOMIoIntegrationTest::test_dicom_store_instance_from_gcs 
[gw1] PASSED apache_beam/ml/gcp/naturallanguageml_test_it.py::NaturalLanguageMlTestIT::test_analyzing_syntax 
apache_beam/ml/inference/base_test.py::RunInferenceBaseTest::test_run_inference_with_side_inputin_streaming 
[gw1] SKIPPED apache_beam/ml/inference/base_test.py::RunInferenceBaseTest::test_run_inference_with_side_inputin_streaming 
apache_beam/ml/inference/sklearn_inference_it_test.py::SklearnInference::test_sklearn_mnist_classification 
[gw4] PASSED apache_beam/io/gcp/pubsub_integration_test.py::PubSubIntegrationTest::test_streaming_with_attributes 
apache_beam/ml/gcp/videointelligenceml_test_it.py::VideoIntelligenceMlTestIT::test_label_detection_with_video_context 
[gw6] PASSED apache_beam/io/gcp/dicomio_integration_test.py::DICOMIoIntegrationTest::test_dicom_store_instance_from_gcs 
apache_beam/runners/dataflow/dataflow_exercise_metrics_pipeline_test.py::ExerciseMetricsPipelineTest::test_metrics_fnapi_it 
[gw6] SKIPPED apache_beam/runners/dataflow/dataflow_exercise_metrics_pipeline_test.py::ExerciseMetricsPipelineTest::test_metrics_fnapi_it 
apache_beam/runners/dataflow/dataflow_exercise_metrics_pipeline_test.py::ExerciseMetricsPipelineTest::test_metrics_it 
[gw6] SKIPPED apache_beam/runners/dataflow/dataflow_exercise_metrics_pipeline_test.py::ExerciseMetricsPipelineTest::test_metrics_it 
[gw1] PASSED apache_beam/ml/inference/sklearn_inference_it_test.py::SklearnInference::test_sklearn_mnist_classification 
apache_beam/ml/inference/sklearn_inference_it_test.py::SklearnInference::test_sklearn_regression 
[gw0] PASSED apache_beam/io/gcp/bigquery_read_it_test.py::ReadTests::test_table_schema_retrieve_with_direct_read 
apache_beam/io/gcp/bigquery_read_it_test.py::ReadUsingStorageApiTests::test_iobase_source 
[gw3] PASSED apache_beam/io/gcp/bigquery_json_it_test.py::BigQueryJsonIT::test_streaming_inserts 
apache_beam/ml/gcp/visionml_test_it.py::VisionMlTestIT::test_text_detection_with_language_hint 
[gw4] PASSED apache_beam/ml/gcp/videointelligenceml_test_it.py::VideoIntelligenceMlTestIT::test_label_detection_with_video_context 
apache_beam/transforms/external_it_test.py::ExternalTransformIT::test_job_python_from_python_it 
[gw2] PASSED apache_beam/io/gcp/bigquery_test.py::PubSubBigQueryIT::test_streaming_inserts 
apache_beam/io/gcp/bigquery_test.py::BigQueryFileLoadsIntegrationTests::test_avro_file_load 
[gw1] PASSED apache_beam/ml/inference/sklearn_inference_it_test.py::SklearnInference::test_sklearn_regression 
[gw0] PASSED apache_beam/io/gcp/bigquery_read_it_test.py::ReadUsingStorageApiTests::test_iobase_source 
apache_beam/io/gcp/bigquery_read_it_test.py::ReadUsingStorageApiTests::test_iobase_source_with_column_selection 
[gw3] PASSED apache_beam/ml/gcp/visionml_test_it.py::VisionMlTestIT::test_text_detection_with_language_hint 
apache_beam/testing/test_stream_it_test.py::TestStreamIntegrationTests::test_basic_execution 
[gw3] SKIPPED apache_beam/testing/test_stream_it_test.py::TestStreamIntegrationTests::test_basic_execution 
apache_beam/testing/test_stream_it_test.py::TestStreamIntegrationTests::test_multiple_outputs 
[gw3] SKIPPED apache_beam/testing/test_stream_it_test.py::TestStreamIntegrationTests::test_multiple_outputs 
apache_beam/testing/test_stream_it_test.py::TestStreamIntegrationTests::test_multiple_outputs_with_watermark_advancement 
[gw3] SKIPPED apache_beam/testing/test_stream_it_test.py::TestStreamIntegrationTests::test_multiple_outputs_with_watermark_advancement 
[gw4] PASSED apache_beam/transforms/external_it_test.py::ExternalTransformIT::test_job_python_from_python_it 
[gw2] PASSED apache_beam/io/gcp/bigquery_test.py::BigQueryFileLoadsIntegrationTests::test_avro_file_load 
apache_beam/transforms/periodicsequence_it_test.py::PeriodicSequenceIT::test_periodicsequence_outputs_valid_watermarks_it 
[gw2] SKIPPED apache_beam/transforms/periodicsequence_it_test.py::PeriodicSequenceIT::test_periodicsequence_outputs_valid_watermarks_it 
[gw0] PASSED apache_beam/io/gcp/bigquery_read_it_test.py::ReadUsingStorageApiTests::test_iobase_source_with_column_selection 
apache_beam/io/gcp/bigquery_read_it_test.py::ReadUsingStorageApiTests::test_iobase_source_with_column_selection_and_row_restriction 
[gw5] PASSED apache_beam/io/gcp/datastore/v1new/datastore_write_it_test.py::DatastoreWriteIT::test_datastore_write_limit 
apache_beam/ml/gcp/recommendations_ai_test_it.py::RecommendationAIIT::test_create_catalog_item 
[gw0] PASSED apache_beam/io/gcp/bigquery_read_it_test.py::ReadUsingStorageApiTests::test_iobase_source_with_column_selection_and_row_restriction 
apache_beam/io/gcp/bigquery_read_it_test.py::ReadUsingStorageApiTests::test_iobase_source_with_native_datetime FATAL: command execution failed
java.io.IOException: Backing channel 'apache-beam-jenkins-5' is disconnected.
	at hudson.remoting.RemoteInvocationHandler.channelOrFail(RemoteInvocationHandler.java:215)
	at hudson.remoting.RemoteInvocationHandler.invoke(RemoteInvocationHandler.java:285)
	at com.sun.proxy.$Proxy132.isAlive(Unknown Source)
	at hudson.Launcher$RemoteLauncher$ProcImpl.isAlive(Launcher.java:1215)
	at hudson.Launcher$RemoteLauncher$ProcImpl.join(Launcher.java:1207)
	at hudson.Launcher$ProcStarter.join(Launcher.java:524)
	at hudson.plugins.gradle.Gradle.perform(Gradle.java:317)
	at hudson.tasks.BuildStepMonitor$1.perform(BuildStepMonitor.java:20)
	at hudson.model.AbstractBuild$AbstractBuildExecution.perform(AbstractBuild.java:814)
	at hudson.model.Build$BuildExecution.build(Build.java:199)
	at hudson.model.Build$BuildExecution.doRun(Build.java:164)
	at hudson.model.AbstractBuild$AbstractBuildExecution.run(AbstractBuild.java:522)
	at hudson.model.Run.execute(Run.java:1896)
	at hudson.model.FreeStyleBuild.run(FreeStyleBuild.java:44)
	at hudson.model.ResourceController.execute(ResourceController.java:101)
	at hudson.model.Executor.run(Executor.java:442)
Caused by: hudson.remoting.Channel$OrderlyShutdown: Command Close created at
	at hudson.remoting.Channel$CloseCommand.execute(Channel.java:1313)
	at hudson.remoting.Channel$1.handle(Channel.java:606)
	at hudson.remoting.SynchronousCommandTransport$ReaderThread.run(SynchronousCommandTransport.java:81)
Caused by: Command Close created at
	at hudson.remoting.Command.<init>(Command.java:70)
	at hudson.remoting.Channel$CloseCommand.<init>(Channel.java:1306)
	at hudson.remoting.Channel$CloseCommand.<init>(Channel.java:1304)
	at hudson.remoting.Channel.close(Channel.java:1480)
	at hudson.remoting.Channel.close(Channel.java:1447)
	at hudson.remoting.Channel$CloseCommand.execute(Channel.java:1312)
	... 2 more
Build step 'Invoke Gradle script' changed build result to FAILURE
Build step 'Invoke Gradle script' marked build as failure
ERROR: apache-beam-jenkins-5 is offline; cannot locate jdk_1.8_latest

---------------------------------------------------------------------
To unsubscribe, e-mail: builds-unsubscribe@beam.apache.org
For additional commands, e-mail: builds-help@beam.apache.org