You are viewing a plain text version of this content. The canonical link for it is here.
Posted to builds@solr.apache.org by Apache Jenkins Server <je...@builds.apache.org> on 2023/07/14 13:51:11 UTC
[JENKINS] Solr » Solr-Check-9.x - Build # 4882 - Still Failing!
Build: https://ci-builds.apache.org/job/Solr/job/Solr-Check-9.x/4882/
3 tests failed.
FAILED: org.apache.solr.search.TestCoordinatorRole.testConcurrentAccess
Error Message:
java.lang.AssertionError: expected:<4> but was:<5>
Stack Trace:
java.lang.AssertionError: expected:<4> but was:<5>
at __randomizedtesting.SeedInfo.seed([70558339671E1984:BF48BC38069BE4D7]:0)
at org.junit.Assert.fail(Assert.java:89)
at org.junit.Assert.failNotEquals(Assert.java:835)
at org.junit.Assert.assertEquals(Assert.java:647)
at org.junit.Assert.assertEquals(Assert.java:633)
at org.apache.solr.search.TestCoordinatorRole.testConcurrentAccess(TestCoordinatorRole.java:573)
at java.base/jdk.internal.reflect.NativeMethodAccessorImpl.invoke0(Native Method)
at java.base/jdk.internal.reflect.NativeMethodAccessorImpl.invoke(NativeMethodAccessorImpl.java:62)
at java.base/jdk.internal.reflect.DelegatingMethodAccessorImpl.invoke(DelegatingMethodAccessorImpl.java:43)
at java.base/java.lang.reflect.Method.invoke(Method.java:566)
at com.carrotsearch.randomizedtesting.RandomizedRunner.invoke(RandomizedRunner.java:1758)
at com.carrotsearch.randomizedtesting.RandomizedRunner$8.evaluate(RandomizedRunner.java:946)
at com.carrotsearch.randomizedtesting.RandomizedRunner$9.evaluate(RandomizedRunner.java:982)
at com.carrotsearch.randomizedtesting.RandomizedRunner$10.evaluate(RandomizedRunner.java:996)
at com.carrotsearch.randomizedtesting.rules.SystemPropertiesRestoreRule$1.evaluate(SystemPropertiesRestoreRule.java:80)
at org.junit.rules.RunRules.evaluate(RunRules.java:20)
at org.apache.lucene.tests.util.TestRuleSetupTeardownChained$1.evaluate(TestRuleSetupTeardownChained.java:48)
at org.apache.lucene.tests.util.AbstractBeforeAfterRule$1.evaluate(AbstractBeforeAfterRule.java:43)
at org.apache.lucene.tests.util.TestRuleThreadAndTestName$1.evaluate(TestRuleThreadAndTestName.java:45)
at org.apache.lucene.tests.util.TestRuleIgnoreAfterMaxFailures$1.evaluate(TestRuleIgnoreAfterMaxFailures.java:60)
at org.apache.lucene.tests.util.TestRuleMarkFailure$1.evaluate(TestRuleMarkFailure.java:44)
at org.junit.rules.RunRules.evaluate(RunRules.java:20)
at com.carrotsearch.randomizedtesting.rules.StatementAdapter.evaluate(StatementAdapter.java:36)
at com.carrotsearch.randomizedtesting.ThreadLeakControl$StatementRunner.run(ThreadLeakControl.java:390)
at com.carrotsearch.randomizedtesting.ThreadLeakControl.forkTimeoutingTask(ThreadLeakControl.java:843)
at com.carrotsearch.randomizedtesting.ThreadLeakControl$3.evaluate(ThreadLeakControl.java:490)
at com.carrotsearch.randomizedtesting.RandomizedRunner.runSingleTest(RandomizedRunner.java:955)
at com.carrotsearch.randomizedtesting.RandomizedRunner$5.evaluate(RandomizedRunner.java:840)
at com.carrotsearch.randomizedtesting.RandomizedRunner$6.evaluate(RandomizedRunner.java:891)
at com.carrotsearch.randomizedtesting.RandomizedRunner$7.evaluate(RandomizedRunner.java:902)
at com.carrotsearch.randomizedtesting.rules.StatementAdapter.evaluate(StatementAdapter.java:36)
at com.carrotsearch.randomizedtesting.rules.StatementAdapter.evaluate(StatementAdapter.java:36)
at org.apache.lucene.tests.util.AbstractBeforeAfterRule$1.evaluate(AbstractBeforeAfterRule.java:43)
at org.apache.lucene.tests.util.AbstractBeforeAfterRule$1.evaluate(AbstractBeforeAfterRule.java:43)
at com.carrotsearch.randomizedtesting.rules.SystemPropertiesRestoreRule$1.evaluate(SystemPropertiesRestoreRule.java:80)
at org.junit.rules.RunRules.evaluate(RunRules.java:20)
at org.apache.lucene.tests.util.AbstractBeforeAfterRule$1.evaluate(AbstractBeforeAfterRule.java:43)
at com.carrotsearch.randomizedtesting.rules.StatementAdapter.evaluate(StatementAdapter.java:36)
at org.apache.lucene.tests.util.TestRuleStoreClassName$1.evaluate(TestRuleStoreClassName.java:38)
at com.carrotsearch.randomizedtesting.rules.NoShadowingOrOverridesOnMethodsRule$1.evaluate(NoShadowingOrOverridesOnMethodsRule.java:40)
at com.carrotsearch.randomizedtesting.rules.NoShadowingOrOverridesOnMethodsRule$1.evaluate(NoShadowingOrOverridesOnMethodsRule.java:40)
at com.carrotsearch.randomizedtesting.rules.StatementAdapter.evaluate(StatementAdapter.java:36)
at com.carrotsearch.randomizedtesting.rules.StatementAdapter.evaluate(StatementAdapter.java:36)
at org.apache.lucene.tests.util.TestRuleAssertionsRequired$1.evaluate(TestRuleAssertionsRequired.java:53)
at org.apache.lucene.tests.util.AbstractBeforeAfterRule$1.evaluate(AbstractBeforeAfterRule.java:43)
at org.apache.lucene.tests.util.TestRuleMarkFailure$1.evaluate(TestRuleMarkFailure.java:44)
at org.apache.lucene.tests.util.TestRuleIgnoreAfterMaxFailures$1.evaluate(TestRuleIgnoreAfterMaxFailures.java:60)
at org.apache.lucene.tests.util.TestRuleIgnoreTestSuites$1.evaluate(TestRuleIgnoreTestSuites.java:47)
at org.junit.rules.RunRules.evaluate(RunRules.java:20)
at com.carrotsearch.randomizedtesting.rules.StatementAdapter.evaluate(StatementAdapter.java:36)
at com.carrotsearch.randomizedtesting.ThreadLeakControl$StatementRunner.run(ThreadLeakControl.java:390)
at com.carrotsearch.randomizedtesting.ThreadLeakControl.lambda$forkTimeoutingTask$0(ThreadLeakControl.java:850)
at java.base/java.lang.Thread.run(Thread.java:829)
FAILED: org.apache.solr.search.TestCoordinatorRole.classMethod
Error Message:
com.carrotsearch.randomizedtesting.ThreadLeakError: 10 threads leaked from SUITE scope at org.apache.solr.search.TestCoordinatorRole:
1) Thread[id=425, name=TestCoordinatorRole-362-thread-9, state=WAITING, group=TGRP-TestCoordinatorRole]
at java.base@11.0.16/jdk.internal.misc.Unsafe.park(Native Method)
at java.base@11.0.16/java.util.concurrent.locks.LockSupport.park(LockSupport.java:194)
at java.base@11.0.16/java.util.concurrent.locks.AbstractQueuedSynchronizer$ConditionObject.await(AbstractQueuedSynchronizer.java:2081)
at java.base@11.0.16/java.util.concurrent.LinkedBlockingQueue.take(LinkedBlockingQueue.java:433)
at java.base@11.0.16/java.util.concurrent.ThreadPoolExecutor.getTask(ThreadPoolExecutor.java:1054)
at java.base@11.0.16/java.util.concurrent.ThreadPoolExecutor.runWorker(ThreadPoolExecutor.java:1114)
at java.base@11.0.16/java.util.concurrent.ThreadPoolExecutor$Worker.run(ThreadPoolExecutor.java:628)
at java.base@11.0.16/java.lang.Thread.run(Thread.java:829)
2) Thread[id=424, name=TestCoordinatorRole-362-thread-8, state=WAITING, group=TGRP-TestCoordinatorRole]
at java.base@11.0.16/jdk.internal.misc.Unsafe.park(Native Method)
at java.base@11.0.16/java.util.concurrent.locks.LockSupport.park(LockSupport.java:194)
at java.base@11.0.16/java.util.concurrent.locks.AbstractQueuedSynchronizer$ConditionObject.await(AbstractQueuedSynchronizer.java:2081)
at java.base@11.0.16/java.util.concurrent.LinkedBlockingQueue.take(LinkedBlockingQueue.java:433)
at java.base@11.0.16/java.util.concurrent.ThreadPoolExecutor.getTask(ThreadPoolExecutor.java:1054)
at java.base@11.0.16/java.util.concurrent.ThreadPoolExecutor.runWorker(ThreadPoolExecutor.java:1114)
at java.base@11.0.16/java.util.concurrent.ThreadPoolExecutor$Worker.run(ThreadPoolExecutor.java:628)
at java.base@11.0.16/java.lang.Thread.run(Thread.java:829)
3) Thread[id=411, name=TestCoordinatorRole-362-thread-4, state=WAITING, group=TGRP-TestCoordinatorRole]
at java.base@11.0.16/jdk.internal.misc.Unsafe.park(Native Method)
at java.base@11.0.16/java.util.concurrent.locks.LockSupport.park(LockSupport.java:194)
at java.base@11.0.16/java.util.concurrent.locks.AbstractQueuedSynchronizer$ConditionObject.await(AbstractQueuedSynchronizer.java:2081)
at java.base@11.0.16/java.util.concurrent.LinkedBlockingQueue.take(LinkedBlockingQueue.java:433)
at java.base@11.0.16/java.util.concurrent.ThreadPoolExecutor.getTask(ThreadPoolExecutor.java:1054)
at java.base@11.0.16/java.util.concurrent.ThreadPoolExecutor.runWorker(ThreadPoolExecutor.java:1114)
at java.base@11.0.16/java.util.concurrent.ThreadPoolExecutor$Worker.run(ThreadPoolExecutor.java:628)
at java.base@11.0.16/java.lang.Thread.run(Thread.java:829)
4) Thread[id=412, name=TestCoordinatorRole-362-thread-5, state=WAITING, group=TGRP-TestCoordinatorRole]
at java.base@11.0.16/jdk.internal.misc.Unsafe.park(Native Method)
at java.base@11.0.16/java.util.concurrent.locks.LockSupport.park(LockSupport.java:194)
at java.base@11.0.16/java.util.concurrent.locks.AbstractQueuedSynchronizer$ConditionObject.await(AbstractQueuedSynchronizer.java:2081)
at java.base@11.0.16/java.util.concurrent.LinkedBlockingQueue.take(LinkedBlockingQueue.java:433)
at java.base@11.0.16/java.util.concurrent.ThreadPoolExecutor.getTask(ThreadPoolExecutor.java:1054)
at java.base@11.0.16/java.util.concurrent.ThreadPoolExecutor.runWorker(ThreadPoolExecutor.java:1114)
at java.base@11.0.16/java.util.concurrent.ThreadPoolExecutor$Worker.run(ThreadPoolExecutor.java:628)
at java.base@11.0.16/java.lang.Thread.run(Thread.java:829)
5) Thread[id=426, name=TestCoordinatorRole-362-thread-10, state=WAITING, group=TGRP-TestCoordinatorRole]
at java.base@11.0.16/jdk.internal.misc.Unsafe.park(Native Method)
at java.base@11.0.16/java.util.concurrent.locks.LockSupport.park(LockSupport.java:194)
at java.base@11.0.16/java.util.concurrent.locks.AbstractQueuedSynchronizer$ConditionObject.await(AbstractQueuedSynchronizer.java:2081)
at java.base@11.0.16/java.util.concurrent.LinkedBlockingQueue.take(LinkedBlockingQueue.java:433)
at java.base@11.0.16/java.util.concurrent.ThreadPoolExecutor.getTask(ThreadPoolExecutor.java:1054)
at java.base@11.0.16/java.util.concurrent.ThreadPoolExecutor.runWorker(ThreadPoolExecutor.java:1114)
at java.base@11.0.16/java.util.concurrent.ThreadPoolExecutor$Worker.run(ThreadPoolExecutor.java:628)
at java.base@11.0.16/java.lang.Thread.run(Thread.java:829)
6) Thread[id=408, name=TestCoordinatorRole-362-thread-1, state=WAITING, group=TGRP-TestCoordinatorRole]
at java.base@11.0.16/jdk.internal.misc.Unsafe.park(Native Method)
at java.base@11.0.16/java.util.concurrent.locks.LockSupport.park(LockSupport.java:194)
at java.base@11.0.16/java.util.concurrent.locks.AbstractQueuedSynchronizer$ConditionObject.await(AbstractQueuedSynchronizer.java:2081)
at java.base@11.0.16/java.util.concurrent.LinkedBlockingQueue.take(LinkedBlockingQueue.java:433)
at java.base@11.0.16/java.util.concurrent.ThreadPoolExecutor.getTask(ThreadPoolExecutor.java:1054)
at java.base@11.0.16/java.util.concurrent.ThreadPoolExecutor.runWorker(ThreadPoolExecutor.java:1114)
at java.base@11.0.16/java.util.concurrent.ThreadPoolExecutor$Worker.run(ThreadPoolExecutor.java:628)
at java.base@11.0.16/java.lang.Thread.run(Thread.java:829)
7) Thread[id=410, name=TestCoordinatorRole-362-thread-3, state=WAITING, group=TGRP-TestCoordinatorRole]
at java.base@11.0.16/jdk.internal.misc.Unsafe.park(Native Method)
at java.base@11.0.16/java.util.concurrent.locks.LockSupport.park(LockSupport.java:194)
at java.base@11.0.16/java.util.concurrent.locks.AbstractQueuedSynchronizer$ConditionObject.await(AbstractQueuedSynchronizer.java:2081)
at java.base@11.0.16/java.util.concurrent.LinkedBlockingQueue.take(LinkedBlockingQueue.java:433)
at java.base@11.0.16/java.util.concurrent.ThreadPoolExecutor.getTask(ThreadPoolExecutor.java:1054)
at java.base@11.0.16/java.util.concurrent.ThreadPoolExecutor.runWorker(ThreadPoolExecutor.java:1114)
at java.base@11.0.16/java.util.concurrent.ThreadPoolExecutor$Worker.run(ThreadPoolExecutor.java:628)
at java.base@11.0.16/java.lang.Thread.run(Thread.java:829)
8) Thread[id=409, name=TestCoordinatorRole-362-thread-2, state=WAITING, group=TGRP-TestCoordinatorRole]
at java.base@11.0.16/jdk.internal.misc.Unsafe.park(Native Method)
at java.base@11.0.16/java.util.concurrent.locks.LockSupport.park(LockSupport.java:194)
at java.base@11.0.16/java.util.concurrent.locks.AbstractQueuedSynchronizer$ConditionObject.await(AbstractQueuedSynchronizer.java:2081)
at java.base@11.0.16/java.util.concurrent.LinkedBlockingQueue.take(LinkedBlockingQueue.java:433)
at java.base@11.0.16/java.util.concurrent.ThreadPoolExecutor.getTask(ThreadPoolExecutor.java:1054)
at java.base@11.0.16/java.util.concurrent.ThreadPoolExecutor.runWorker(ThreadPoolExecutor.java:1114)
at java.base@11.0.16/java.util.concurrent.ThreadPoolExecutor$Worker.run(ThreadPoolExecutor.java:628)
at java.base@11.0.16/java.lang.Thread.run(Thread.java:829)
9) Thread[id=413, name=TestCoordinatorRole-362-thread-6, state=WAITING, group=TGRP-TestCoordinatorRole]
at java.base@11.0.16/jdk.internal.misc.Unsafe.park(Native Method)
at java.base@11.0.16/java.util.concurrent.locks.LockSupport.park(LockSupport.java:194)
at java.base@11.0.16/java.util.concurrent.locks.AbstractQueuedSynchronizer$ConditionObject.await(AbstractQueuedSynchronizer.java:2081)
at java.base@11.0.16/java.util.concurrent.LinkedBlockingQueue.take(LinkedBlockingQueue.java:433)
at java.base@11.0.16/java.util.concurrent.ThreadPoolExecutor.getTask(ThreadPoolExecutor.java:1054)
at java.base@11.0.16/java.util.concurrent.ThreadPoolExecutor.runWorker(ThreadPoolExecutor.java:1114)
at java.base@11.0.16/java.util.concurrent.ThreadPoolExecutor$Worker.run(ThreadPoolExecutor.java:628)
at java.base@11.0.16/java.lang.Thread.run(Thread.java:829)
10) Thread[id=418, name=TestCoordinatorRole-362-thread-7, state=WAITING, group=TGRP-TestCoordinatorRole]
at java.base@11.0.16/jdk.internal.misc.Unsafe.park(Native Method)
at java.base@11.0.16/java.util.concurrent.locks.LockSupport.park(LockSupport.java:194)
at java.base@11.0.16/java.util.concurrent.locks.AbstractQueuedSynchronizer$ConditionObject.await(AbstractQueuedSynchronizer.java:2081)
at java.base@11.0.16/java.util.concurrent.LinkedBlockingQueue.take(LinkedBlockingQueue.java:433)
at java.base@11.0.16/java.util.concurrent.ThreadPoolExecutor.getTask(ThreadPoolExecutor.java:1054)
at java.base@11.0.16/java.util.concurrent.ThreadPoolExecutor.runWorker(ThreadPoolExecutor.java:1114)
at java.base@11.0.16/java.util.concurrent.ThreadPoolExecutor$Worker.run(ThreadPoolExecutor.java:628)
at java.base@11.0.16/java.lang.Thread.run(Thread.java:829)
Stack Trace:
com.carrotsearch.randomizedtesting.ThreadLeakError: 10 threads leaked from SUITE scope at org.apache.solr.search.TestCoordinatorRole:
1) Thread[id=425, name=TestCoordinatorRole-362-thread-9, state=WAITING, group=TGRP-TestCoordinatorRole]
at java.base@11.0.16/jdk.internal.misc.Unsafe.park(Native Method)
at java.base@11.0.16/java.util.concurrent.locks.LockSupport.park(LockSupport.java:194)
at java.base@11.0.16/java.util.concurrent.locks.AbstractQueuedSynchronizer$ConditionObject.await(AbstractQueuedSynchronizer.java:2081)
at java.base@11.0.16/java.util.concurrent.LinkedBlockingQueue.take(LinkedBlockingQueue.java:433)
at java.base@11.0.16/java.util.concurrent.ThreadPoolExecutor.getTask(ThreadPoolExecutor.java:1054)
at java.base@11.0.16/java.util.concurrent.ThreadPoolExecutor.runWorker(ThreadPoolExecutor.java:1114)
at java.base@11.0.16/java.util.concurrent.ThreadPoolExecutor$Worker.run(ThreadPoolExecutor.java:628)
at java.base@11.0.16/java.lang.Thread.run(Thread.java:829)
2) Thread[id=424, name=TestCoordinatorRole-362-thread-8, state=WAITING, group=TGRP-TestCoordinatorRole]
at java.base@11.0.16/jdk.internal.misc.Unsafe.park(Native Method)
at java.base@11.0.16/java.util.concurrent.locks.LockSupport.park(LockSupport.java:194)
at java.base@11.0.16/java.util.concurrent.locks.AbstractQueuedSynchronizer$ConditionObject.await(AbstractQueuedSynchronizer.java:2081)
at java.base@11.0.16/java.util.concurrent.LinkedBlockingQueue.take(LinkedBlockingQueue.java:433)
at java.base@11.0.16/java.util.concurrent.ThreadPoolExecutor.getTask(ThreadPoolExecutor.java:1054)
at java.base@11.0.16/java.util.concurrent.ThreadPoolExecutor.runWorker(ThreadPoolExecutor.java:1114)
at java.base@11.0.16/java.util.concurrent.ThreadPoolExecutor$Worker.run(ThreadPoolExecutor.java:628)
at java.base@11.0.16/java.lang.Thread.run(Thread.java:829)
3) Thread[id=411, name=TestCoordinatorRole-362-thread-4, state=WAITING, group=TGRP-TestCoordinatorRole]
at java.base@11.0.16/jdk.internal.misc.Unsafe.park(Native Method)
at java.base@11.0.16/java.util.concurrent.locks.LockSupport.park(LockSupport.java:194)
at java.base@11.0.16/java.util.concurrent.locks.AbstractQueuedSynchronizer$ConditionObject.await(AbstractQueuedSynchronizer.java:2081)
at java.base@11.0.16/java.util.concurrent.LinkedBlockingQueue.take(LinkedBlockingQueue.java:433)
at java.base@11.0.16/java.util.concurrent.ThreadPoolExecutor.getTask(ThreadPoolExecutor.java:1054)
at java.base@11.0.16/java.util.concurrent.ThreadPoolExecutor.runWorker(ThreadPoolExecutor.java:1114)
at java.base@11.0.16/java.util.concurrent.ThreadPoolExecutor$Worker.run(ThreadPoolExecutor.java:628)
at java.base@11.0.16/java.lang.Thread.run(Thread.java:829)
4) Thread[id=412, name=TestCoordinatorRole-362-thread-5, state=WAITING, group=TGRP-TestCoordinatorRole]
at java.base@11.0.16/jdk.internal.misc.Unsafe.park(Native Method)
at java.base@11.0.16/java.util.concurrent.locks.LockSupport.park(LockSupport.java:194)
at java.base@11.0.16/java.util.concurrent.locks.AbstractQueuedSynchronizer$ConditionObject.await(AbstractQueuedSynchronizer.java:2081)
at java.base@11.0.16/java.util.concurrent.LinkedBlockingQueue.take(LinkedBlockingQueue.java:433)
at java.base@11.0.16/java.util.concurrent.ThreadPoolExecutor.getTask(ThreadPoolExecutor.java:1054)
at java.base@11.0.16/java.util.concurrent.ThreadPoolExecutor.runWorker(ThreadPoolExecutor.java:1114)
at java.base@11.0.16/java.util.concurrent.ThreadPoolExecutor$Worker.run(ThreadPoolExecutor.java:628)
at java.base@11.0.16/java.lang.Thread.run(Thread.java:829)
5) Thread[id=426, name=TestCoordinatorRole-362-thread-10, state=WAITING, group=TGRP-TestCoordinatorRole]
at java.base@11.0.16/jdk.internal.misc.Unsafe.park(Native Method)
at java.base@11.0.16/java.util.concurrent.locks.LockSupport.park(LockSupport.java:194)
at java.base@11.0.16/java.util.concurrent.locks.AbstractQueuedSynchronizer$ConditionObject.await(AbstractQueuedSynchronizer.java:2081)
at java.base@11.0.16/java.util.concurrent.LinkedBlockingQueue.take(LinkedBlockingQueue.java:433)
at java.base@11.0.16/java.util.concurrent.ThreadPoolExecutor.getTask(ThreadPoolExecutor.java:1054)
at java.base@11.0.16/java.util.concurrent.ThreadPoolExecutor.runWorker(ThreadPoolExecutor.java:1114)
at java.base@11.0.16/java.util.concurrent.ThreadPoolExecutor$Worker.run(ThreadPoolExecutor.java:628)
at java.base@11.0.16/java.lang.Thread.run(Thread.java:829)
6) Thread[id=408, name=TestCoordinatorRole-362-thread-1, state=WAITING, group=TGRP-TestCoordinatorRole]
at java.base@11.0.16/jdk.internal.misc.Unsafe.park(Native Method)
at java.base@11.0.16/java.util.concurrent.locks.LockSupport.park(LockSupport.java:194)
at java.base@11.0.16/java.util.concurrent.locks.AbstractQueuedSynchronizer$ConditionObject.await(AbstractQueuedSynchronizer.java:2081)
at java.base@11.0.16/java.util.concurrent.LinkedBlockingQueue.take(LinkedBlockingQueue.java:433)
at java.base@11.0.16/java.util.concurrent.ThreadPoolExecutor.getTask(ThreadPoolExecutor.java:1054)
at java.base@11.0.16/java.util.concurrent.ThreadPoolExecutor.runWorker(ThreadPoolExecutor.java:1114)
at java.base@11.0.16/java.util.concurrent.ThreadPoolExecutor$Worker.run(ThreadPoolExecutor.java:628)
at java.base@11.0.16/java.lang.Thread.run(Thread.java:829)
7) Thread[id=410, name=TestCoordinatorRole-362-thread-3, state=WAITING, group=TGRP-TestCoordinatorRole]
at java.base@11.0.16/jdk.internal.misc.Unsafe.park(Native Method)
at java.base@11.0.16/java.util.concurrent.locks.LockSupport.park(LockSupport.java:194)
at java.base@11.0.16/java.util.concurrent.locks.AbstractQueuedSynchronizer$ConditionObject.await(AbstractQueuedSynchronizer.java:2081)
at java.base@11.0.16/java.util.concurrent.LinkedBlockingQueue.take(LinkedBlockingQueue.java:433)
at java.base@11.0.16/java.util.concurrent.ThreadPoolExecutor.getTask(ThreadPoolExecutor.java:1054)
at java.base@11.0.16/java.util.concurrent.ThreadPoolExecutor.runWorker(ThreadPoolExecutor.java:1114)
at java.base@11.0.16/java.util.concurrent.ThreadPoolExecutor$Worker.run(ThreadPoolExecutor.java:628)
at java.base@11.0.16/java.lang.Thread.run(Thread.java:829)
8) Thread[id=409, name=TestCoordinatorRole-362-thread-2, state=WAITING, group=TGRP-TestCoordinatorRole]
at java.base@11.0.16/jdk.internal.misc.Unsafe.park(Native Method)
at java.base@11.0.16/java.util.concurrent.locks.LockSupport.park(LockSupport.java:194)
at java.base@11.0.16/java.util.concurrent.locks.AbstractQueuedSynchronizer$ConditionObject.await(AbstractQueuedSynchronizer.java:2081)
at java.base@11.0.16/java.util.concurrent.LinkedBlockingQueue.take(LinkedBlockingQueue.java:433)
at java.base@11.0.16/java.util.concurrent.ThreadPoolExecutor.getTask(ThreadPoolExecutor.java:1054)
at java.base@11.0.16/java.util.concurrent.ThreadPoolExecutor.runWorker(ThreadPoolExecutor.java:1114)
at java.base@11.0.16/java.util.concurrent.ThreadPoolExecutor$Worker.run(ThreadPoolExecutor.java:628)
at java.base@11.0.16/java.lang.Thread.run(Thread.java:829)
9) Thread[id=413, name=TestCoordinatorRole-362-thread-6, state=WAITING, group=TGRP-TestCoordinatorRole]
at java.base@11.0.16/jdk.internal.misc.Unsafe.park(Native Method)
at java.base@11.0.16/java.util.concurrent.locks.LockSupport.park(LockSupport.java:194)
at java.base@11.0.16/java.util.concurrent.locks.AbstractQueuedSynchronizer$ConditionObject.await(AbstractQueuedSynchronizer.java:2081)
at java.base@11.0.16/java.util.concurrent.LinkedBlockingQueue.take(LinkedBlockingQueue.java:433)
at java.base@11.0.16/java.util.concurrent.ThreadPoolExecutor.getTask(ThreadPoolExecutor.java:1054)
at java.base@11.0.16/java.util.concurrent.ThreadPoolExecutor.runWorker(ThreadPoolExecutor.java:1114)
at java.base@11.0.16/java.util.concurrent.ThreadPoolExecutor$Worker.run(ThreadPoolExecutor.java:628)
at java.base@11.0.16/java.lang.Thread.run(Thread.java:829)
10) Thread[id=418, name=TestCoordinatorRole-362-thread-7, state=WAITING, group=TGRP-TestCoordinatorRole]
at java.base@11.0.16/jdk.internal.misc.Unsafe.park(Native Method)
at java.base@11.0.16/java.util.concurrent.locks.LockSupport.park(LockSupport.java:194)
at java.base@11.0.16/java.util.concurrent.locks.AbstractQueuedSynchronizer$ConditionObject.await(AbstractQueuedSynchronizer.java:2081)
at java.base@11.0.16/java.util.concurrent.LinkedBlockingQueue.take(LinkedBlockingQueue.java:433)
at java.base@11.0.16/java.util.concurrent.ThreadPoolExecutor.getTask(ThreadPoolExecutor.java:1054)
at java.base@11.0.16/java.util.concurrent.ThreadPoolExecutor.runWorker(ThreadPoolExecutor.java:1114)
at java.base@11.0.16/java.util.concurrent.ThreadPoolExecutor$Worker.run(ThreadPoolExecutor.java:628)
at java.base@11.0.16/java.lang.Thread.run(Thread.java:829)
at __randomizedtesting.SeedInfo.seed([70558339671E1984]:0)
FAILED: org.apache.solr.search.TestCoordinatorRole.classMethod
Error Message:
com.carrotsearch.randomizedtesting.ThreadLeakError: There are still zombie threads that couldn't be terminated:
1) Thread[id=426, name=TestCoordinatorRole-362-thread-10, state=WAITING, group=TGRP-TestCoordinatorRole]
at java.base@11.0.16/jdk.internal.misc.Unsafe.park(Native Method)
at java.base@11.0.16/java.util.concurrent.locks.LockSupport.park(LockSupport.java:194)
at java.base@11.0.16/java.util.concurrent.locks.AbstractQueuedSynchronizer$ConditionObject.await(AbstractQueuedSynchronizer.java:2081)
at java.base@11.0.16/java.util.concurrent.LinkedBlockingQueue.take(LinkedBlockingQueue.java:433)
at java.base@11.0.16/java.util.concurrent.ThreadPoolExecutor.getTask(ThreadPoolExecutor.java:1054)
at java.base@11.0.16/java.util.concurrent.ThreadPoolExecutor.runWorker(ThreadPoolExecutor.java:1114)
at java.base@11.0.16/java.util.concurrent.ThreadPoolExecutor$Worker.run(ThreadPoolExecutor.java:628)
at java.base@11.0.16/java.lang.Thread.run(Thread.java:829)
2) Thread[id=425, name=TestCoordinatorRole-362-thread-9, state=WAITING, group=TGRP-TestCoordinatorRole]
at java.base@11.0.16/jdk.internal.misc.Unsafe.park(Native Method)
at java.base@11.0.16/java.util.concurrent.locks.LockSupport.park(LockSupport.java:194)
at java.base@11.0.16/java.util.concurrent.locks.AbstractQueuedSynchronizer$ConditionObject.await(AbstractQueuedSynchronizer.java:2081)
at java.base@11.0.16/java.util.concurrent.LinkedBlockingQueue.take(LinkedBlockingQueue.java:433)
at java.base@11.0.16/java.util.concurrent.ThreadPoolExecutor.getTask(ThreadPoolExecutor.java:1054)
at java.base@11.0.16/java.util.concurrent.ThreadPoolExecutor.runWorker(ThreadPoolExecutor.java:1114)
at java.base@11.0.16/java.util.concurrent.ThreadPoolExecutor$Worker.run(ThreadPoolExecutor.java:628)
at java.base@11.0.16/java.lang.Thread.run(Thread.java:829)
3) Thread[id=408, name=TestCoordinatorRole-362-thread-1, state=WAITING, group=TGRP-TestCoordinatorRole]
at java.base@11.0.16/jdk.internal.misc.Unsafe.park(Native Method)
at java.base@11.0.16/java.util.concurrent.locks.LockSupport.park(LockSupport.java:194)
at java.base@11.0.16/java.util.concurrent.locks.AbstractQueuedSynchronizer$ConditionObject.await(AbstractQueuedSynchronizer.java:2081)
at java.base@11.0.16/java.util.concurrent.LinkedBlockingQueue.take(LinkedBlockingQueue.java:433)
at java.base@11.0.16/java.util.concurrent.ThreadPoolExecutor.getTask(ThreadPoolExecutor.java:1054)
at java.base@11.0.16/java.util.concurrent.ThreadPoolExecutor.runWorker(ThreadPoolExecutor.java:1114)
at java.base@11.0.16/java.util.concurrent.ThreadPoolExecutor$Worker.run(ThreadPoolExecutor.java:628)
at java.base@11.0.16/java.lang.Thread.run(Thread.java:829)
4) Thread[id=410, name=TestCoordinatorRole-362-thread-3, state=WAITING, group=TGRP-TestCoordinatorRole]
at java.base@11.0.16/jdk.internal.misc.Unsafe.park(Native Method)
at java.base@11.0.16/java.util.concurrent.locks.LockSupport.park(LockSupport.java:194)
at java.base@11.0.16/java.util.concurrent.locks.AbstractQueuedSynchronizer$ConditionObject.await(AbstractQueuedSynchronizer.java:2081)
at java.base@11.0.16/java.util.concurrent.LinkedBlockingQueue.take(LinkedBlockingQueue.java:433)
at java.base@11.0.16/java.util.concurrent.ThreadPoolExecutor.getTask(ThreadPoolExecutor.java:1054)
at java.base@11.0.16/java.util.concurrent.ThreadPoolExecutor.runWorker(ThreadPoolExecutor.java:1114)
at java.base@11.0.16/java.util.concurrent.ThreadPoolExecutor$Worker.run(ThreadPoolExecutor.java:628)
at java.base@11.0.16/java.lang.Thread.run(Thread.java:829)
5) Thread[id=424, name=TestCoordinatorRole-362-thread-8, state=WAITING, group=TGRP-TestCoordinatorRole]
at java.base@11.0.16/jdk.internal.misc.Unsafe.park(Native Method)
at java.base@11.0.16/java.util.concurrent.locks.LockSupport.park(LockSupport.java:194)
at java.base@11.0.16/java.util.concurrent.locks.AbstractQueuedSynchronizer$ConditionObject.await(AbstractQueuedSynchronizer.java:2081)
at java.base@11.0.16/java.util.concurrent.LinkedBlockingQueue.take(LinkedBlockingQueue.java:433)
at java.base@11.0.16/java.util.concurrent.ThreadPoolExecutor.getTask(ThreadPoolExecutor.java:1054)
at java.base@11.0.16/java.util.concurrent.ThreadPoolExecutor.runWorker(ThreadPoolExecutor.java:1114)
at java.base@11.0.16/java.util.concurrent.ThreadPoolExecutor$Worker.run(ThreadPoolExecutor.java:628)
at java.base@11.0.16/java.lang.Thread.run(Thread.java:829)
6) Thread[id=409, name=TestCoordinatorRole-362-thread-2, state=WAITING, group=TGRP-TestCoordinatorRole]
at java.base@11.0.16/jdk.internal.misc.Unsafe.park(Native Method)
at java.base@11.0.16/java.util.concurrent.locks.LockSupport.park(LockSupport.java:194)
at java.base@11.0.16/java.util.concurrent.locks.AbstractQueuedSynchronizer$ConditionObject.await(AbstractQueuedSynchronizer.java:2081)
at java.base@11.0.16/java.util.concurrent.LinkedBlockingQueue.take(LinkedBlockingQueue.java:433)
at java.base@11.0.16/java.util.concurrent.ThreadPoolExecutor.getTask(ThreadPoolExecutor.java:1054)
at java.base@11.0.16/java.util.concurrent.ThreadPoolExecutor.runWorker(ThreadPoolExecutor.java:1114)
at java.base@11.0.16/java.util.concurrent.ThreadPoolExecutor$Worker.run(ThreadPoolExecutor.java:628)
at java.base@11.0.16/java.lang.Thread.run(Thread.java:829)
7) Thread[id=411, name=TestCoordinatorRole-362-thread-4, state=WAITING, group=TGRP-TestCoordinatorRole]
at java.base@11.0.16/jdk.internal.misc.Unsafe.park(Native Method)
at java.base@11.0.16/java.util.concurrent.locks.LockSupport.park(LockSupport.java:194)
at java.base@11.0.16/java.util.concurrent.locks.AbstractQueuedSynchronizer$ConditionObject.await(AbstractQueuedSynchronizer.java:2081)
at java.base@11.0.16/java.util.concurrent.LinkedBlockingQueue.take(LinkedBlockingQueue.java:433)
at java.base@11.0.16/java.util.concurrent.ThreadPoolExecutor.getTask(ThreadPoolExecutor.java:1054)
at java.base@11.0.16/java.util.concurrent.ThreadPoolExecutor.runWorker(ThreadPoolExecutor.java:1114)
at java.base@11.0.16/java.util.concurrent.ThreadPoolExecutor$Worker.run(ThreadPoolExecutor.java:628)
at java.base@11.0.16/java.lang.Thread.run(Thread.java:829)
8) Thread[id=412, name=TestCoordinatorRole-362-thread-5, state=WAITING, group=TGRP-TestCoordinatorRole]
at java.base@11.0.16/jdk.internal.misc.Unsafe.park(Native Method)
at java.base@11.0.16/java.util.concurrent.locks.LockSupport.park(LockSupport.java:194)
at java.base@11.0.16/java.util.concurrent.locks.AbstractQueuedSynchronizer$ConditionObject.await(AbstractQueuedSynchronizer.java:2081)
at java.base@11.0.16/java.util.concurrent.LinkedBlockingQueue.take(LinkedBlockingQueue.java:433)
at java.base@11.0.16/java.util.concurrent.ThreadPoolExecutor.getTask(ThreadPoolExecutor.java:1054)
at java.base@11.0.16/java.util.concurrent.ThreadPoolExecutor.runWorker(ThreadPoolExecutor.java:1114)
at java.base@11.0.16/java.util.concurrent.ThreadPoolExecutor$Worker.run(ThreadPoolExecutor.java:628)
at java.base@11.0.16/java.lang.Thread.run(Thread.java:829)
9) Thread[id=413, name=TestCoordinatorRole-362-thread-6, state=WAITING, group=TGRP-TestCoordinatorRole]
at java.base@11.0.16/jdk.internal.misc.Unsafe.park(Native Method)
at java.base@11.0.16/java.util.concurrent.locks.LockSupport.park(LockSupport.java:194)
at java.base@11.0.16/java.util.concurrent.locks.AbstractQueuedSynchronizer$ConditionObject.await(AbstractQueuedSynchronizer.java:2081)
at java.base@11.0.16/java.util.concurrent.LinkedBlockingQueue.take(LinkedBlockingQueue.java:433)
at java.base@11.0.16/java.util.concurrent.ThreadPoolExecutor.getTask(ThreadPoolExecutor.java:1054)
at java.base@11.0.16/java.util.concurrent.ThreadPoolExecutor.runWorker(ThreadPoolExecutor.java:1114)
at java.base@11.0.16/java.util.concurrent.ThreadPoolExecutor$Worker.run(ThreadPoolExecutor.java:628)
at java.base@11.0.16/java.lang.Thread.run(Thread.java:829)
10) Thread[id=418, name=TestCoordinatorRole-362-thread-7, state=WAITING, group=TGRP-TestCoordinatorRole]
at java.base@11.0.16/jdk.internal.misc.Unsafe.park(Native Method)
at java.base@11.0.16/java.util.concurrent.locks.LockSupport.park(LockSupport.java:194)
at java.base@11.0.16/java.util.concurrent.locks.AbstractQueuedSynchronizer$ConditionObject.await(AbstractQueuedSynchronizer.java:2081)
at java.base@11.0.16/java.util.concurrent.LinkedBlockingQueue.take(LinkedBlockingQueue.java:433)
at java.base@11.0.16/java.util.concurrent.ThreadPoolExecutor.getTask(ThreadPoolExecutor.java:1054)
at java.base@11.0.16/java.util.concurrent.ThreadPoolExecutor.runWorker(ThreadPoolExecutor.java:1114)
at java.base@11.0.16/java.util.concurrent.ThreadPoolExecutor$Worker.run(ThreadPoolExecutor.java:628)
at java.base@11.0.16/java.lang.Thread.run(Thread.java:829)
Stack Trace:
com.carrotsearch.randomizedtesting.ThreadLeakError: There are still zombie threads that couldn't be terminated:
1) Thread[id=426, name=TestCoordinatorRole-362-thread-10, state=WAITING, group=TGRP-TestCoordinatorRole]
at java.base@11.0.16/jdk.internal.misc.Unsafe.park(Native Method)
at java.base@11.0.16/java.util.concurrent.locks.LockSupport.park(LockSupport.java:194)
at java.base@11.0.16/java.util.concurrent.locks.AbstractQueuedSynchronizer$ConditionObject.await(AbstractQueuedSynchronizer.java:2081)
at java.base@11.0.16/java.util.concurrent.LinkedBlockingQueue.take(LinkedBlockingQueue.java:433)
at java.base@11.0.16/java.util.concurrent.ThreadPoolExecutor.getTask(ThreadPoolExecutor.java:1054)
at java.base@11.0.16/java.util.concurrent.ThreadPoolExecutor.runWorker(ThreadPoolExecutor.java:1114)
at java.base@11.0.16/java.util.concurrent.ThreadPoolExecutor$Worker.run(ThreadPoolExecutor.java:628)
at java.base@11.0.16/java.lang.Thread.run(Thread.java:829)
2) Thread[id=425, name=TestCoordinatorRole-362-thread-9, state=WAITING, group=TGRP-TestCoordinatorRole]
at java.base@11.0.16/jdk.internal.misc.Unsafe.park(Native Method)
at java.base@11.0.16/java.util.concurrent.locks.LockSupport.park(LockSupport.java:194)
at java.base@11.0.16/java.util.concurrent.locks.AbstractQueuedSynchronizer$ConditionObject.await(AbstractQueuedSynchronizer.java:2081)
at java.base@11.0.16/java.util.concurrent.LinkedBlockingQueue.take(LinkedBlockingQueue.java:433)
at java.base@11.0.16/java.util.concurrent.ThreadPoolExecutor.getTask(ThreadPoolExecutor.java:1054)
at java.base@11.0.16/java.util.concurrent.ThreadPoolExecutor.runWorker(ThreadPoolExecutor.java:1114)
at java.base@11.0.16/java.util.concurrent.ThreadPoolExecutor$Worker.run(ThreadPoolExecutor.java:628)
at java.base@11.0.16/java.lang.Thread.run(Thread.java:829)
3) Thread[id=408, name=TestCoordinatorRole-362-thread-1, state=WAITING, group=TGRP-TestCoordinatorRole]
at java.base@11.0.16/jdk.internal.misc.Unsafe.park(Native Method)
at java.base@11.0.16/java.util.concurrent.locks.LockSupport.park(LockSupport.java:194)
at java.base@11.0.16/java.util.concurrent.locks.AbstractQueuedSynchronizer$ConditionObject.await(AbstractQueuedSynchronizer.java:2081)
at java.base@11.0.16/java.util.concurrent.LinkedBlockingQueue.take(LinkedBlockingQueue.java:433)
at java.base@11.0.16/java.util.concurrent.ThreadPoolExecutor.getTask(ThreadPoolExecutor.java:1054)
at java.base@11.0.16/java.util.concurrent.ThreadPoolExecutor.runWorker(ThreadPoolExecutor.java:1114)
at java.base@11.0.16/java.util.concurrent.ThreadPoolExecutor$Worker.run(ThreadPoolExecutor.java:628)
at java.base@11.0.16/java.lang.Thread.run(Thread.java:829)
4) Thread[id=410, name=TestCoordinatorRole-362-thread-3, state=WAITING, group=TGRP-TestCoordinatorRole]
at java.base@11.0.16/jdk.internal.misc.Unsafe.park(Native Method)
at java.base@11.0.16/java.util.concurrent.locks.LockSupport.park(LockSupport.java:194)
at java.base@11.0.16/java.util.concurrent.locks.AbstractQueuedSynchronizer$ConditionObject.await(AbstractQueuedSynchronizer.java:2081)
at java.base@11.0.16/java.util.concurrent.LinkedBlockingQueue.take(LinkedBlockingQueue.java:433)
at java.base@11.0.16/java.util.concurrent.ThreadPoolExecutor.getTask(ThreadPoolExecutor.java:1054)
at java.base@11.0.16/java.util.concurrent.ThreadPoolExecutor.runWorker(ThreadPoolExecutor.java:1114)
at java.base@11.0.16/java.util.concurrent.ThreadPoolExecutor$Worker.run(ThreadPoolExecutor.java:628)
at java.base@11.0.16/java.lang.Thread.run(Thread.java:829)
5) Thread[id=424, name=TestCoordinatorRole-362-thread-8, state=WAITING, group=TGRP-TestCoordinatorRole]
at java.base@11.0.16/jdk.internal.misc.Unsafe.park(Native Method)
at java.base@11.0.16/java.util.concurrent.locks.LockSupport.park(LockSupport.java:194)
at java.base@11.0.16/java.util.concurrent.locks.AbstractQueuedSynchronizer$ConditionObject.await(AbstractQueuedSynchronizer.java:2081)
at java.base@11.0.16/java.util.concurrent.LinkedBlockingQueue.take(LinkedBlockingQueue.java:433)
at java.base@11.0.16/java.util.concurrent.ThreadPoolExecutor.getTask(ThreadPoolExecutor.java:1054)
at java.base@11.0.16/java.util.concurrent.ThreadPoolExecutor.runWorker(ThreadPoolExecutor.java:1114)
at java.base@11.0.16/java.util.concurrent.ThreadPoolExecutor$Worker.run(ThreadPoolExecutor.java:628)
at java.base@11.0.16/java.lang.Thread.run(Thread.java:829)
6) Thread[id=409, name=TestCoordinatorRole-362-thread-2, state=WAITING, group=TGRP-TestCoordinatorRole]
at java.base@11.0.16/jdk.internal.misc.Unsafe.park(Native Method)
at java.base@11.0.16/java.util.concurrent.locks.LockSupport.park(LockSupport.java:194)
at java.base@11.0.16/java.util.concurrent.locks.AbstractQueuedSynchronizer$ConditionObject.await(AbstractQueuedSynchronizer.java:2081)
at java.base@11.0.16/java.util.concurrent.LinkedBlockingQueue.take(LinkedBlockingQueue.java:433)
at java.base@11.0.16/java.util.concurrent.ThreadPoolExecutor.getTask(ThreadPoolExecutor.java:1054)
at java.base@11.0.16/java.util.concurrent.ThreadPoolExecutor.runWorker(ThreadPoolExecutor.java:1114)
at java.base@11.0.16/java.util.concurrent.ThreadPoolExecutor$Worker.run(ThreadPoolExecutor.java:628)
at java.base@11.0.16/java.lang.Thread.run(Thread.java:829)
7) Thread[id=411, name=TestCoordinatorRole-362-thread-4, state=WAITING, group=TGRP-TestCoordinatorRole]
at java.base@11.0.16/jdk.internal.misc.Unsafe.park(Native Method)
at java.base@11.0.16/java.util.concurrent.locks.LockSupport.park(LockSupport.java:194)
at java.base@11.0.16/java.util.concurrent.locks.AbstractQueuedSynchronizer$ConditionObject.await(AbstractQueuedSynchronizer.java:2081)
at java.base@11.0.16/java.util.concurrent.LinkedBlockingQueue.take(LinkedBlockingQueue.java:433)
at java.base@11.0.16/java.util.concurrent.ThreadPoolExecutor.getTask(ThreadPoolExecutor.java:1054)
at java.base@11.0.16/java.util.concurrent.ThreadPoolExecutor.runWorker(ThreadPoolExecutor.java:1114)
at java.base@11.0.16/java.util.concurrent.ThreadPoolExecutor$Worker.run(ThreadPoolExecutor.java:628)
at java.base@11.0.16/java.lang.Thread.run(Thread.java:829)
8) Thread[id=412, name=TestCoordinatorRole-362-thread-5, state=WAITING, group=TGRP-TestCoordinatorRole]
at java.base@11.0.16/jdk.internal.misc.Unsafe.park(Native Method)
at java.base@11.0.16/java.util.concurrent.locks.LockSupport.park(LockSupport.java:194)
at java.base@11.0.16/java.util.concurrent.locks.AbstractQueuedSynchronizer$ConditionObject.await(AbstractQueuedSynchronizer.java:2081)
at java.base@11.0.16/java.util.concurrent.LinkedBlockingQueue.take(LinkedBlockingQueue.java:433)
at java.base@11.0.16/java.util.concurrent.ThreadPoolExecutor.getTask(ThreadPoolExecutor.java:1054)
at java.base@11.0.16/java.util.concurrent.ThreadPoolExecutor.runWorker(ThreadPoolExecutor.java:1114)
at java.base@11.0.16/java.util.concurrent.ThreadPoolExecutor$Worker.run(ThreadPoolExecutor.java:628)
at java.base@11.0.16/java.lang.Thread.run(Thread.java:829)
9) Thread[id=413, name=TestCoordinatorRole-362-thread-6, state=WAITING, group=TGRP-TestCoordinatorRole]
at java.base@11.0.16/jdk.internal.misc.Unsafe.park(Native Method)
at java.base@11.0.16/java.util.concurrent.locks.LockSupport.park(LockSupport.java:194)
at java.base@11.0.16/java.util.concurrent.locks.AbstractQueuedSynchronizer$ConditionObject.await(AbstractQueuedSynchronizer.java:2081)
at java.base@11.0.16/java.util.concurrent.LinkedBlockingQueue.take(LinkedBlockingQueue.java:433)
at java.base@11.0.16/java.util.concurrent.ThreadPoolExecutor.getTask(ThreadPoolExecutor.java:1054)
at java.base@11.0.16/java.util.concurrent.ThreadPoolExecutor.runWorker(ThreadPoolExecutor.java:1114)
at java.base@11.0.16/java.util.concurrent.ThreadPoolExecutor$Worker.run(ThreadPoolExecutor.java:628)
at java.base@11.0.16/java.lang.Thread.run(Thread.java:829)
10) Thread[id=418, name=TestCoordinatorRole-362-thread-7, state=WAITING, group=TGRP-TestCoordinatorRole]
at java.base@11.0.16/jdk.internal.misc.Unsafe.park(Native Method)
at java.base@11.0.16/java.util.concurrent.locks.LockSupport.park(LockSupport.java:194)
at java.base@11.0.16/java.util.concurrent.locks.AbstractQueuedSynchronizer$ConditionObject.await(AbstractQueuedSynchronizer.java:2081)
at java.base@11.0.16/java.util.concurrent.LinkedBlockingQueue.take(LinkedBlockingQueue.java:433)
at java.base@11.0.16/java.util.concurrent.ThreadPoolExecutor.getTask(ThreadPoolExecutor.java:1054)
at java.base@11.0.16/java.util.concurrent.ThreadPoolExecutor.runWorker(ThreadPoolExecutor.java:1114)
at java.base@11.0.16/java.util.concurrent.ThreadPoolExecutor$Worker.run(ThreadPoolExecutor.java:628)
at java.base@11.0.16/java.lang.Thread.run(Thread.java:829)
at __randomizedtesting.SeedInfo.seed([70558339671E1984]:0)
Build Log:
[...truncated 9420 lines...]
# ERROR: Error from server at http://localhost:8983/solr/admin/collections?action=CREATE&name=COLL_NAME&collection.configName=COLL_NAME&numShards=1&nrtReplicas=1&wt=javabin&version=2: org.apache.solr.cluster.placement.PlacementException: Not enough eligible nodes to place 1 replica(s) of type NRT for shard shard1 of collection COLL_NAME. Only able to place 0 replicas.
ok 42 Random placement plugin using ENV in 22295ms
ok 43 post solr log into solr in 9011ms
ok 44 start solr with ssl in 20115ms
ok 45 start solr with ssl and auth in 21988ms
ok 46 SOLR-11740 check 'solr stop' connection in 28321ms
ok 47 status detects locally running solr in 14357ms
ok 48 status does not expose cli parameters to end user in 214ms
ok 49 listing out files in 2146ms
ok 50 copying files around in 6447ms
ok 51 upconfig in 2600ms
> Task :solr:packaging:integrationTests FAILED
ERROR: The following test(s) have failed:
- org.apache.solr.search.TestCoordinatorRole.testConcurrentAccess (:solr:core)
Test output: /tmp/src/solr/solr/core/build/test-results/test/outputs/OUTPUT-org.apache.solr.search.TestCoordinatorRole.txt
Reproduce with: gradlew :solr:core:test --tests "org.apache.solr.search.TestCoordinatorRole.testConcurrentAccess" -Ptests.jvms=96 "-Ptests.jvmargs=-XX:TieredStopAtLevel=1 -XX:+UseParallelGC -XX:ActiveProcessorCount=1 -XX:ReservedCodeCacheSize=120m" -Ptests.seed=70558339671E1984 -Ptests.file.encoding=UTF-8
- org.apache.solr.search.TestCoordinatorRole.classMethod (:solr:core)
Test output: /tmp/src/solr/solr/core/build/test-results/test/outputs/OUTPUT-org.apache.solr.search.TestCoordinatorRole.txt
Reproduce with: gradlew :solr:core:test --tests "org.apache.solr.search.TestCoordinatorRole.classMethod" -Ptests.jvms=96 "-Ptests.jvmargs=-XX:TieredStopAtLevel=1 -XX:+UseParallelGC -XX:ActiveProcessorCount=1 -XX:ReservedCodeCacheSize=120m" -Ptests.seed=70558339671E1984 -Ptests.file.encoding=UTF-8
- org.apache.solr.search.TestCoordinatorRole.classMethod (:solr:core)
Test output: /tmp/src/solr/solr/core/build/test-results/test/outputs/OUTPUT-org.apache.solr.search.TestCoordinatorRole.txt
Reproduce with: gradlew :solr:core:test --tests "org.apache.solr.search.TestCoordinatorRole.classMethod" -Ptests.jvms=96 "-Ptests.jvmargs=-XX:TieredStopAtLevel=1 -XX:+UseParallelGC -XX:ActiveProcessorCount=1 -XX:ReservedCodeCacheSize=120m" -Ptests.seed=70558339671E1984 -Ptests.file.encoding=UTF-8
FAILURE: Build completed with 2 failures.
1: Task failed with an exception.
-----------
* What went wrong:
Execution failed for task ':solr:core:test'.
> There were failing tests. See the results at: file:///tmp/src/solr/solr/core/build/test-results/test/
* Try:
> Run with --stacktrace option to get the stack trace.
> Run with --info or --debug option to get more log output.
> Run with --scan to get full insights.
==============================================================================
2: Task failed with an exception.
-----------
* Where:
Build file '/tmp/src/solr/solr/packaging/build.gradle' line: 285
* What went wrong:
Execution failed for task ':solr:packaging:integrationTests'.
> Process 'command '/tmp/src/solr/.gradle/node/packaging/node_modules/bats/bin/bats'' finished with non-zero exit value 1
* Try:
> Run with --stacktrace option to get the stack trace.
> Run with --info or --debug option to get more log output.
> Run with --scan to get full insights.
==============================================================================
* Get more help at https://help.gradle.org
BUILD FAILED in 15m 57s
625 actionable tasks: 609 executed, 16 up-to-date
[0m[?12l[?25h
------------------------------------------------------------------------
Build Failed: returned 1
Total time: 16m19s
------------------------------------------------------------------------
+ status=1
+ ./crave pull '**/build/**/test/TEST-*.xml' '**/*.events' 'heapdumps/**' '**/hs_err_pid*'
Error: rsync: [sender] change_dir "/tmp/src/solr/heapdumps" failed: No such file or directory (2)
rsync error: some files/attrs were not transferred (see previous errors) (code 23) at main.c(1684) [Receiver=3.1.3]
rsync: [Receiver] write error: Broken pipe (32)
+ exit 1
Build step 'Execute shell' marked build as failure
Archiving artifacts
Recording test results
[Checks API] No suitable checks publisher found.
Email was triggered for: Failure - Any
Sending email for trigger: Failure - Any
[JENKINS] Solr » Solr-Check-9.x - Build # 4893 - Still Failing!
Posted by Apache Jenkins Server <je...@builds.apache.org>.
Build: https://ci-builds.apache.org/job/Solr/job/Solr-Check-9.x/4893/
No tests ran.
Build Log:
[...truncated 120 lines...]
ERROR: Step ‘Publish JUnit test result report’ failed: No test report files were found. Configuration error?
Email was triggered for: Failure - Any
Sending email for trigger: Failure - Any
[JENKINS] Solr » Solr-Check-9.x - Build # 4892 - Still Failing!
Posted by Apache Jenkins Server <je...@builds.apache.org>.
Build: https://ci-builds.apache.org/job/Solr/job/Solr-Check-9.x/4892/
No tests ran.
Build Log:
[...truncated 120 lines...]
ERROR: Step ‘Publish JUnit test result report’ failed: No test report files were found. Configuration error?
Email was triggered for: Failure - Any
Sending email for trigger: Failure - Any
[JENKINS] Solr » Solr-Check-9.x - Build # 4891 - Still Failing!
Posted by Apache Jenkins Server <je...@builds.apache.org>.
Build: https://ci-builds.apache.org/job/Solr/job/Solr-Check-9.x/4891/
No tests ran.
Build Log:
[...truncated 120 lines...]
ERROR: Step ‘Publish JUnit test result report’ failed: No test report files were found. Configuration error?
Email was triggered for: Failure - Any
Sending email for trigger: Failure - Any
[JENKINS] Solr » Solr-Check-9.x - Build # 4890 - Still Failing!
Posted by Apache Jenkins Server <je...@builds.apache.org>.
Build: https://ci-builds.apache.org/job/Solr/job/Solr-Check-9.x/4890/
No tests ran.
Build Log:
[...truncated 120 lines...]
ERROR: Step ‘Publish JUnit test result report’ failed: No test report files were found. Configuration error?
Email was triggered for: Failure - Any
Sending email for trigger: Failure - Any
[JENKINS] Solr » Solr-Check-9.x - Build # 4889 - Still Failing!
Posted by Apache Jenkins Server <je...@builds.apache.org>.
Build: https://ci-builds.apache.org/job/Solr/job/Solr-Check-9.x/4889/
No tests ran.
Build Log:
[...truncated 120 lines...]
ERROR: Step ‘Publish JUnit test result report’ failed: No test report files were found. Configuration error?
Email was triggered for: Failure - Any
Sending email for trigger: Failure - Any
[JENKINS] Solr » Solr-Check-9.x - Build # 4888 - Still Failing!
Posted by Apache Jenkins Server <je...@builds.apache.org>.
Build: https://ci-builds.apache.org/job/Solr/job/Solr-Check-9.x/4888/
3 tests failed.
FAILED: org.apache.solr.search.TestCoordinatorRole.testConcurrentAccess
Error Message:
java.lang.AssertionError: expected:<4> but was:<5>
Stack Trace:
java.lang.AssertionError: expected:<4> but was:<5>
at __randomizedtesting.SeedInfo.seed([B64678882F9587A3:795B47894E107AF0]:0)
at org.junit.Assert.fail(Assert.java:89)
at org.junit.Assert.failNotEquals(Assert.java:835)
at org.junit.Assert.assertEquals(Assert.java:647)
at org.junit.Assert.assertEquals(Assert.java:633)
at org.apache.solr.search.TestCoordinatorRole.testConcurrentAccess(TestCoordinatorRole.java:573)
at java.base/jdk.internal.reflect.NativeMethodAccessorImpl.invoke0(Native Method)
at java.base/jdk.internal.reflect.NativeMethodAccessorImpl.invoke(NativeMethodAccessorImpl.java:62)
at java.base/jdk.internal.reflect.DelegatingMethodAccessorImpl.invoke(DelegatingMethodAccessorImpl.java:43)
at java.base/java.lang.reflect.Method.invoke(Method.java:566)
at com.carrotsearch.randomizedtesting.RandomizedRunner.invoke(RandomizedRunner.java:1758)
at com.carrotsearch.randomizedtesting.RandomizedRunner$8.evaluate(RandomizedRunner.java:946)
at com.carrotsearch.randomizedtesting.RandomizedRunner$9.evaluate(RandomizedRunner.java:982)
at com.carrotsearch.randomizedtesting.RandomizedRunner$10.evaluate(RandomizedRunner.java:996)
at com.carrotsearch.randomizedtesting.rules.SystemPropertiesRestoreRule$1.evaluate(SystemPropertiesRestoreRule.java:80)
at org.junit.rules.RunRules.evaluate(RunRules.java:20)
at org.apache.lucene.tests.util.TestRuleSetupTeardownChained$1.evaluate(TestRuleSetupTeardownChained.java:48)
at org.apache.lucene.tests.util.AbstractBeforeAfterRule$1.evaluate(AbstractBeforeAfterRule.java:43)
at org.apache.lucene.tests.util.TestRuleThreadAndTestName$1.evaluate(TestRuleThreadAndTestName.java:45)
at org.apache.lucene.tests.util.TestRuleIgnoreAfterMaxFailures$1.evaluate(TestRuleIgnoreAfterMaxFailures.java:60)
at org.apache.lucene.tests.util.TestRuleMarkFailure$1.evaluate(TestRuleMarkFailure.java:44)
at org.junit.rules.RunRules.evaluate(RunRules.java:20)
at com.carrotsearch.randomizedtesting.rules.StatementAdapter.evaluate(StatementAdapter.java:36)
at com.carrotsearch.randomizedtesting.ThreadLeakControl$StatementRunner.run(ThreadLeakControl.java:390)
at com.carrotsearch.randomizedtesting.ThreadLeakControl.forkTimeoutingTask(ThreadLeakControl.java:843)
at com.carrotsearch.randomizedtesting.ThreadLeakControl$3.evaluate(ThreadLeakControl.java:490)
at com.carrotsearch.randomizedtesting.RandomizedRunner.runSingleTest(RandomizedRunner.java:955)
at com.carrotsearch.randomizedtesting.RandomizedRunner$5.evaluate(RandomizedRunner.java:840)
at com.carrotsearch.randomizedtesting.RandomizedRunner$6.evaluate(RandomizedRunner.java:891)
at com.carrotsearch.randomizedtesting.RandomizedRunner$7.evaluate(RandomizedRunner.java:902)
at com.carrotsearch.randomizedtesting.rules.StatementAdapter.evaluate(StatementAdapter.java:36)
at com.carrotsearch.randomizedtesting.rules.StatementAdapter.evaluate(StatementAdapter.java:36)
at org.apache.lucene.tests.util.AbstractBeforeAfterRule$1.evaluate(AbstractBeforeAfterRule.java:43)
at org.apache.lucene.tests.util.AbstractBeforeAfterRule$1.evaluate(AbstractBeforeAfterRule.java:43)
at com.carrotsearch.randomizedtesting.rules.SystemPropertiesRestoreRule$1.evaluate(SystemPropertiesRestoreRule.java:80)
at org.junit.rules.RunRules.evaluate(RunRules.java:20)
at org.apache.lucene.tests.util.AbstractBeforeAfterRule$1.evaluate(AbstractBeforeAfterRule.java:43)
at com.carrotsearch.randomizedtesting.rules.StatementAdapter.evaluate(StatementAdapter.java:36)
at org.apache.lucene.tests.util.TestRuleStoreClassName$1.evaluate(TestRuleStoreClassName.java:38)
at com.carrotsearch.randomizedtesting.rules.NoShadowingOrOverridesOnMethodsRule$1.evaluate(NoShadowingOrOverridesOnMethodsRule.java:40)
at com.carrotsearch.randomizedtesting.rules.NoShadowingOrOverridesOnMethodsRule$1.evaluate(NoShadowingOrOverridesOnMethodsRule.java:40)
at com.carrotsearch.randomizedtesting.rules.StatementAdapter.evaluate(StatementAdapter.java:36)
at com.carrotsearch.randomizedtesting.rules.StatementAdapter.evaluate(StatementAdapter.java:36)
at org.apache.lucene.tests.util.TestRuleAssertionsRequired$1.evaluate(TestRuleAssertionsRequired.java:53)
at org.apache.lucene.tests.util.AbstractBeforeAfterRule$1.evaluate(AbstractBeforeAfterRule.java:43)
at org.apache.lucene.tests.util.TestRuleMarkFailure$1.evaluate(TestRuleMarkFailure.java:44)
at org.apache.lucene.tests.util.TestRuleIgnoreAfterMaxFailures$1.evaluate(TestRuleIgnoreAfterMaxFailures.java:60)
at org.apache.lucene.tests.util.TestRuleIgnoreTestSuites$1.evaluate(TestRuleIgnoreTestSuites.java:47)
at org.junit.rules.RunRules.evaluate(RunRules.java:20)
at com.carrotsearch.randomizedtesting.rules.StatementAdapter.evaluate(StatementAdapter.java:36)
at com.carrotsearch.randomizedtesting.ThreadLeakControl$StatementRunner.run(ThreadLeakControl.java:390)
at com.carrotsearch.randomizedtesting.ThreadLeakControl.lambda$forkTimeoutingTask$0(ThreadLeakControl.java:850)
at java.base/java.lang.Thread.run(Thread.java:829)
FAILED: org.apache.solr.search.TestCoordinatorRole.classMethod
Error Message:
com.carrotsearch.randomizedtesting.ThreadLeakError: 10 threads leaked from SUITE scope at org.apache.solr.search.TestCoordinatorRole:
1) Thread[id=857, name=TestCoordinatorRole-611-thread-1, state=WAITING, group=TGRP-TestCoordinatorRole]
at java.base@11.0.16/jdk.internal.misc.Unsafe.park(Native Method)
at java.base@11.0.16/java.util.concurrent.locks.LockSupport.park(LockSupport.java:194)
at java.base@11.0.16/java.util.concurrent.locks.AbstractQueuedSynchronizer$ConditionObject.await(AbstractQueuedSynchronizer.java:2081)
at java.base@11.0.16/java.util.concurrent.LinkedBlockingQueue.take(LinkedBlockingQueue.java:433)
at java.base@11.0.16/java.util.concurrent.ThreadPoolExecutor.getTask(ThreadPoolExecutor.java:1054)
at java.base@11.0.16/java.util.concurrent.ThreadPoolExecutor.runWorker(ThreadPoolExecutor.java:1114)
at java.base@11.0.16/java.util.concurrent.ThreadPoolExecutor$Worker.run(ThreadPoolExecutor.java:628)
at java.base@11.0.16/java.lang.Thread.run(Thread.java:829)
2) Thread[id=863, name=TestCoordinatorRole-611-thread-5, state=WAITING, group=TGRP-TestCoordinatorRole]
at java.base@11.0.16/jdk.internal.misc.Unsafe.park(Native Method)
at java.base@11.0.16/java.util.concurrent.locks.LockSupport.park(LockSupport.java:194)
at java.base@11.0.16/java.util.concurrent.locks.AbstractQueuedSynchronizer$ConditionObject.await(AbstractQueuedSynchronizer.java:2081)
at java.base@11.0.16/java.util.concurrent.LinkedBlockingQueue.take(LinkedBlockingQueue.java:433)
at java.base@11.0.16/java.util.concurrent.ThreadPoolExecutor.getTask(ThreadPoolExecutor.java:1054)
at java.base@11.0.16/java.util.concurrent.ThreadPoolExecutor.runWorker(ThreadPoolExecutor.java:1114)
at java.base@11.0.16/java.util.concurrent.ThreadPoolExecutor$Worker.run(ThreadPoolExecutor.java:628)
at java.base@11.0.16/java.lang.Thread.run(Thread.java:829)
3) Thread[id=858, name=TestCoordinatorRole-611-thread-2, state=WAITING, group=TGRP-TestCoordinatorRole]
at java.base@11.0.16/jdk.internal.misc.Unsafe.park(Native Method)
at java.base@11.0.16/java.util.concurrent.locks.LockSupport.park(LockSupport.java:194)
at java.base@11.0.16/java.util.concurrent.locks.AbstractQueuedSynchronizer$ConditionObject.await(AbstractQueuedSynchronizer.java:2081)
at java.base@11.0.16/java.util.concurrent.LinkedBlockingQueue.take(LinkedBlockingQueue.java:433)
at java.base@11.0.16/java.util.concurrent.ThreadPoolExecutor.getTask(ThreadPoolExecutor.java:1054)
at java.base@11.0.16/java.util.concurrent.ThreadPoolExecutor.runWorker(ThreadPoolExecutor.java:1114)
at java.base@11.0.16/java.util.concurrent.ThreadPoolExecutor$Worker.run(ThreadPoolExecutor.java:628)
at java.base@11.0.16/java.lang.Thread.run(Thread.java:829)
4) Thread[id=860, name=TestCoordinatorRole-611-thread-3, state=WAITING, group=TGRP-TestCoordinatorRole]
at java.base@11.0.16/jdk.internal.misc.Unsafe.park(Native Method)
at java.base@11.0.16/java.util.concurrent.locks.LockSupport.park(LockSupport.java:194)
at java.base@11.0.16/java.util.concurrent.locks.AbstractQueuedSynchronizer$ConditionObject.await(AbstractQueuedSynchronizer.java:2081)
at java.base@11.0.16/java.util.concurrent.LinkedBlockingQueue.take(LinkedBlockingQueue.java:433)
at java.base@11.0.16/java.util.concurrent.ThreadPoolExecutor.getTask(ThreadPoolExecutor.java:1054)
at java.base@11.0.16/java.util.concurrent.ThreadPoolExecutor.runWorker(ThreadPoolExecutor.java:1114)
at java.base@11.0.16/java.util.concurrent.ThreadPoolExecutor$Worker.run(ThreadPoolExecutor.java:628)
at java.base@11.0.16/java.lang.Thread.run(Thread.java:829)
5) Thread[id=871, name=TestCoordinatorRole-611-thread-10, state=WAITING, group=TGRP-TestCoordinatorRole]
at java.base@11.0.16/jdk.internal.misc.Unsafe.park(Native Method)
at java.base@11.0.16/java.util.concurrent.locks.LockSupport.park(LockSupport.java:194)
at java.base@11.0.16/java.util.concurrent.locks.AbstractQueuedSynchronizer$ConditionObject.await(AbstractQueuedSynchronizer.java:2081)
at java.base@11.0.16/java.util.concurrent.LinkedBlockingQueue.take(LinkedBlockingQueue.java:433)
at java.base@11.0.16/java.util.concurrent.ThreadPoolExecutor.getTask(ThreadPoolExecutor.java:1054)
at java.base@11.0.16/java.util.concurrent.ThreadPoolExecutor.runWorker(ThreadPoolExecutor.java:1114)
at java.base@11.0.16/java.util.concurrent.ThreadPoolExecutor$Worker.run(ThreadPoolExecutor.java:628)
at java.base@11.0.16/java.lang.Thread.run(Thread.java:829)
6) Thread[id=868, name=TestCoordinatorRole-611-thread-8, state=WAITING, group=TGRP-TestCoordinatorRole]
at java.base@11.0.16/jdk.internal.misc.Unsafe.park(Native Method)
at java.base@11.0.16/java.util.concurrent.locks.LockSupport.park(LockSupport.java:194)
at java.base@11.0.16/java.util.concurrent.locks.AbstractQueuedSynchronizer$ConditionObject.await(AbstractQueuedSynchronizer.java:2081)
at java.base@11.0.16/java.util.concurrent.LinkedBlockingQueue.take(LinkedBlockingQueue.java:433)
at java.base@11.0.16/java.util.concurrent.ThreadPoolExecutor.getTask(ThreadPoolExecutor.java:1054)
at java.base@11.0.16/java.util.concurrent.ThreadPoolExecutor.runWorker(ThreadPoolExecutor.java:1114)
at java.base@11.0.16/java.util.concurrent.ThreadPoolExecutor$Worker.run(ThreadPoolExecutor.java:628)
at java.base@11.0.16/java.lang.Thread.run(Thread.java:829)
7) Thread[id=862, name=TestCoordinatorRole-611-thread-4, state=WAITING, group=TGRP-TestCoordinatorRole]
at java.base@11.0.16/jdk.internal.misc.Unsafe.park(Native Method)
at java.base@11.0.16/java.util.concurrent.locks.LockSupport.park(LockSupport.java:194)
at java.base@11.0.16/java.util.concurrent.locks.AbstractQueuedSynchronizer$ConditionObject.await(AbstractQueuedSynchronizer.java:2081)
at java.base@11.0.16/java.util.concurrent.LinkedBlockingQueue.take(LinkedBlockingQueue.java:433)
at java.base@11.0.16/java.util.concurrent.ThreadPoolExecutor.getTask(ThreadPoolExecutor.java:1054)
at java.base@11.0.16/java.util.concurrent.ThreadPoolExecutor.runWorker(ThreadPoolExecutor.java:1114)
at java.base@11.0.16/java.util.concurrent.ThreadPoolExecutor$Worker.run(ThreadPoolExecutor.java:628)
at java.base@11.0.16/java.lang.Thread.run(Thread.java:829)
8) Thread[id=866, name=TestCoordinatorRole-611-thread-6, state=WAITING, group=TGRP-TestCoordinatorRole]
at java.base@11.0.16/jdk.internal.misc.Unsafe.park(Native Method)
at java.base@11.0.16/java.util.concurrent.locks.LockSupport.park(LockSupport.java:194)
at java.base@11.0.16/java.util.concurrent.locks.AbstractQueuedSynchronizer$ConditionObject.await(AbstractQueuedSynchronizer.java:2081)
at java.base@11.0.16/java.util.concurrent.LinkedBlockingQueue.take(LinkedBlockingQueue.java:433)
at java.base@11.0.16/java.util.concurrent.ThreadPoolExecutor.getTask(ThreadPoolExecutor.java:1054)
at java.base@11.0.16/java.util.concurrent.ThreadPoolExecutor.runWorker(ThreadPoolExecutor.java:1114)
at java.base@11.0.16/java.util.concurrent.ThreadPoolExecutor$Worker.run(ThreadPoolExecutor.java:628)
at java.base@11.0.16/java.lang.Thread.run(Thread.java:829)
9) Thread[id=869, name=TestCoordinatorRole-611-thread-9, state=WAITING, group=TGRP-TestCoordinatorRole]
at java.base@11.0.16/jdk.internal.misc.Unsafe.park(Native Method)
at java.base@11.0.16/java.util.concurrent.locks.LockSupport.park(LockSupport.java:194)
at java.base@11.0.16/java.util.concurrent.locks.AbstractQueuedSynchronizer$ConditionObject.await(AbstractQueuedSynchronizer.java:2081)
at java.base@11.0.16/java.util.concurrent.LinkedBlockingQueue.take(LinkedBlockingQueue.java:433)
at java.base@11.0.16/java.util.concurrent.ThreadPoolExecutor.getTask(ThreadPoolExecutor.java:1054)
at java.base@11.0.16/java.util.concurrent.ThreadPoolExecutor.runWorker(ThreadPoolExecutor.java:1114)
at java.base@11.0.16/java.util.concurrent.ThreadPoolExecutor$Worker.run(ThreadPoolExecutor.java:628)
at java.base@11.0.16/java.lang.Thread.run(Thread.java:829)
10) Thread[id=867, name=TestCoordinatorRole-611-thread-7, state=WAITING, group=TGRP-TestCoordinatorRole]
at java.base@11.0.16/jdk.internal.misc.Unsafe.park(Native Method)
at java.base@11.0.16/java.util.concurrent.locks.LockSupport.park(LockSupport.java:194)
at java.base@11.0.16/java.util.concurrent.locks.AbstractQueuedSynchronizer$ConditionObject.await(AbstractQueuedSynchronizer.java:2081)
at java.base@11.0.16/java.util.concurrent.LinkedBlockingQueue.take(LinkedBlockingQueue.java:433)
at java.base@11.0.16/java.util.concurrent.ThreadPoolExecutor.getTask(ThreadPoolExecutor.java:1054)
at java.base@11.0.16/java.util.concurrent.ThreadPoolExecutor.runWorker(ThreadPoolExecutor.java:1114)
at java.base@11.0.16/java.util.concurrent.ThreadPoolExecutor$Worker.run(ThreadPoolExecutor.java:628)
at java.base@11.0.16/java.lang.Thread.run(Thread.java:829)
Stack Trace:
com.carrotsearch.randomizedtesting.ThreadLeakError: 10 threads leaked from SUITE scope at org.apache.solr.search.TestCoordinatorRole:
1) Thread[id=857, name=TestCoordinatorRole-611-thread-1, state=WAITING, group=TGRP-TestCoordinatorRole]
at java.base@11.0.16/jdk.internal.misc.Unsafe.park(Native Method)
at java.base@11.0.16/java.util.concurrent.locks.LockSupport.park(LockSupport.java:194)
at java.base@11.0.16/java.util.concurrent.locks.AbstractQueuedSynchronizer$ConditionObject.await(AbstractQueuedSynchronizer.java:2081)
at java.base@11.0.16/java.util.concurrent.LinkedBlockingQueue.take(LinkedBlockingQueue.java:433)
at java.base@11.0.16/java.util.concurrent.ThreadPoolExecutor.getTask(ThreadPoolExecutor.java:1054)
at java.base@11.0.16/java.util.concurrent.ThreadPoolExecutor.runWorker(ThreadPoolExecutor.java:1114)
at java.base@11.0.16/java.util.concurrent.ThreadPoolExecutor$Worker.run(ThreadPoolExecutor.java:628)
at java.base@11.0.16/java.lang.Thread.run(Thread.java:829)
2) Thread[id=863, name=TestCoordinatorRole-611-thread-5, state=WAITING, group=TGRP-TestCoordinatorRole]
at java.base@11.0.16/jdk.internal.misc.Unsafe.park(Native Method)
at java.base@11.0.16/java.util.concurrent.locks.LockSupport.park(LockSupport.java:194)
at java.base@11.0.16/java.util.concurrent.locks.AbstractQueuedSynchronizer$ConditionObject.await(AbstractQueuedSynchronizer.java:2081)
at java.base@11.0.16/java.util.concurrent.LinkedBlockingQueue.take(LinkedBlockingQueue.java:433)
at java.base@11.0.16/java.util.concurrent.ThreadPoolExecutor.getTask(ThreadPoolExecutor.java:1054)
at java.base@11.0.16/java.util.concurrent.ThreadPoolExecutor.runWorker(ThreadPoolExecutor.java:1114)
at java.base@11.0.16/java.util.concurrent.ThreadPoolExecutor$Worker.run(ThreadPoolExecutor.java:628)
at java.base@11.0.16/java.lang.Thread.run(Thread.java:829)
3) Thread[id=858, name=TestCoordinatorRole-611-thread-2, state=WAITING, group=TGRP-TestCoordinatorRole]
at java.base@11.0.16/jdk.internal.misc.Unsafe.park(Native Method)
at java.base@11.0.16/java.util.concurrent.locks.LockSupport.park(LockSupport.java:194)
at java.base@11.0.16/java.util.concurrent.locks.AbstractQueuedSynchronizer$ConditionObject.await(AbstractQueuedSynchronizer.java:2081)
at java.base@11.0.16/java.util.concurrent.LinkedBlockingQueue.take(LinkedBlockingQueue.java:433)
at java.base@11.0.16/java.util.concurrent.ThreadPoolExecutor.getTask(ThreadPoolExecutor.java:1054)
at java.base@11.0.16/java.util.concurrent.ThreadPoolExecutor.runWorker(ThreadPoolExecutor.java:1114)
at java.base@11.0.16/java.util.concurrent.ThreadPoolExecutor$Worker.run(ThreadPoolExecutor.java:628)
at java.base@11.0.16/java.lang.Thread.run(Thread.java:829)
4) Thread[id=860, name=TestCoordinatorRole-611-thread-3, state=WAITING, group=TGRP-TestCoordinatorRole]
at java.base@11.0.16/jdk.internal.misc.Unsafe.park(Native Method)
at java.base@11.0.16/java.util.concurrent.locks.LockSupport.park(LockSupport.java:194)
at java.base@11.0.16/java.util.concurrent.locks.AbstractQueuedSynchronizer$ConditionObject.await(AbstractQueuedSynchronizer.java:2081)
at java.base@11.0.16/java.util.concurrent.LinkedBlockingQueue.take(LinkedBlockingQueue.java:433)
at java.base@11.0.16/java.util.concurrent.ThreadPoolExecutor.getTask(ThreadPoolExecutor.java:1054)
at java.base@11.0.16/java.util.concurrent.ThreadPoolExecutor.runWorker(ThreadPoolExecutor.java:1114)
at java.base@11.0.16/java.util.concurrent.ThreadPoolExecutor$Worker.run(ThreadPoolExecutor.java:628)
at java.base@11.0.16/java.lang.Thread.run(Thread.java:829)
5) Thread[id=871, name=TestCoordinatorRole-611-thread-10, state=WAITING, group=TGRP-TestCoordinatorRole]
at java.base@11.0.16/jdk.internal.misc.Unsafe.park(Native Method)
at java.base@11.0.16/java.util.concurrent.locks.LockSupport.park(LockSupport.java:194)
at java.base@11.0.16/java.util.concurrent.locks.AbstractQueuedSynchronizer$ConditionObject.await(AbstractQueuedSynchronizer.java:2081)
at java.base@11.0.16/java.util.concurrent.LinkedBlockingQueue.take(LinkedBlockingQueue.java:433)
at java.base@11.0.16/java.util.concurrent.ThreadPoolExecutor.getTask(ThreadPoolExecutor.java:1054)
at java.base@11.0.16/java.util.concurrent.ThreadPoolExecutor.runWorker(ThreadPoolExecutor.java:1114)
at java.base@11.0.16/java.util.concurrent.ThreadPoolExecutor$Worker.run(ThreadPoolExecutor.java:628)
at java.base@11.0.16/java.lang.Thread.run(Thread.java:829)
6) Thread[id=868, name=TestCoordinatorRole-611-thread-8, state=WAITING, group=TGRP-TestCoordinatorRole]
at java.base@11.0.16/jdk.internal.misc.Unsafe.park(Native Method)
at java.base@11.0.16/java.util.concurrent.locks.LockSupport.park(LockSupport.java:194)
at java.base@11.0.16/java.util.concurrent.locks.AbstractQueuedSynchronizer$ConditionObject.await(AbstractQueuedSynchronizer.java:2081)
at java.base@11.0.16/java.util.concurrent.LinkedBlockingQueue.take(LinkedBlockingQueue.java:433)
at java.base@11.0.16/java.util.concurrent.ThreadPoolExecutor.getTask(ThreadPoolExecutor.java:1054)
at java.base@11.0.16/java.util.concurrent.ThreadPoolExecutor.runWorker(ThreadPoolExecutor.java:1114)
at java.base@11.0.16/java.util.concurrent.ThreadPoolExecutor$Worker.run(ThreadPoolExecutor.java:628)
at java.base@11.0.16/java.lang.Thread.run(Thread.java:829)
7) Thread[id=862, name=TestCoordinatorRole-611-thread-4, state=WAITING, group=TGRP-TestCoordinatorRole]
at java.base@11.0.16/jdk.internal.misc.Unsafe.park(Native Method)
at java.base@11.0.16/java.util.concurrent.locks.LockSupport.park(LockSupport.java:194)
at java.base@11.0.16/java.util.concurrent.locks.AbstractQueuedSynchronizer$ConditionObject.await(AbstractQueuedSynchronizer.java:2081)
at java.base@11.0.16/java.util.concurrent.LinkedBlockingQueue.take(LinkedBlockingQueue.java:433)
at java.base@11.0.16/java.util.concurrent.ThreadPoolExecutor.getTask(ThreadPoolExecutor.java:1054)
at java.base@11.0.16/java.util.concurrent.ThreadPoolExecutor.runWorker(ThreadPoolExecutor.java:1114)
at java.base@11.0.16/java.util.concurrent.ThreadPoolExecutor$Worker.run(ThreadPoolExecutor.java:628)
at java.base@11.0.16/java.lang.Thread.run(Thread.java:829)
8) Thread[id=866, name=TestCoordinatorRole-611-thread-6, state=WAITING, group=TGRP-TestCoordinatorRole]
at java.base@11.0.16/jdk.internal.misc.Unsafe.park(Native Method)
at java.base@11.0.16/java.util.concurrent.locks.LockSupport.park(LockSupport.java:194)
at java.base@11.0.16/java.util.concurrent.locks.AbstractQueuedSynchronizer$ConditionObject.await(AbstractQueuedSynchronizer.java:2081)
at java.base@11.0.16/java.util.concurrent.LinkedBlockingQueue.take(LinkedBlockingQueue.java:433)
at java.base@11.0.16/java.util.concurrent.ThreadPoolExecutor.getTask(ThreadPoolExecutor.java:1054)
at java.base@11.0.16/java.util.concurrent.ThreadPoolExecutor.runWorker(ThreadPoolExecutor.java:1114)
at java.base@11.0.16/java.util.concurrent.ThreadPoolExecutor$Worker.run(ThreadPoolExecutor.java:628)
at java.base@11.0.16/java.lang.Thread.run(Thread.java:829)
9) Thread[id=869, name=TestCoordinatorRole-611-thread-9, state=WAITING, group=TGRP-TestCoordinatorRole]
at java.base@11.0.16/jdk.internal.misc.Unsafe.park(Native Method)
at java.base@11.0.16/java.util.concurrent.locks.LockSupport.park(LockSupport.java:194)
at java.base@11.0.16/java.util.concurrent.locks.AbstractQueuedSynchronizer$ConditionObject.await(AbstractQueuedSynchronizer.java:2081)
at java.base@11.0.16/java.util.concurrent.LinkedBlockingQueue.take(LinkedBlockingQueue.java:433)
at java.base@11.0.16/java.util.concurrent.ThreadPoolExecutor.getTask(ThreadPoolExecutor.java:1054)
at java.base@11.0.16/java.util.concurrent.ThreadPoolExecutor.runWorker(ThreadPoolExecutor.java:1114)
at java.base@11.0.16/java.util.concurrent.ThreadPoolExecutor$Worker.run(ThreadPoolExecutor.java:628)
at java.base@11.0.16/java.lang.Thread.run(Thread.java:829)
10) Thread[id=867, name=TestCoordinatorRole-611-thread-7, state=WAITING, group=TGRP-TestCoordinatorRole]
at java.base@11.0.16/jdk.internal.misc.Unsafe.park(Native Method)
at java.base@11.0.16/java.util.concurrent.locks.LockSupport.park(LockSupport.java:194)
at java.base@11.0.16/java.util.concurrent.locks.AbstractQueuedSynchronizer$ConditionObject.await(AbstractQueuedSynchronizer.java:2081)
at java.base@11.0.16/java.util.concurrent.LinkedBlockingQueue.take(LinkedBlockingQueue.java:433)
at java.base@11.0.16/java.util.concurrent.ThreadPoolExecutor.getTask(ThreadPoolExecutor.java:1054)
at java.base@11.0.16/java.util.concurrent.ThreadPoolExecutor.runWorker(ThreadPoolExecutor.java:1114)
at java.base@11.0.16/java.util.concurrent.ThreadPoolExecutor$Worker.run(ThreadPoolExecutor.java:628)
at java.base@11.0.16/java.lang.Thread.run(Thread.java:829)
at __randomizedtesting.SeedInfo.seed([B64678882F9587A3]:0)
FAILED: org.apache.solr.search.TestCoordinatorRole.classMethod
Error Message:
com.carrotsearch.randomizedtesting.ThreadLeakError: There are still zombie threads that couldn't be terminated:
1) Thread[id=857, name=TestCoordinatorRole-611-thread-1, state=WAITING, group=TGRP-TestCoordinatorRole]
at java.base@11.0.16/jdk.internal.misc.Unsafe.park(Native Method)
at java.base@11.0.16/java.util.concurrent.locks.LockSupport.park(LockSupport.java:194)
at java.base@11.0.16/java.util.concurrent.locks.AbstractQueuedSynchronizer$ConditionObject.await(AbstractQueuedSynchronizer.java:2081)
at java.base@11.0.16/java.util.concurrent.LinkedBlockingQueue.take(LinkedBlockingQueue.java:433)
at java.base@11.0.16/java.util.concurrent.ThreadPoolExecutor.getTask(ThreadPoolExecutor.java:1054)
at java.base@11.0.16/java.util.concurrent.ThreadPoolExecutor.runWorker(ThreadPoolExecutor.java:1114)
at java.base@11.0.16/java.util.concurrent.ThreadPoolExecutor$Worker.run(ThreadPoolExecutor.java:628)
at java.base@11.0.16/java.lang.Thread.run(Thread.java:829)
2) Thread[id=863, name=TestCoordinatorRole-611-thread-5, state=WAITING, group=TGRP-TestCoordinatorRole]
at java.base@11.0.16/jdk.internal.misc.Unsafe.park(Native Method)
at java.base@11.0.16/java.util.concurrent.locks.LockSupport.park(LockSupport.java:194)
at java.base@11.0.16/java.util.concurrent.locks.AbstractQueuedSynchronizer$ConditionObject.await(AbstractQueuedSynchronizer.java:2081)
at java.base@11.0.16/java.util.concurrent.LinkedBlockingQueue.take(LinkedBlockingQueue.java:433)
at java.base@11.0.16/java.util.concurrent.ThreadPoolExecutor.getTask(ThreadPoolExecutor.java:1054)
at java.base@11.0.16/java.util.concurrent.ThreadPoolExecutor.runWorker(ThreadPoolExecutor.java:1114)
at java.base@11.0.16/java.util.concurrent.ThreadPoolExecutor$Worker.run(ThreadPoolExecutor.java:628)
at java.base@11.0.16/java.lang.Thread.run(Thread.java:829)
3) Thread[id=858, name=TestCoordinatorRole-611-thread-2, state=WAITING, group=TGRP-TestCoordinatorRole]
at java.base@11.0.16/jdk.internal.misc.Unsafe.park(Native Method)
at java.base@11.0.16/java.util.concurrent.locks.LockSupport.park(LockSupport.java:194)
at java.base@11.0.16/java.util.concurrent.locks.AbstractQueuedSynchronizer$ConditionObject.await(AbstractQueuedSynchronizer.java:2081)
at java.base@11.0.16/java.util.concurrent.LinkedBlockingQueue.take(LinkedBlockingQueue.java:433)
at java.base@11.0.16/java.util.concurrent.ThreadPoolExecutor.getTask(ThreadPoolExecutor.java:1054)
at java.base@11.0.16/java.util.concurrent.ThreadPoolExecutor.runWorker(ThreadPoolExecutor.java:1114)
at java.base@11.0.16/java.util.concurrent.ThreadPoolExecutor$Worker.run(ThreadPoolExecutor.java:628)
at java.base@11.0.16/java.lang.Thread.run(Thread.java:829)
4) Thread[id=868, name=TestCoordinatorRole-611-thread-8, state=WAITING, group=TGRP-TestCoordinatorRole]
at java.base@11.0.16/jdk.internal.misc.Unsafe.park(Native Method)
at java.base@11.0.16/java.util.concurrent.locks.LockSupport.park(LockSupport.java:194)
at java.base@11.0.16/java.util.concurrent.locks.AbstractQueuedSynchronizer$ConditionObject.await(AbstractQueuedSynchronizer.java:2081)
at java.base@11.0.16/java.util.concurrent.LinkedBlockingQueue.take(LinkedBlockingQueue.java:433)
at java.base@11.0.16/java.util.concurrent.ThreadPoolExecutor.getTask(ThreadPoolExecutor.java:1054)
at java.base@11.0.16/java.util.concurrent.ThreadPoolExecutor.runWorker(ThreadPoolExecutor.java:1114)
at java.base@11.0.16/java.util.concurrent.ThreadPoolExecutor$Worker.run(ThreadPoolExecutor.java:628)
at java.base@11.0.16/java.lang.Thread.run(Thread.java:829)
5) Thread[id=862, name=TestCoordinatorRole-611-thread-4, state=WAITING, group=TGRP-TestCoordinatorRole]
at java.base@11.0.16/jdk.internal.misc.Unsafe.park(Native Method)
at java.base@11.0.16/java.util.concurrent.locks.LockSupport.park(LockSupport.java:194)
at java.base@11.0.16/java.util.concurrent.locks.AbstractQueuedSynchronizer$ConditionObject.await(AbstractQueuedSynchronizer.java:2081)
at java.base@11.0.16/java.util.concurrent.LinkedBlockingQueue.take(LinkedBlockingQueue.java:433)
at java.base@11.0.16/java.util.concurrent.ThreadPoolExecutor.getTask(ThreadPoolExecutor.java:1054)
at java.base@11.0.16/java.util.concurrent.ThreadPoolExecutor.runWorker(ThreadPoolExecutor.java:1114)
at java.base@11.0.16/java.util.concurrent.ThreadPoolExecutor$Worker.run(ThreadPoolExecutor.java:628)
at java.base@11.0.16/java.lang.Thread.run(Thread.java:829)
6) Thread[id=866, name=TestCoordinatorRole-611-thread-6, state=WAITING, group=TGRP-TestCoordinatorRole]
at java.base@11.0.16/jdk.internal.misc.Unsafe.park(Native Method)
at java.base@11.0.16/java.util.concurrent.locks.LockSupport.park(LockSupport.java:194)
at java.base@11.0.16/java.util.concurrent.locks.AbstractQueuedSynchronizer$ConditionObject.await(AbstractQueuedSynchronizer.java:2081)
at java.base@11.0.16/java.util.concurrent.LinkedBlockingQueue.take(LinkedBlockingQueue.java:433)
at java.base@11.0.16/java.util.concurrent.ThreadPoolExecutor.getTask(ThreadPoolExecutor.java:1054)
at java.base@11.0.16/java.util.concurrent.ThreadPoolExecutor.runWorker(ThreadPoolExecutor.java:1114)
at java.base@11.0.16/java.util.concurrent.ThreadPoolExecutor$Worker.run(ThreadPoolExecutor.java:628)
at java.base@11.0.16/java.lang.Thread.run(Thread.java:829)
7) Thread[id=869, name=TestCoordinatorRole-611-thread-9, state=WAITING, group=TGRP-TestCoordinatorRole]
at java.base@11.0.16/jdk.internal.misc.Unsafe.park(Native Method)
at java.base@11.0.16/java.util.concurrent.locks.LockSupport.park(LockSupport.java:194)
at java.base@11.0.16/java.util.concurrent.locks.AbstractQueuedSynchronizer$ConditionObject.await(AbstractQueuedSynchronizer.java:2081)
at java.base@11.0.16/java.util.concurrent.LinkedBlockingQueue.take(LinkedBlockingQueue.java:433)
at java.base@11.0.16/java.util.concurrent.ThreadPoolExecutor.getTask(ThreadPoolExecutor.java:1054)
at java.base@11.0.16/java.util.concurrent.ThreadPoolExecutor.runWorker(ThreadPoolExecutor.java:1114)
at java.base@11.0.16/java.util.concurrent.ThreadPoolExecutor$Worker.run(ThreadPoolExecutor.java:628)
at java.base@11.0.16/java.lang.Thread.run(Thread.java:829)
8) Thread[id=860, name=TestCoordinatorRole-611-thread-3, state=WAITING, group=TGRP-TestCoordinatorRole]
at java.base@11.0.16/jdk.internal.misc.Unsafe.park(Native Method)
at java.base@11.0.16/java.util.concurrent.locks.LockSupport.park(LockSupport.java:194)
at java.base@11.0.16/java.util.concurrent.locks.AbstractQueuedSynchronizer$ConditionObject.await(AbstractQueuedSynchronizer.java:2081)
at java.base@11.0.16/java.util.concurrent.LinkedBlockingQueue.take(LinkedBlockingQueue.java:433)
at java.base@11.0.16/java.util.concurrent.ThreadPoolExecutor.getTask(ThreadPoolExecutor.java:1054)
at java.base@11.0.16/java.util.concurrent.ThreadPoolExecutor.runWorker(ThreadPoolExecutor.java:1114)
at java.base@11.0.16/java.util.concurrent.ThreadPoolExecutor$Worker.run(ThreadPoolExecutor.java:628)
at java.base@11.0.16/java.lang.Thread.run(Thread.java:829)
9) Thread[id=871, name=TestCoordinatorRole-611-thread-10, state=WAITING, group=TGRP-TestCoordinatorRole]
at java.base@11.0.16/jdk.internal.misc.Unsafe.park(Native Method)
at java.base@11.0.16/java.util.concurrent.locks.LockSupport.park(LockSupport.java:194)
at java.base@11.0.16/java.util.concurrent.locks.AbstractQueuedSynchronizer$ConditionObject.await(AbstractQueuedSynchronizer.java:2081)
at java.base@11.0.16/java.util.concurrent.LinkedBlockingQueue.take(LinkedBlockingQueue.java:433)
at java.base@11.0.16/java.util.concurrent.ThreadPoolExecutor.getTask(ThreadPoolExecutor.java:1054)
at java.base@11.0.16/java.util.concurrent.ThreadPoolExecutor.runWorker(ThreadPoolExecutor.java:1114)
at java.base@11.0.16/java.util.concurrent.ThreadPoolExecutor$Worker.run(ThreadPoolExecutor.java:628)
at java.base@11.0.16/java.lang.Thread.run(Thread.java:829)
10) Thread[id=867, name=TestCoordinatorRole-611-thread-7, state=WAITING, group=TGRP-TestCoordinatorRole]
at java.base@11.0.16/jdk.internal.misc.Unsafe.park(Native Method)
at java.base@11.0.16/java.util.concurrent.locks.LockSupport.park(LockSupport.java:194)
at java.base@11.0.16/java.util.concurrent.locks.AbstractQueuedSynchronizer$ConditionObject.await(AbstractQueuedSynchronizer.java:2081)
at java.base@11.0.16/java.util.concurrent.LinkedBlockingQueue.take(LinkedBlockingQueue.java:433)
at java.base@11.0.16/java.util.concurrent.ThreadPoolExecutor.getTask(ThreadPoolExecutor.java:1054)
at java.base@11.0.16/java.util.concurrent.ThreadPoolExecutor.runWorker(ThreadPoolExecutor.java:1114)
at java.base@11.0.16/java.util.concurrent.ThreadPoolExecutor$Worker.run(ThreadPoolExecutor.java:628)
at java.base@11.0.16/java.lang.Thread.run(Thread.java:829)
Stack Trace:
com.carrotsearch.randomizedtesting.ThreadLeakError: There are still zombie threads that couldn't be terminated:
1) Thread[id=857, name=TestCoordinatorRole-611-thread-1, state=WAITING, group=TGRP-TestCoordinatorRole]
at java.base@11.0.16/jdk.internal.misc.Unsafe.park(Native Method)
at java.base@11.0.16/java.util.concurrent.locks.LockSupport.park(LockSupport.java:194)
at java.base@11.0.16/java.util.concurrent.locks.AbstractQueuedSynchronizer$ConditionObject.await(AbstractQueuedSynchronizer.java:2081)
at java.base@11.0.16/java.util.concurrent.LinkedBlockingQueue.take(LinkedBlockingQueue.java:433)
at java.base@11.0.16/java.util.concurrent.ThreadPoolExecutor.getTask(ThreadPoolExecutor.java:1054)
at java.base@11.0.16/java.util.concurrent.ThreadPoolExecutor.runWorker(ThreadPoolExecutor.java:1114)
at java.base@11.0.16/java.util.concurrent.ThreadPoolExecutor$Worker.run(ThreadPoolExecutor.java:628)
at java.base@11.0.16/java.lang.Thread.run(Thread.java:829)
2) Thread[id=863, name=TestCoordinatorRole-611-thread-5, state=WAITING, group=TGRP-TestCoordinatorRole]
at java.base@11.0.16/jdk.internal.misc.Unsafe.park(Native Method)
at java.base@11.0.16/java.util.concurrent.locks.LockSupport.park(LockSupport.java:194)
at java.base@11.0.16/java.util.concurrent.locks.AbstractQueuedSynchronizer$ConditionObject.await(AbstractQueuedSynchronizer.java:2081)
at java.base@11.0.16/java.util.concurrent.LinkedBlockingQueue.take(LinkedBlockingQueue.java:433)
at java.base@11.0.16/java.util.concurrent.ThreadPoolExecutor.getTask(ThreadPoolExecutor.java:1054)
at java.base@11.0.16/java.util.concurrent.ThreadPoolExecutor.runWorker(ThreadPoolExecutor.java:1114)
at java.base@11.0.16/java.util.concurrent.ThreadPoolExecutor$Worker.run(ThreadPoolExecutor.java:628)
at java.base@11.0.16/java.lang.Thread.run(Thread.java:829)
3) Thread[id=858, name=TestCoordinatorRole-611-thread-2, state=WAITING, group=TGRP-TestCoordinatorRole]
at java.base@11.0.16/jdk.internal.misc.Unsafe.park(Native Method)
at java.base@11.0.16/java.util.concurrent.locks.LockSupport.park(LockSupport.java:194)
at java.base@11.0.16/java.util.concurrent.locks.AbstractQueuedSynchronizer$ConditionObject.await(AbstractQueuedSynchronizer.java:2081)
at java.base@11.0.16/java.util.concurrent.LinkedBlockingQueue.take(LinkedBlockingQueue.java:433)
at java.base@11.0.16/java.util.concurrent.ThreadPoolExecutor.getTask(ThreadPoolExecutor.java:1054)
at java.base@11.0.16/java.util.concurrent.ThreadPoolExecutor.runWorker(ThreadPoolExecutor.java:1114)
at java.base@11.0.16/java.util.concurrent.ThreadPoolExecutor$Worker.run(ThreadPoolExecutor.java:628)
at java.base@11.0.16/java.lang.Thread.run(Thread.java:829)
4) Thread[id=868, name=TestCoordinatorRole-611-thread-8, state=WAITING, group=TGRP-TestCoordinatorRole]
at java.base@11.0.16/jdk.internal.misc.Unsafe.park(Native Method)
at java.base@11.0.16/java.util.concurrent.locks.LockSupport.park(LockSupport.java:194)
at java.base@11.0.16/java.util.concurrent.locks.AbstractQueuedSynchronizer$ConditionObject.await(AbstractQueuedSynchronizer.java:2081)
at java.base@11.0.16/java.util.concurrent.LinkedBlockingQueue.take(LinkedBlockingQueue.java:433)
at java.base@11.0.16/java.util.concurrent.ThreadPoolExecutor.getTask(ThreadPoolExecutor.java:1054)
at java.base@11.0.16/java.util.concurrent.ThreadPoolExecutor.runWorker(ThreadPoolExecutor.java:1114)
at java.base@11.0.16/java.util.concurrent.ThreadPoolExecutor$Worker.run(ThreadPoolExecutor.java:628)
at java.base@11.0.16/java.lang.Thread.run(Thread.java:829)
5) Thread[id=862, name=TestCoordinatorRole-611-thread-4, state=WAITING, group=TGRP-TestCoordinatorRole]
at java.base@11.0.16/jdk.internal.misc.Unsafe.park(Native Method)
at java.base@11.0.16/java.util.concurrent.locks.LockSupport.park(LockSupport.java:194)
at java.base@11.0.16/java.util.concurrent.locks.AbstractQueuedSynchronizer$ConditionObject.await(AbstractQueuedSynchronizer.java:2081)
at java.base@11.0.16/java.util.concurrent.LinkedBlockingQueue.take(LinkedBlockingQueue.java:433)
at java.base@11.0.16/java.util.concurrent.ThreadPoolExecutor.getTask(ThreadPoolExecutor.java:1054)
at java.base@11.0.16/java.util.concurrent.ThreadPoolExecutor.runWorker(ThreadPoolExecutor.java:1114)
at java.base@11.0.16/java.util.concurrent.ThreadPoolExecutor$Worker.run(ThreadPoolExecutor.java:628)
at java.base@11.0.16/java.lang.Thread.run(Thread.java:829)
6) Thread[id=866, name=TestCoordinatorRole-611-thread-6, state=WAITING, group=TGRP-TestCoordinatorRole]
at java.base@11.0.16/jdk.internal.misc.Unsafe.park(Native Method)
at java.base@11.0.16/java.util.concurrent.locks.LockSupport.park(LockSupport.java:194)
at java.base@11.0.16/java.util.concurrent.locks.AbstractQueuedSynchronizer$ConditionObject.await(AbstractQueuedSynchronizer.java:2081)
at java.base@11.0.16/java.util.concurrent.LinkedBlockingQueue.take(LinkedBlockingQueue.java:433)
at java.base@11.0.16/java.util.concurrent.ThreadPoolExecutor.getTask(ThreadPoolExecutor.java:1054)
at java.base@11.0.16/java.util.concurrent.ThreadPoolExecutor.runWorker(ThreadPoolExecutor.java:1114)
at java.base@11.0.16/java.util.concurrent.ThreadPoolExecutor$Worker.run(ThreadPoolExecutor.java:628)
at java.base@11.0.16/java.lang.Thread.run(Thread.java:829)
7) Thread[id=869, name=TestCoordinatorRole-611-thread-9, state=WAITING, group=TGRP-TestCoordinatorRole]
at java.base@11.0.16/jdk.internal.misc.Unsafe.park(Native Method)
at java.base@11.0.16/java.util.concurrent.locks.LockSupport.park(LockSupport.java:194)
at java.base@11.0.16/java.util.concurrent.locks.AbstractQueuedSynchronizer$ConditionObject.await(AbstractQueuedSynchronizer.java:2081)
at java.base@11.0.16/java.util.concurrent.LinkedBlockingQueue.take(LinkedBlockingQueue.java:433)
at java.base@11.0.16/java.util.concurrent.ThreadPoolExecutor.getTask(ThreadPoolExecutor.java:1054)
at java.base@11.0.16/java.util.concurrent.ThreadPoolExecutor.runWorker(ThreadPoolExecutor.java:1114)
at java.base@11.0.16/java.util.concurrent.ThreadPoolExecutor$Worker.run(ThreadPoolExecutor.java:628)
at java.base@11.0.16/java.lang.Thread.run(Thread.java:829)
8) Thread[id=860, name=TestCoordinatorRole-611-thread-3, state=WAITING, group=TGRP-TestCoordinatorRole]
at java.base@11.0.16/jdk.internal.misc.Unsafe.park(Native Method)
at java.base@11.0.16/java.util.concurrent.locks.LockSupport.park(LockSupport.java:194)
at java.base@11.0.16/java.util.concurrent.locks.AbstractQueuedSynchronizer$ConditionObject.await(AbstractQueuedSynchronizer.java:2081)
at java.base@11.0.16/java.util.concurrent.LinkedBlockingQueue.take(LinkedBlockingQueue.java:433)
at java.base@11.0.16/java.util.concurrent.ThreadPoolExecutor.getTask(ThreadPoolExecutor.java:1054)
at java.base@11.0.16/java.util.concurrent.ThreadPoolExecutor.runWorker(ThreadPoolExecutor.java:1114)
at java.base@11.0.16/java.util.concurrent.ThreadPoolExecutor$Worker.run(ThreadPoolExecutor.java:628)
at java.base@11.0.16/java.lang.Thread.run(Thread.java:829)
9) Thread[id=871, name=TestCoordinatorRole-611-thread-10, state=WAITING, group=TGRP-TestCoordinatorRole]
at java.base@11.0.16/jdk.internal.misc.Unsafe.park(Native Method)
at java.base@11.0.16/java.util.concurrent.locks.LockSupport.park(LockSupport.java:194)
at java.base@11.0.16/java.util.concurrent.locks.AbstractQueuedSynchronizer$ConditionObject.await(AbstractQueuedSynchronizer.java:2081)
at java.base@11.0.16/java.util.concurrent.LinkedBlockingQueue.take(LinkedBlockingQueue.java:433)
at java.base@11.0.16/java.util.concurrent.ThreadPoolExecutor.getTask(ThreadPoolExecutor.java:1054)
at java.base@11.0.16/java.util.concurrent.ThreadPoolExecutor.runWorker(ThreadPoolExecutor.java:1114)
at java.base@11.0.16/java.util.concurrent.ThreadPoolExecutor$Worker.run(ThreadPoolExecutor.java:628)
at java.base@11.0.16/java.lang.Thread.run(Thread.java:829)
10) Thread[id=867, name=TestCoordinatorRole-611-thread-7, state=WAITING, group=TGRP-TestCoordinatorRole]
at java.base@11.0.16/jdk.internal.misc.Unsafe.park(Native Method)
at java.base@11.0.16/java.util.concurrent.locks.LockSupport.park(LockSupport.java:194)
at java.base@11.0.16/java.util.concurrent.locks.AbstractQueuedSynchronizer$ConditionObject.await(AbstractQueuedSynchronizer.java:2081)
at java.base@11.0.16/java.util.concurrent.LinkedBlockingQueue.take(LinkedBlockingQueue.java:433)
at java.base@11.0.16/java.util.concurrent.ThreadPoolExecutor.getTask(ThreadPoolExecutor.java:1054)
at java.base@11.0.16/java.util.concurrent.ThreadPoolExecutor.runWorker(ThreadPoolExecutor.java:1114)
at java.base@11.0.16/java.util.concurrent.ThreadPoolExecutor$Worker.run(ThreadPoolExecutor.java:628)
at java.base@11.0.16/java.lang.Thread.run(Thread.java:829)
at __randomizedtesting.SeedInfo.seed([B64678882F9587A3]:0)
Build Log:
[...truncated 9570 lines...]
# ERROR: Error from server at http://localhost:8983/solr/admin/collections?action=CREATE&name=COLL_NAME&collection.configName=COLL_NAME&numShards=1&nrtReplicas=1&wt=javabin&version=2: org.apache.solr.cluster.placement.PlacementException: Not enough eligible nodes to place 1 replica(s) of type NRT for shard shard1 of collection COLL_NAME. Only able to place 0 replicas.
ok 42 Random placement plugin using ENV in 22422ms
ok 43 post solr log into solr in 9105ms
ok 44 start solr with ssl in 20067ms
ok 45 start solr with ssl and auth in 23143ms
ok 46 SOLR-11740 check 'solr stop' connection in 28099ms
ok 47 status detects locally running solr in 14680ms
ok 48 status does not expose cli parameters to end user in 210ms
ok 49 listing out files in 2156ms
ok 50 copying files around in 6518ms
ok 51 upconfig in 2670ms
> Task :solr:packaging:integrationTests FAILED
ERROR: The following test(s) have failed:
- org.apache.solr.search.TestCoordinatorRole.testConcurrentAccess (:solr:core)
Test output: /tmp/src/solr/solr/core/build/test-results/test/outputs/OUTPUT-org.apache.solr.search.TestCoordinatorRole.txt
Reproduce with: gradlew :solr:core:test --tests "org.apache.solr.search.TestCoordinatorRole.testConcurrentAccess" -Ptests.jvms=96 "-Ptests.jvmargs=-XX:TieredStopAtLevel=1 -XX:+UseParallelGC -XX:ActiveProcessorCount=1 -XX:ReservedCodeCacheSize=120m" -Ptests.seed=B64678882F9587A3 -Ptests.file.encoding=ISO-8859-1
- org.apache.solr.search.TestCoordinatorRole.classMethod (:solr:core)
Test output: /tmp/src/solr/solr/core/build/test-results/test/outputs/OUTPUT-org.apache.solr.search.TestCoordinatorRole.txt
Reproduce with: gradlew :solr:core:test --tests "org.apache.solr.search.TestCoordinatorRole.classMethod" -Ptests.jvms=96 "-Ptests.jvmargs=-XX:TieredStopAtLevel=1 -XX:+UseParallelGC -XX:ActiveProcessorCount=1 -XX:ReservedCodeCacheSize=120m" -Ptests.seed=B64678882F9587A3 -Ptests.file.encoding=ISO-8859-1
- org.apache.solr.search.TestCoordinatorRole.classMethod (:solr:core)
Test output: /tmp/src/solr/solr/core/build/test-results/test/outputs/OUTPUT-org.apache.solr.search.TestCoordinatorRole.txt
Reproduce with: gradlew :solr:core:test --tests "org.apache.solr.search.TestCoordinatorRole.classMethod" -Ptests.jvms=96 "-Ptests.jvmargs=-XX:TieredStopAtLevel=1 -XX:+UseParallelGC -XX:ActiveProcessorCount=1 -XX:ReservedCodeCacheSize=120m" -Ptests.seed=B64678882F9587A3 -Ptests.file.encoding=ISO-8859-1
FAILURE: Build completed with 2 failures.
1: Task failed with an exception.
-----------
* What went wrong:
Execution failed for task ':solr:core:test'.
> There were failing tests. See the results at: file:///tmp/src/solr/solr/core/build/test-results/test/
* Try:
> Run with --stacktrace option to get the stack trace.
> Run with --info or --debug option to get more log output.
> Run with --scan to get full insights.
==============================================================================
2: Task failed with an exception.
-----------
* Where:
Build file '/tmp/src/solr/solr/packaging/build.gradle' line: 285
* What went wrong:
Execution failed for task ':solr:packaging:integrationTests'.
> Process 'command '/tmp/src/solr/.gradle/node/packaging/node_modules/bats/bin/bats'' finished with non-zero exit value 1
* Try:
> Run with --stacktrace option to get the stack trace.
> Run with --info or --debug option to get more log output.
> Run with --scan to get full insights.
==============================================================================
* Get more help at https://help.gradle.org
BUILD FAILED in 13m
625 actionable tasks: 609 executed, 16 up-to-date
[0m[?12l[?25h
------------------------------------------------------------------------
Build Failed: returned 1
Total time: 13m21s
------------------------------------------------------------------------
+ status=1
+ ./crave pull '**/build/**/test/TEST-*.xml' '**/*.events' 'heapdumps/**' '**/hs_err_pid*'
Error: rsync: [sender] change_dir "/tmp/src/solr/heapdumps" failed: No such file or directory (2)
rsync error: some files/attrs were not transferred (see previous errors) (code 23) at main.c(1684) [Receiver=3.1.3]
rsync: [Receiver] write error: Broken pipe (32)
+ exit 1
Build step 'Execute shell' marked build as failure
Archiving artifacts
Recording test results
[Checks API] No suitable checks publisher found.
Email was triggered for: Failure - Any
Sending email for trigger: Failure - Any
[JENKINS] Solr » Solr-Check-9.x - Build # 4887 - Still Failing!
Posted by Apache Jenkins Server <je...@builds.apache.org>.
Build: https://ci-builds.apache.org/job/Solr/job/Solr-Check-9.x/4887/
All tests passed
Build Log:
[...truncated 1257 lines...]
# ERROR: Error from server at http://localhost:8983/solr/admin/collections?action=CREATE&name=COLL_NAME&collection.configName=COLL_NAME&numShards=1&nrtReplicas=1&wt=javabin&version=2: org.apache.solr.cluster.placement.PlacementException: Not enough eligible nodes to place 1 replica(s) of type NRT for shard shard1 of collection COLL_NAME. Only able to place 0 replicas.
ok 42 Random placement plugin using ENV in 22377ms
ok 43 post solr log into solr in 9064ms
ok 44 start solr with ssl in 20018ms
ok 45 start solr with ssl and auth in 22713ms
ok 46 SOLR-11740 check 'solr stop' connection in 28457ms
ok 47 status detects locally running solr in 14412ms
ok 48 status does not expose cli parameters to end user in 219ms
ok 49 listing out files in 2175ms
ok 50 copying files around in 6596ms
ok 51 upconfig in 2653ms
> Task :solr:packaging:integrationTests FAILED
FAILURE: Build failed with an exception.
* Where:
Build file '/tmp/src/solr/solr/packaging/build.gradle' line: 285
* What went wrong:
Execution failed for task ':solr:packaging:integrationTests'.
> Process 'command '/tmp/src/solr/.gradle/node/packaging/node_modules/bats/bin/bats'' finished with non-zero exit value 1
* Try:
> Run with --stacktrace option to get the stack trace.
> Run with --info or --debug option to get more log output.
> Run with --scan to get full insights.
* Get more help at https://help.gradle.org
BUILD FAILED in 16m 5s
644 actionable tasks: 628 executed, 16 up-to-date
[0m[?12l[?25h
------------------------------------------------------------------------
Build Failed: returned 1
Total time: 16m26s
------------------------------------------------------------------------
+ status=1
+ ./crave pull '**/build/**/test/TEST-*.xml' '**/*.events' 'heapdumps/**' '**/hs_err_pid*'
Error: rsync: [sender] change_dir "/tmp/src/solr/heapdumps" failed: No such file or directory (2)
rsync error: some files/attrs were not transferred (see previous errors) (code 23) at main.c(1675) [Receiver=3.1.2]
rsync: [Receiver] write error: Broken pipe (32)
+ exit 1
Build step 'Execute shell' marked build as failure
Archiving artifacts
Recording test results
[Checks API] No suitable checks publisher found.
Email was triggered for: Failure - Any
Sending email for trigger: Failure - Any
[JENKINS] Solr » Solr-Check-9.x - Build # 4886 - Still Failing!
Posted by Apache Jenkins Server <je...@builds.apache.org>.
Build: https://ci-builds.apache.org/job/Solr/job/Solr-Check-9.x/4886/
All tests passed
Build Log:
[...truncated 1255 lines...]
# ERROR: Error from server at http://localhost:8983/solr/admin/collections?action=CREATE&name=COLL_NAME&collection.configName=COLL_NAME&numShards=1&nrtReplicas=1&wt=javabin&version=2: org.apache.solr.cluster.placement.PlacementException: Not enough eligible nodes to place 1 replica(s) of type NRT for shard shard1 of collection COLL_NAME. Only able to place 0 replicas.
ok 42 Random placement plugin using ENV in 22291ms
ok 43 post solr log into solr in 9165ms
ok 44 start solr with ssl in 20389ms
ok 45 start solr with ssl and auth in 22394ms
ok 46 SOLR-11740 check 'solr stop' connection in 28104ms
ok 47 status detects locally running solr in 14342ms
ok 48 status does not expose cli parameters to end user in 210ms
ok 49 listing out files in 2164ms
ok 50 copying files around in 6472ms
ok 51 upconfig in 2615ms
> Task :solr:packaging:integrationTests FAILED
FAILURE: Build failed with an exception.
* Where:
Build file '/tmp/src/solr/solr/packaging/build.gradle' line: 285
* What went wrong:
Execution failed for task ':solr:packaging:integrationTests'.
> Process 'command '/tmp/src/solr/.gradle/node/packaging/node_modules/bats/bin/bats'' finished with non-zero exit value 1
* Try:
> Run with --stacktrace option to get the stack trace.
> Run with --info or --debug option to get more log output.
> Run with --scan to get full insights.
* Get more help at https://help.gradle.org
BUILD FAILED in 15m 55s
644 actionable tasks: 628 executed, 16 up-to-date
[0m[?12l[?25h
------------------------------------------------------------------------
Build Failed: returned 1
Total time: 16m15.5s
------------------------------------------------------------------------
+ status=1
+ ./crave pull '**/build/**/test/TEST-*.xml' '**/*.events' 'heapdumps/**' '**/hs_err_pid*'
Error: rsync: [sender] change_dir "/tmp/src/solr/heapdumps" failed: No such file or directory (2)
rsync error: some files/attrs were not transferred (see previous errors) (code 23) at main.c(1684) [Receiver=3.1.3]
rsync: [Receiver] write error: Broken pipe (32)
+ exit 1
Build step 'Execute shell' marked build as failure
Archiving artifacts
Recording test results
[Checks API] No suitable checks publisher found.
Email was triggered for: Failure - Any
Sending email for trigger: Failure - Any
[JENKINS] Solr » Solr-Check-9.x - Build # 4885 - Still Failing!
Posted by Apache Jenkins Server <je...@builds.apache.org>.
Build: https://ci-builds.apache.org/job/Solr/job/Solr-Check-9.x/4885/
All tests passed
Build Log:
[...truncated 1247 lines...]
# ERROR: Error from server at http://localhost:8983/solr/admin/collections?action=CREATE&name=COLL_NAME&collection.configName=COLL_NAME&numShards=1&nrtReplicas=1&wt=javabin&version=2: org.apache.solr.cluster.placement.PlacementException: Not enough eligible nodes to place 1 replica(s) of type NRT for shard shard1 of collection COLL_NAME. Only able to place 0 replicas.
ok 42 Random placement plugin using ENV in 22870ms
ok 43 post solr log into solr in 9097ms
ok 44 start solr with ssl in 20322ms
ok 45 start solr with ssl and auth in 22865ms
ok 46 SOLR-11740 check 'solr stop' connection in 28036ms
ok 47 status detects locally running solr in 14695ms
ok 48 status does not expose cli parameters to end user in 209ms
ok 49 listing out files in 2156ms
ok 50 copying files around in 6502ms
ok 51 upconfig in 2622ms
> Task :solr:packaging:integrationTests FAILED
FAILURE: Build failed with an exception.
* Where:
Build file '/tmp/src/solr/solr/packaging/build.gradle' line: 285
* What went wrong:
Execution failed for task ':solr:packaging:integrationTests'.
> Process 'command '/tmp/src/solr/.gradle/node/packaging/node_modules/bats/bin/bats'' finished with non-zero exit value 1
* Try:
> Run with --stacktrace option to get the stack trace.
> Run with --info or --debug option to get more log output.
> Run with --scan to get full insights.
* Get more help at https://help.gradle.org
BUILD FAILED in 15m 54s
644 actionable tasks: 628 executed, 16 up-to-date
[0m[?12l[?25h
------------------------------------------------------------------------
Build Failed: returned 1
Total time: 16m14.5s
------------------------------------------------------------------------
+ status=1
+ ./crave pull '**/build/**/test/TEST-*.xml' '**/*.events' 'heapdumps/**' '**/hs_err_pid*'
Error: rsync: [sender] change_dir "/tmp/src/solr/heapdumps" failed: No such file or directory (2)
rsync error: some files/attrs were not transferred (see previous errors) (code 23) at main.c(1675) [Receiver=3.1.2]
rsync: [Receiver] write error: Broken pipe (32)
+ exit 1
Build step 'Execute shell' marked build as failure
Archiving artifacts
Recording test results
[Checks API] No suitable checks publisher found.
Email was triggered for: Failure - Any
Sending email for trigger: Failure - Any
[JENKINS] Solr » Solr-Check-9.x - Build # 4884 - Still Failing!
Posted by Apache Jenkins Server <je...@builds.apache.org>.
Build: https://ci-builds.apache.org/job/Solr/job/Solr-Check-9.x/4884/
All tests passed
Build Log:
[...truncated 1252 lines...]
# ERROR: Error from server at http://localhost:8983/solr/admin/collections?action=CREATE&name=COLL_NAME&collection.configName=COLL_NAME&numShards=1&nrtReplicas=1&wt=javabin&version=2: org.apache.solr.cluster.placement.PlacementException: Not enough eligible nodes to place 1 replica(s) of type NRT for shard shard1 of collection COLL_NAME. Only able to place 0 replicas.
ok 42 Random placement plugin using ENV in 22481ms
ok 43 post solr log into solr in 9303ms
ok 44 start solr with ssl in 20419ms
ok 45 start solr with ssl and auth in 22697ms
ok 46 SOLR-11740 check 'solr stop' connection in 28525ms
ok 47 status detects locally running solr in 14463ms
ok 48 status does not expose cli parameters to end user in 222ms
ok 49 listing out files in 2160ms
ok 50 copying files around in 6608ms
ok 51 upconfig in 2662ms
> Task :solr:packaging:integrationTests FAILED
FAILURE: Build failed with an exception.
* Where:
Build file '/tmp/src/solr/solr/packaging/build.gradle' line: 285
* What went wrong:
Execution failed for task ':solr:packaging:integrationTests'.
> Process 'command '/tmp/src/solr/.gradle/node/packaging/node_modules/bats/bin/bats'' finished with non-zero exit value 1
* Try:
> Run with --stacktrace option to get the stack trace.
> Run with --info or --debug option to get more log output.
> Run with --scan to get full insights.
* Get more help at https://help.gradle.org
BUILD FAILED in 16m 3s
644 actionable tasks: 628 executed, 16 up-to-date
[0m[?12l[?25h
------------------------------------------------------------------------
Build Failed: returned 1
Total time: 16m24.5s
------------------------------------------------------------------------
+ status=1
+ ./crave pull '**/build/**/test/TEST-*.xml' '**/*.events' 'heapdumps/**' '**/hs_err_pid*'
Error: rsync: [sender] change_dir "/tmp/src/solr/heapdumps" failed: No such file or directory (2)
rsync error: some files/attrs were not transferred (see previous errors) (code 23) at main.c(1684) [Receiver=3.1.3]
rsync: [Receiver] write error: Broken pipe (32)
+ exit 1
Build step 'Execute shell' marked build as failure
Archiving artifacts
Recording test results
[Checks API] No suitable checks publisher found.
Email was triggered for: Failure - Any
Sending email for trigger: Failure - Any
[JENKINS] Solr » Solr-Check-9.x - Build # 4883 - Still Failing!
Posted by Apache Jenkins Server <je...@builds.apache.org>.
Build: https://ci-builds.apache.org/job/Solr/job/Solr-Check-9.x/4883/
All tests passed
Build Log:
[...truncated 1256 lines...]
# ERROR: Error from server at http://localhost:8983/solr/admin/collections?action=CREATE&name=COLL_NAME&collection.configName=COLL_NAME&numShards=1&nrtReplicas=1&wt=javabin&version=2: org.apache.solr.cluster.placement.PlacementException: Not enough eligible nodes to place 1 replica(s) of type NRT for shard shard1 of collection COLL_NAME. Only able to place 0 replicas.
ok 42 Random placement plugin using ENV in 22537ms
ok 43 post solr log into solr in 9145ms
ok 44 start solr with ssl in 19963ms
ok 45 start solr with ssl and auth in 22181ms
ok 46 SOLR-11740 check 'solr stop' connection in 28065ms
ok 47 status detects locally running solr in 14349ms
ok 48 status does not expose cli parameters to end user in 210ms
ok 49 listing out files in 2166ms
ok 50 copying files around in 6520ms
ok 51 upconfig in 2627ms
> Task :solr:packaging:integrationTests FAILED
FAILURE: Build failed with an exception.
* Where:
Build file '/tmp/src/solr/solr/packaging/build.gradle' line: 285
* What went wrong:
Execution failed for task ':solr:packaging:integrationTests'.
> Process 'command '/tmp/src/solr/.gradle/node/packaging/node_modules/bats/bin/bats'' finished with non-zero exit value 1
* Try:
> Run with --stacktrace option to get the stack trace.
> Run with --info or --debug option to get more log output.
> Run with --scan to get full insights.
* Get more help at https://help.gradle.org
BUILD FAILED in 15m 58s
644 actionable tasks: 628 executed, 16 up-to-date
[0m[?12l[?25h
------------------------------------------------------------------------
Build Failed: returned 1
Total time: 16m20s
------------------------------------------------------------------------
+ status=1
+ ./crave pull '**/build/**/test/TEST-*.xml' '**/*.events' 'heapdumps/**' '**/hs_err_pid*'
Error: rsync: [sender] change_dir "/tmp/src/solr/heapdumps" failed: No such file or directory (2)
rsync error: some files/attrs were not transferred (see previous errors) (code 23) at main.c(1675) [Receiver=3.1.2]
rsync: [Receiver] write error: Broken pipe (32)
+ exit 1
Build step 'Execute shell' marked build as failure
Archiving artifacts
Recording test results
[Checks API] No suitable checks publisher found.
Email was triggered for: Failure - Any
Sending email for trigger: Failure - Any