You are viewing a plain text version of this content. The canonical link for it is here.
Posted to dev@lucene.apache.org by Policeman Jenkins Server <je...@thetaphi.de> on 2016/03/05 03:42:51 UTC

[JENKINS] Lucene-Solr-6.x-Windows (64bit/jdk1.8.0_72) - Build # 9 - Still Failing!

Build: http://jenkins.thetaphi.de/job/Lucene-Solr-6.x-Windows/9/
Java: 64bit/jdk1.8.0_72 -XX:+UseCompressedOops -XX:+UseSerialGC

1 tests failed.
FAILED:  org.apache.lucene.codecs.simpletext.TestSimpleTextPointFormat.testAllPointDocsDeletedInSegment

Error Message:
SimpleText failure: footer does not start at expected position current=30 vs expected=0 (resource=BufferedChecksumIndexInput(MockIndexInputWrapper(RAMInputStream(name=RAMInputStream(name=_1.scf) [slice=_1.dim]))))

Stack Trace:
org.apache.lucene.index.CorruptIndexException: SimpleText failure: footer does not start at expected position current=30 vs expected=0 (resource=BufferedChecksumIndexInput(MockIndexInputWrapper(RAMInputStream(name=RAMInputStream(name=_1.scf) [slice=_1.dim]))))
	at __randomizedtesting.SeedInfo.seed([3825EA24A3A8333E:D20448A3B898EFE]:0)
	at org.apache.lucene.codecs.simpletext.SimpleTextPointReader.checkIntegrity(SimpleTextPointReader.java:214)
	at org.apache.lucene.index.CodecReader.checkIntegrity(CodecReader.java:398)
	at org.apache.lucene.index.CheckIndex.checkIndex(CheckIndex.java:676)
	at org.apache.lucene.util.TestUtil.checkIndex(TestUtil.java:300)
	at org.apache.lucene.store.MockDirectoryWrapper.close(MockDirectoryWrapper.java:848)
	at org.apache.lucene.util.IOUtils.close(IOUtils.java:89)
	at org.apache.lucene.util.IOUtils.close(IOUtils.java:76)
	at org.apache.lucene.index.BasePointFormatTestCase.testAllPointDocsDeletedInSegment(BasePointFormatTestCase.java:192)
	at sun.reflect.NativeMethodAccessorImpl.invoke0(Native Method)
	at sun.reflect.NativeMethodAccessorImpl.invoke(NativeMethodAccessorImpl.java:62)
	at sun.reflect.DelegatingMethodAccessorImpl.invoke(DelegatingMethodAccessorImpl.java:43)
	at java.lang.reflect.Method.invoke(Method.java:498)
	at com.carrotsearch.randomizedtesting.RandomizedRunner.invoke(RandomizedRunner.java:1764)
	at com.carrotsearch.randomizedtesting.RandomizedRunner$8.evaluate(RandomizedRunner.java:871)
	at com.carrotsearch.randomizedtesting.RandomizedRunner$9.evaluate(RandomizedRunner.java:907)
	at com.carrotsearch.randomizedtesting.RandomizedRunner$10.evaluate(RandomizedRunner.java:921)
	at org.apache.lucene.util.TestRuleSetupTeardownChained$1.evaluate(TestRuleSetupTeardownChained.java:49)
	at org.apache.lucene.util.AbstractBeforeAfterRule$1.evaluate(AbstractBeforeAfterRule.java:45)
	at org.apache.lucene.util.TestRuleThreadAndTestName$1.evaluate(TestRuleThreadAndTestName.java:48)
	at org.apache.lucene.util.TestRuleIgnoreAfterMaxFailures$1.evaluate(TestRuleIgnoreAfterMaxFailures.java:64)
	at org.apache.lucene.util.TestRuleMarkFailure$1.evaluate(TestRuleMarkFailure.java:47)
	at com.carrotsearch.randomizedtesting.rules.StatementAdapter.evaluate(StatementAdapter.java:36)
	at com.carrotsearch.randomizedtesting.ThreadLeakControl$StatementRunner.run(ThreadLeakControl.java:367)
	at com.carrotsearch.randomizedtesting.ThreadLeakControl.forkTimeoutingTask(ThreadLeakControl.java:809)
	at com.carrotsearch.randomizedtesting.ThreadLeakControl$3.evaluate(ThreadLeakControl.java:460)
	at com.carrotsearch.randomizedtesting.RandomizedRunner.runSingleTest(RandomizedRunner.java:880)
	at com.carrotsearch.randomizedtesting.RandomizedRunner$5.evaluate(RandomizedRunner.java:781)
	at com.carrotsearch.randomizedtesting.RandomizedRunner$6.evaluate(RandomizedRunner.java:816)
	at com.carrotsearch.randomizedtesting.RandomizedRunner$7.evaluate(RandomizedRunner.java:827)
	at org.apache.lucene.util.AbstractBeforeAfterRule$1.evaluate(AbstractBeforeAfterRule.java:45)
	at com.carrotsearch.randomizedtesting.rules.StatementAdapter.evaluate(StatementAdapter.java:36)
	at org.apache.lucene.util.TestRuleStoreClassName$1.evaluate(TestRuleStoreClassName.java:41)
	at com.carrotsearch.randomizedtesting.rules.NoShadowingOrOverridesOnMethodsRule$1.evaluate(NoShadowingOrOverridesOnMethodsRule.java:40)
	at com.carrotsearch.randomizedtesting.rules.NoShadowingOrOverridesOnMethodsRule$1.evaluate(NoShadowingOrOverridesOnMethodsRule.java:40)
	at com.carrotsearch.randomizedtesting.rules.StatementAdapter.evaluate(StatementAdapter.java:36)
	at com.carrotsearch.randomizedtesting.rules.StatementAdapter.evaluate(StatementAdapter.java:36)
	at com.carrotsearch.randomizedtesting.rules.StatementAdapter.evaluate(StatementAdapter.java:36)
	at org.apache.lucene.util.TestRuleAssertionsRequired$1.evaluate(TestRuleAssertionsRequired.java:53)
	at org.apache.lucene.util.TestRuleMarkFailure$1.evaluate(TestRuleMarkFailure.java:47)
	at org.apache.lucene.util.TestRuleIgnoreAfterMaxFailures$1.evaluate(TestRuleIgnoreAfterMaxFailures.java:64)
	at org.apache.lucene.util.TestRuleIgnoreTestSuites$1.evaluate(TestRuleIgnoreTestSuites.java:54)
	at com.carrotsearch.randomizedtesting.rules.StatementAdapter.evaluate(StatementAdapter.java:36)
	at com.carrotsearch.randomizedtesting.ThreadLeakControl$StatementRunner.run(ThreadLeakControl.java:367)
	at java.lang.Thread.run(Thread.java:745)




Build Log:
[...truncated 6002 lines...]
   [junit4] Suite: org.apache.lucene.codecs.simpletext.TestSimpleTextPointFormat
   [junit4] IGNOR/A 0.00s J0 | TestSimpleTextPointFormat.testRandomBinaryBig
   [junit4]    > Assumption #1: 'nightly' test group is disabled (@Nightly())
   [junit4]   2> NOTE: reproduce with: ant test  -Dtestcase=TestSimpleTextPointFormat -Dtests.method=testAllPointDocsDeletedInSegment -Dtests.seed=3825EA24A3A8333E -Dtests.slow=true -Dtests.locale=hu -Dtests.timezone=Atlantic/St_Helena -Dtests.asserts=true -Dtests.file.encoding=ISO-8859-1
   [junit4] ERROR   0.42s J0 | TestSimpleTextPointFormat.testAllPointDocsDeletedInSegment <<<
   [junit4]    > Throwable #1: org.apache.lucene.index.CorruptIndexException: SimpleText failure: footer does not start at expected position current=30 vs expected=0 (resource=BufferedChecksumIndexInput(MockIndexInputWrapper(RAMInputStream(name=RAMInputStream(name=_1.scf) [slice=_1.dim]))))
   [junit4]    > 	at __randomizedtesting.SeedInfo.seed([3825EA24A3A8333E:D20448A3B898EFE]:0)
   [junit4]    > 	at org.apache.lucene.codecs.simpletext.SimpleTextPointReader.checkIntegrity(SimpleTextPointReader.java:214)
   [junit4]    > 	at org.apache.lucene.index.CodecReader.checkIntegrity(CodecReader.java:398)
   [junit4]    > 	at org.apache.lucene.index.CheckIndex.checkIndex(CheckIndex.java:676)
   [junit4]    > 	at org.apache.lucene.util.TestUtil.checkIndex(TestUtil.java:300)
   [junit4]    > 	at org.apache.lucene.store.MockDirectoryWrapper.close(MockDirectoryWrapper.java:848)
   [junit4]    > 	at org.apache.lucene.util.IOUtils.close(IOUtils.java:89)
   [junit4]    > 	at org.apache.lucene.util.IOUtils.close(IOUtils.java:76)
   [junit4]    > 	at org.apache.lucene.index.BasePointFormatTestCase.testAllPointDocsDeletedInSegment(BasePointFormatTestCase.java:192)
   [junit4]    > 	at java.lang.Thread.run(Thread.java:745)
   [junit4] IGNOR/A 0.00s J0 | TestSimpleTextPointFormat.testMergeStability
   [junit4]    > Assumption #1: merge is not stable
   [junit4]   2> NOTE: leaving temporary files on disk at: C:\Users\JenkinsSlave\workspace\Lucene-Solr-6.x-Windows\lucene\build\codecs\test\J0\temp\lucene.codecs.simpletext.TestSimpleTextPointFormat_3825EA24A3A8333E-001
   [junit4]   2> NOTE: test params are: codec=Asserting(Lucene60): {}, docValues:{}, maxPointsInLeafNode=1505, maxMBSortInHeap=5.324854824993119, sim=ClassicSimilarity, locale=hu, timezone=Atlantic/St_Helena
   [junit4]   2> NOTE: Windows 7 6.1 amd64/Oracle Corporation 1.8.0_72 (64-bit)/cpus=3,threads=1,free=29627384,total=127229952
   [junit4]   2> NOTE: All tests run in this JVM: [TestSimpleTextTermVectorsFormat, TestVarGapDocFreqIntervalPostingsFormat, TestMemoryDocValuesFormat, TestFixedGapPostingsFormat, TestOrdsBlockTree, TestSimpleTextFieldInfoFormat, TestMemoryPostingsFormat, TestDirectPostingsFormat, TestSimpleTextPostingsFormat, TestAutoPrefixPostingsFormat, TestAutoPrefixTerms, TestFSTOrdPostingsFormat, TestSimpleTextPointFormat]
   [junit4] Completed [22/22 (1!)] on J0 in 5.97s, 16 tests, 1 error, 2 skipped <<< FAILURES!

[...truncated 10 lines...]
BUILD FAILED
C:\Users\JenkinsSlave\workspace\Lucene-Solr-6.x-Windows\build.xml:740: The following error occurred while executing this line:
C:\Users\JenkinsSlave\workspace\Lucene-Solr-6.x-Windows\build.xml:684: The following error occurred while executing this line:
C:\Users\JenkinsSlave\workspace\Lucene-Solr-6.x-Windows\build.xml:59: The following error occurred while executing this line:
C:\Users\JenkinsSlave\workspace\Lucene-Solr-6.x-Windows\lucene\build.xml:476: The following error occurred while executing this line:
C:\Users\JenkinsSlave\workspace\Lucene-Solr-6.x-Windows\lucene\common-build.xml:2187: The following error occurred while executing this line:
C:\Users\JenkinsSlave\workspace\Lucene-Solr-6.x-Windows\lucene\module-build.xml:58: The following error occurred while executing this line:
C:\Users\JenkinsSlave\workspace\Lucene-Solr-6.x-Windows\lucene\common-build.xml:1457: The following error occurred while executing this line:
C:\Users\JenkinsSlave\workspace\Lucene-Solr-6.x-Windows\lucene\common-build.xml:1014: There were test failures: 22 suites, 662 tests, 1 error, 29 ignored (29 assumptions) [seed: 3825EA24A3A8333E]

Total time: 13 minutes 18 seconds
Build step 'Invoke Ant' marked build as failure
Archiving artifacts
[WARNINGS] Skipping publisher since build result is FAILURE
Recording test results
Email was triggered for: Failure - Any
Sending email for trigger: Failure - Any



[JENKINS] Lucene-Solr-6.x-Windows (64bit/jdk1.8.0_72) - Build # 12 - Still Failing!

Posted by Policeman Jenkins Server <je...@thetaphi.de>.
Build: http://jenkins.thetaphi.de/job/Lucene-Solr-6.x-Windows/12/
Java: 64bit/jdk1.8.0_72 -XX:-UseCompressedOops -XX:+UseSerialGC

1 tests failed.
FAILED:  org.apache.lucene.store.TestMockDirectoryWrapper.testListAllIsSorted

Error Message:
access denied ("java.io.FilePermission" "C:\Users\JenkinsSlave\workspace\Lucene-Solr-6.x-Windows\lucene\build\test-framework\test\J1\temp\lucene.store.TestMockDirectoryWrapper_742520FBB91F2D4-001\tempDir-009\prn" "write")

Stack Trace:
java.security.AccessControlException: access denied ("java.io.FilePermission" "C:\Users\JenkinsSlave\workspace\Lucene-Solr-6.x-Windows\lucene\build\test-framework\test\J1\temp\lucene.store.TestMockDirectoryWrapper_742520FBB91F2D4-001\tempDir-009\prn" "write")
	at __randomizedtesting.SeedInfo.seed([742520FBB91F2D4:9D6EF57D7BAE7D5D]:0)
	at java.security.AccessControlContext.checkPermission(AccessControlContext.java:472)
	at java.security.AccessController.checkPermission(AccessController.java:884)
	at java.lang.SecurityManager.checkPermission(SecurityManager.java:549)
	at java.lang.SecurityManager.checkWrite(SecurityManager.java:979)
	at sun.nio.fs.WindowsChannelFactory.open(WindowsChannelFactory.java:295)
	at sun.nio.fs.WindowsChannelFactory.newFileChannel(WindowsChannelFactory.java:162)
	at sun.nio.fs.WindowsFileSystemProvider.newByteChannel(WindowsFileSystemProvider.java:225)
	at java.nio.file.spi.FileSystemProvider.newOutputStream(FileSystemProvider.java:434)
	at org.apache.lucene.mockfile.FilterFileSystemProvider.newOutputStream(FilterFileSystemProvider.java:197)
	at org.apache.lucene.mockfile.FilterFileSystemProvider.newOutputStream(FilterFileSystemProvider.java:197)
	at org.apache.lucene.mockfile.HandleTrackingFS.newOutputStream(HandleTrackingFS.java:129)
	at org.apache.lucene.mockfile.HandleTrackingFS.newOutputStream(HandleTrackingFS.java:129)
	at org.apache.lucene.mockfile.FilterFileSystemProvider.newOutputStream(FilterFileSystemProvider.java:197)
	at java.nio.file.Files.newOutputStream(Files.java:216)
	at org.apache.lucene.store.FSDirectory$FSIndexOutput.<init>(FSDirectory.java:408)
	at org.apache.lucene.store.FSDirectory$FSIndexOutput.<init>(FSDirectory.java:404)
	at org.apache.lucene.store.FSDirectory.createOutput(FSDirectory.java:253)
	at org.apache.lucene.store.MockDirectoryWrapper.createOutput(MockDirectoryWrapper.java:648)
	at org.apache.lucene.store.BaseDirectoryTestCase.testListAllIsSorted(BaseDirectoryTestCase.java:1279)
	at sun.reflect.NativeMethodAccessorImpl.invoke0(Native Method)
	at sun.reflect.NativeMethodAccessorImpl.invoke(NativeMethodAccessorImpl.java:62)
	at sun.reflect.DelegatingMethodAccessorImpl.invoke(DelegatingMethodAccessorImpl.java:43)
	at java.lang.reflect.Method.invoke(Method.java:498)
	at com.carrotsearch.randomizedtesting.RandomizedRunner.invoke(RandomizedRunner.java:1764)
	at com.carrotsearch.randomizedtesting.RandomizedRunner$8.evaluate(RandomizedRunner.java:871)
	at com.carrotsearch.randomizedtesting.RandomizedRunner$9.evaluate(RandomizedRunner.java:907)
	at com.carrotsearch.randomizedtesting.RandomizedRunner$10.evaluate(RandomizedRunner.java:921)
	at org.apache.lucene.util.TestRuleSetupTeardownChained$1.evaluate(TestRuleSetupTeardownChained.java:49)
	at org.apache.lucene.util.AbstractBeforeAfterRule$1.evaluate(AbstractBeforeAfterRule.java:45)
	at org.apache.lucene.util.TestRuleThreadAndTestName$1.evaluate(TestRuleThreadAndTestName.java:48)
	at org.apache.lucene.util.TestRuleIgnoreAfterMaxFailures$1.evaluate(TestRuleIgnoreAfterMaxFailures.java:64)
	at org.apache.lucene.util.TestRuleMarkFailure$1.evaluate(TestRuleMarkFailure.java:47)
	at com.carrotsearch.randomizedtesting.rules.StatementAdapter.evaluate(StatementAdapter.java:36)
	at com.carrotsearch.randomizedtesting.ThreadLeakControl$StatementRunner.run(ThreadLeakControl.java:367)
	at com.carrotsearch.randomizedtesting.ThreadLeakControl.forkTimeoutingTask(ThreadLeakControl.java:809)
	at com.carrotsearch.randomizedtesting.ThreadLeakControl$3.evaluate(ThreadLeakControl.java:460)
	at com.carrotsearch.randomizedtesting.RandomizedRunner.runSingleTest(RandomizedRunner.java:880)
	at com.carrotsearch.randomizedtesting.RandomizedRunner$5.evaluate(RandomizedRunner.java:781)
	at com.carrotsearch.randomizedtesting.RandomizedRunner$6.evaluate(RandomizedRunner.java:816)
	at com.carrotsearch.randomizedtesting.RandomizedRunner$7.evaluate(RandomizedRunner.java:827)
	at org.apache.lucene.util.AbstractBeforeAfterRule$1.evaluate(AbstractBeforeAfterRule.java:45)
	at com.carrotsearch.randomizedtesting.rules.StatementAdapter.evaluate(StatementAdapter.java:36)
	at org.apache.lucene.util.TestRuleStoreClassName$1.evaluate(TestRuleStoreClassName.java:41)
	at com.carrotsearch.randomizedtesting.rules.NoShadowingOrOverridesOnMethodsRule$1.evaluate(NoShadowingOrOverridesOnMethodsRule.java:40)
	at com.carrotsearch.randomizedtesting.rules.NoShadowingOrOverridesOnMethodsRule$1.evaluate(NoShadowingOrOverridesOnMethodsRule.java:40)
	at com.carrotsearch.randomizedtesting.rules.StatementAdapter.evaluate(StatementAdapter.java:36)
	at com.carrotsearch.randomizedtesting.rules.StatementAdapter.evaluate(StatementAdapter.java:36)
	at com.carrotsearch.randomizedtesting.rules.StatementAdapter.evaluate(StatementAdapter.java:36)
	at org.apache.lucene.util.TestRuleAssertionsRequired$1.evaluate(TestRuleAssertionsRequired.java:53)
	at org.apache.lucene.util.TestRuleMarkFailure$1.evaluate(TestRuleMarkFailure.java:47)
	at org.apache.lucene.util.TestRuleIgnoreAfterMaxFailures$1.evaluate(TestRuleIgnoreAfterMaxFailures.java:64)
	at org.apache.lucene.util.TestRuleIgnoreTestSuites$1.evaluate(TestRuleIgnoreTestSuites.java:54)
	at com.carrotsearch.randomizedtesting.rules.StatementAdapter.evaluate(StatementAdapter.java:36)
	at com.carrotsearch.randomizedtesting.ThreadLeakControl$StatementRunner.run(ThreadLeakControl.java:367)
	at java.lang.Thread.run(Thread.java:745)




Build Log:
[...truncated 1768 lines...]
   [junit4] Suite: org.apache.lucene.store.TestMockDirectoryWrapper
   [junit4] IGNOR/A 0.00s J1 | TestMockDirectoryWrapper.testPendingDeletions
   [junit4]    > Assumption #1: we can only install VirusCheckingFS on an FSDirectory
   [junit4] IGNOR/A 0.00s J1 | TestMockDirectoryWrapper.testThreadSafety
   [junit4]    > Assumption #1: 'nightly' test group is disabled (@Nightly())
   [junit4] IGNOR/A 0.00s J1 | TestMockDirectoryWrapper.testFsyncDoesntCreateNewFiles
   [junit4]    > Assumption #1: test only works for FSDirectory subclasses
   [junit4]   2> NOTE: reproduce with: ant test  -Dtestcase=TestMockDirectoryWrapper -Dtests.method=testListAllIsSorted -Dtests.seed=742520FBB91F2D4 -Dtests.slow=true -Dtests.locale=pt -Dtests.timezone=Asia/Beirut -Dtests.asserts=true -Dtests.file.encoding=Cp1252
   [junit4] ERROR   0.02s J1 | TestMockDirectoryWrapper.testListAllIsSorted <<<
   [junit4]    > Throwable #1: java.security.AccessControlException: access denied ("java.io.FilePermission" "C:\Users\JenkinsSlave\workspace\Lucene-Solr-6.x-Windows\lucene\build\test-framework\test\J1\temp\lucene.store.TestMockDirectoryWrapper_742520FBB91F2D4-001\tempDir-009\prn" "write")
   [junit4]    > 	at __randomizedtesting.SeedInfo.seed([742520FBB91F2D4:9D6EF57D7BAE7D5D]:0)
   [junit4]    > 	at java.security.AccessControlContext.checkPermission(AccessControlContext.java:472)
   [junit4]    > 	at java.security.AccessController.checkPermission(AccessController.java:884)
   [junit4]    > 	at java.lang.SecurityManager.checkPermission(SecurityManager.java:549)
   [junit4]    > 	at java.lang.SecurityManager.checkWrite(SecurityManager.java:979)
   [junit4]    > 	at sun.nio.fs.WindowsChannelFactory.open(WindowsChannelFactory.java:295)
   [junit4]    > 	at sun.nio.fs.WindowsChannelFactory.newFileChannel(WindowsChannelFactory.java:162)
   [junit4]    > 	at sun.nio.fs.WindowsFileSystemProvider.newByteChannel(WindowsFileSystemProvider.java:225)
   [junit4]    > 	at java.nio.file.spi.FileSystemProvider.newOutputStream(FileSystemProvider.java:434)
   [junit4]    > 	at org.apache.lucene.mockfile.FilterFileSystemProvider.newOutputStream(FilterFileSystemProvider.java:197)
   [junit4]    > 	at org.apache.lucene.mockfile.FilterFileSystemProvider.newOutputStream(FilterFileSystemProvider.java:197)
   [junit4]    > 	at org.apache.lucene.mockfile.HandleTrackingFS.newOutputStream(HandleTrackingFS.java:129)
   [junit4]    > 	at org.apache.lucene.mockfile.HandleTrackingFS.newOutputStream(HandleTrackingFS.java:129)
   [junit4]    > 	at org.apache.lucene.mockfile.FilterFileSystemProvider.newOutputStream(FilterFileSystemProvider.java:197)
   [junit4]    > 	at java.nio.file.Files.newOutputStream(Files.java:216)
   [junit4]    > 	at org.apache.lucene.store.FSDirectory$FSIndexOutput.<init>(FSDirectory.java:408)
   [junit4]    > 	at org.apache.lucene.store.FSDirectory$FSIndexOutput.<init>(FSDirectory.java:404)
   [junit4]    > 	at org.apache.lucene.store.FSDirectory.createOutput(FSDirectory.java:253)
   [junit4]    > 	at org.apache.lucene.store.MockDirectoryWrapper.createOutput(MockDirectoryWrapper.java:648)
   [junit4]    > 	at org.apache.lucene.store.BaseDirectoryTestCase.testListAllIsSorted(BaseDirectoryTestCase.java:1279)
   [junit4]    > 	at java.lang.Thread.run(Thread.java:745)
   [junit4]   2> NOTE: leaving temporary files on disk at: C:\Users\JenkinsSlave\workspace\Lucene-Solr-6.x-Windows\lucene\build\test-framework\test\J1\temp\lucene.store.TestMockDirectoryWrapper_742520FBB91F2D4-001
   [junit4]   2> NOTE: test params are: codec=HighCompressionCompressingStoredFields(storedFieldsFormat=CompressingStoredFieldsFormat(compressionMode=HIGH_COMPRESSION, chunkSize=27917, maxDocsPerChunk=4, blockSize=5), termVectorsFormat=CompressingTermVectorsFormat(compressionMode=HIGH_COMPRESSION, chunkSize=27917, blockSize=5)), sim=ClassicSimilarity, locale=pt, timezone=Asia/Beirut
   [junit4]   2> NOTE: Windows 7 6.1 amd64/Oracle Corporation 1.8.0_72 (64-bit)/cpus=3,threads=1,free=11874840,total=64946176
   [junit4]   2> NOTE: All tests run in this JVM: [TestAssertingStoredFieldsFormat, TestMockCharFilter, TestDisableFsyncFS, Nested1, TestVerboseFS, TestGraphTokenizers, ThrowInUncaught, TestAssertingPointFormat, Nested1, TestGroupFiltering, Nested, TestLookaheadTokenFilter, Nested2, Nested, TestMockDirectoryWrapper]
   [junit4] Completed [22/40 (1!)] on J1 in 0.69s, 47 tests, 1 error, 3 skipped <<< FAILURES!

[...truncated 87 lines...]
BUILD FAILED
C:\Users\JenkinsSlave\workspace\Lucene-Solr-6.x-Windows\build.xml:740: The following error occurred while executing this line:
C:\Users\JenkinsSlave\workspace\Lucene-Solr-6.x-Windows\build.xml:684: The following error occurred while executing this line:
C:\Users\JenkinsSlave\workspace\Lucene-Solr-6.x-Windows\build.xml:59: The following error occurred while executing this line:
C:\Users\JenkinsSlave\workspace\Lucene-Solr-6.x-Windows\lucene\build.xml:470: The following error occurred while executing this line:
C:\Users\JenkinsSlave\workspace\Lucene-Solr-6.x-Windows\lucene\common-build.xml:1457: The following error occurred while executing this line:
C:\Users\JenkinsSlave\workspace\Lucene-Solr-6.x-Windows\lucene\common-build.xml:1014: There were test failures: 40 suites (2 ignored), 433 tests, 1 error, 28 ignored (22 assumptions) [seed: 742520FBB91F2D4]

Total time: 5 minutes 41 seconds
Build step 'Invoke Ant' marked build as failure
Archiving artifacts
[WARNINGS] Skipping publisher since build result is FAILURE
Recording test results
Email was triggered for: Failure - Any
Sending email for trigger: Failure - Any



[JENKINS] Lucene-Solr-6.x-Windows (64bit/jdk1.8.0_72) - Build # 11 - Still Failing!

Posted by Policeman Jenkins Server <je...@thetaphi.de>.
Build: http://jenkins.thetaphi.de/job/Lucene-Solr-6.x-Windows/11/
Java: 64bit/jdk1.8.0_72 -XX:+UseCompressedOops -XX:+UseConcMarkSweepGC

1 tests failed.
FAILED:  org.apache.lucene.codecs.simpletext.TestSimpleTextPointFormat.testAllPointDocsDeletedInSegment

Error Message:
SimpleText failure: footer does not start at expected position current=30 vs expected=0 (resource=BufferedChecksumIndexInput(MockIndexInputWrapper(RAMInputStream(name=RAMInputStream(name=_1.scf) [slice=_1.dim]))))

Stack Trace:
org.apache.lucene.index.CorruptIndexException: SimpleText failure: footer does not start at expected position current=30 vs expected=0 (resource=BufferedChecksumIndexInput(MockIndexInputWrapper(RAMInputStream(name=RAMInputStream(name=_1.scf) [slice=_1.dim]))))
	at __randomizedtesting.SeedInfo.seed([F8C2685BD7041ECA:CDC7C6F54F25A30A]:0)
	at org.apache.lucene.codecs.simpletext.SimpleTextPointReader.checkIntegrity(SimpleTextPointReader.java:214)
	at org.apache.lucene.index.CodecReader.checkIntegrity(CodecReader.java:398)
	at org.apache.lucene.index.CheckIndex.checkIndex(CheckIndex.java:676)
	at org.apache.lucene.util.TestUtil.checkIndex(TestUtil.java:300)
	at org.apache.lucene.store.MockDirectoryWrapper.close(MockDirectoryWrapper.java:848)
	at org.apache.lucene.util.IOUtils.close(IOUtils.java:89)
	at org.apache.lucene.util.IOUtils.close(IOUtils.java:76)
	at org.apache.lucene.index.BasePointFormatTestCase.testAllPointDocsDeletedInSegment(BasePointFormatTestCase.java:192)
	at sun.reflect.NativeMethodAccessorImpl.invoke0(Native Method)
	at sun.reflect.NativeMethodAccessorImpl.invoke(NativeMethodAccessorImpl.java:62)
	at sun.reflect.DelegatingMethodAccessorImpl.invoke(DelegatingMethodAccessorImpl.java:43)
	at java.lang.reflect.Method.invoke(Method.java:498)
	at com.carrotsearch.randomizedtesting.RandomizedRunner.invoke(RandomizedRunner.java:1764)
	at com.carrotsearch.randomizedtesting.RandomizedRunner$8.evaluate(RandomizedRunner.java:871)
	at com.carrotsearch.randomizedtesting.RandomizedRunner$9.evaluate(RandomizedRunner.java:907)
	at com.carrotsearch.randomizedtesting.RandomizedRunner$10.evaluate(RandomizedRunner.java:921)
	at org.apache.lucene.util.TestRuleSetupTeardownChained$1.evaluate(TestRuleSetupTeardownChained.java:49)
	at org.apache.lucene.util.AbstractBeforeAfterRule$1.evaluate(AbstractBeforeAfterRule.java:45)
	at org.apache.lucene.util.TestRuleThreadAndTestName$1.evaluate(TestRuleThreadAndTestName.java:48)
	at org.apache.lucene.util.TestRuleIgnoreAfterMaxFailures$1.evaluate(TestRuleIgnoreAfterMaxFailures.java:64)
	at org.apache.lucene.util.TestRuleMarkFailure$1.evaluate(TestRuleMarkFailure.java:47)
	at com.carrotsearch.randomizedtesting.rules.StatementAdapter.evaluate(StatementAdapter.java:36)
	at com.carrotsearch.randomizedtesting.ThreadLeakControl$StatementRunner.run(ThreadLeakControl.java:367)
	at com.carrotsearch.randomizedtesting.ThreadLeakControl.forkTimeoutingTask(ThreadLeakControl.java:809)
	at com.carrotsearch.randomizedtesting.ThreadLeakControl$3.evaluate(ThreadLeakControl.java:460)
	at com.carrotsearch.randomizedtesting.RandomizedRunner.runSingleTest(RandomizedRunner.java:880)
	at com.carrotsearch.randomizedtesting.RandomizedRunner$5.evaluate(RandomizedRunner.java:781)
	at com.carrotsearch.randomizedtesting.RandomizedRunner$6.evaluate(RandomizedRunner.java:816)
	at com.carrotsearch.randomizedtesting.RandomizedRunner$7.evaluate(RandomizedRunner.java:827)
	at org.apache.lucene.util.AbstractBeforeAfterRule$1.evaluate(AbstractBeforeAfterRule.java:45)
	at com.carrotsearch.randomizedtesting.rules.StatementAdapter.evaluate(StatementAdapter.java:36)
	at org.apache.lucene.util.TestRuleStoreClassName$1.evaluate(TestRuleStoreClassName.java:41)
	at com.carrotsearch.randomizedtesting.rules.NoShadowingOrOverridesOnMethodsRule$1.evaluate(NoShadowingOrOverridesOnMethodsRule.java:40)
	at com.carrotsearch.randomizedtesting.rules.NoShadowingOrOverridesOnMethodsRule$1.evaluate(NoShadowingOrOverridesOnMethodsRule.java:40)
	at com.carrotsearch.randomizedtesting.rules.StatementAdapter.evaluate(StatementAdapter.java:36)
	at com.carrotsearch.randomizedtesting.rules.StatementAdapter.evaluate(StatementAdapter.java:36)
	at com.carrotsearch.randomizedtesting.rules.StatementAdapter.evaluate(StatementAdapter.java:36)
	at org.apache.lucene.util.TestRuleAssertionsRequired$1.evaluate(TestRuleAssertionsRequired.java:53)
	at org.apache.lucene.util.TestRuleMarkFailure$1.evaluate(TestRuleMarkFailure.java:47)
	at org.apache.lucene.util.TestRuleIgnoreAfterMaxFailures$1.evaluate(TestRuleIgnoreAfterMaxFailures.java:64)
	at org.apache.lucene.util.TestRuleIgnoreTestSuites$1.evaluate(TestRuleIgnoreTestSuites.java:54)
	at com.carrotsearch.randomizedtesting.rules.StatementAdapter.evaluate(StatementAdapter.java:36)
	at com.carrotsearch.randomizedtesting.ThreadLeakControl$StatementRunner.run(ThreadLeakControl.java:367)
	at java.lang.Thread.run(Thread.java:745)




Build Log:
[...truncated 6010 lines...]
   [junit4] Suite: org.apache.lucene.codecs.simpletext.TestSimpleTextPointFormat
   [junit4] IGNOR/A 0.00s J1 | TestSimpleTextPointFormat.testRandomBinaryBig
   [junit4]    > Assumption #1: 'nightly' test group is disabled (@Nightly())
   [junit4] IGNOR/A 0.00s J1 | TestSimpleTextPointFormat.testMergeStability
   [junit4]    > Assumption #1: merge is not stable
   [junit4]   2> NOTE: reproduce with: ant test  -Dtestcase=TestSimpleTextPointFormat -Dtests.method=testAllPointDocsDeletedInSegment -Dtests.seed=F8C2685BD7041ECA -Dtests.slow=true -Dtests.locale=es-VE -Dtests.timezone=Africa/Asmara -Dtests.asserts=true -Dtests.file.encoding=Cp1252
   [junit4] ERROR   0.01s J1 | TestSimpleTextPointFormat.testAllPointDocsDeletedInSegment <<<
   [junit4]    > Throwable #1: org.apache.lucene.index.CorruptIndexException: SimpleText failure: footer does not start at expected position current=30 vs expected=0 (resource=BufferedChecksumIndexInput(MockIndexInputWrapper(RAMInputStream(name=RAMInputStream(name=_1.scf) [slice=_1.dim]))))
   [junit4]    > 	at __randomizedtesting.SeedInfo.seed([F8C2685BD7041ECA:CDC7C6F54F25A30A]:0)
   [junit4]    > 	at org.apache.lucene.codecs.simpletext.SimpleTextPointReader.checkIntegrity(SimpleTextPointReader.java:214)
   [junit4]    > 	at org.apache.lucene.index.CodecReader.checkIntegrity(CodecReader.java:398)
   [junit4]    > 	at org.apache.lucene.index.CheckIndex.checkIndex(CheckIndex.java:676)
   [junit4]    > 	at org.apache.lucene.util.TestUtil.checkIndex(TestUtil.java:300)
   [junit4]    > 	at org.apache.lucene.store.MockDirectoryWrapper.close(MockDirectoryWrapper.java:848)
   [junit4]    > 	at org.apache.lucene.util.IOUtils.close(IOUtils.java:89)
   [junit4]    > 	at org.apache.lucene.util.IOUtils.close(IOUtils.java:76)
   [junit4]    > 	at org.apache.lucene.index.BasePointFormatTestCase.testAllPointDocsDeletedInSegment(BasePointFormatTestCase.java:192)
   [junit4]    > 	at java.lang.Thread.run(Thread.java:745)
   [junit4]   2> NOTE: leaving temporary files on disk at: C:\Users\JenkinsSlave\workspace\Lucene-Solr-6.x-Windows\lucene\build\codecs\test\J1\temp\lucene.codecs.simpletext.TestSimpleTextPointFormat_F8C2685BD7041ECA-001
   [junit4]   2> NOTE: test params are: codec=Asserting(Lucene60): {}, docValues:{}, maxPointsInLeafNode=385, maxMBSortInHeap=4.943779979102869, sim=ClassicSimilarity, locale=es-VE, timezone=Africa/Asmara
   [junit4]   2> NOTE: Windows 7 6.1 amd64/Oracle Corporation 1.8.0_72 (64-bit)/cpus=3,threads=1,free=42259928,total=99618816
   [junit4]   2> NOTE: All tests run in this JVM: [TestVarGapFixedIntervalPostingsFormat, TestDirectDocValuesFormat, TestMemoryPostingsFormat, TestSimpleTextCompoundFormat, TestBloomPostingsFormat, TestAutoPrefixTerms, TestSimpleTextDocValuesFormat, TestDirectPostingsFormat, TestSimpleTextFieldInfoFormat, TestSimpleTextNormsFormat, TestSimpleTextPointFormat]
   [junit4] Completed [22/22 (1!)] on J1 in 10.81s, 16 tests, 1 error, 2 skipped <<< FAILURES!

[...truncated 10 lines...]
BUILD FAILED
C:\Users\JenkinsSlave\workspace\Lucene-Solr-6.x-Windows\build.xml:740: The following error occurred while executing this line:
C:\Users\JenkinsSlave\workspace\Lucene-Solr-6.x-Windows\build.xml:684: The following error occurred while executing this line:
C:\Users\JenkinsSlave\workspace\Lucene-Solr-6.x-Windows\build.xml:59: The following error occurred while executing this line:
C:\Users\JenkinsSlave\workspace\Lucene-Solr-6.x-Windows\lucene\build.xml:476: The following error occurred while executing this line:
C:\Users\JenkinsSlave\workspace\Lucene-Solr-6.x-Windows\lucene\common-build.xml:2187: The following error occurred while executing this line:
C:\Users\JenkinsSlave\workspace\Lucene-Solr-6.x-Windows\lucene\module-build.xml:58: The following error occurred while executing this line:
C:\Users\JenkinsSlave\workspace\Lucene-Solr-6.x-Windows\lucene\common-build.xml:1457: The following error occurred while executing this line:
C:\Users\JenkinsSlave\workspace\Lucene-Solr-6.x-Windows\lucene\common-build.xml:1014: There were test failures: 22 suites, 662 tests, 1 error, 29 ignored (29 assumptions) [seed: F8C2685BD7041ECA]

Total time: 13 minutes 26 seconds
Build step 'Invoke Ant' marked build as failure
Archiving artifacts
[WARNINGS] Skipping publisher since build result is FAILURE
Recording test results
Email was triggered for: Failure - Any
Sending email for trigger: Failure - Any



[JENKINS] Lucene-Solr-6.x-Windows (32bit/jdk1.8.0_72) - Build # 10 - Still Failing!

Posted by Policeman Jenkins Server <je...@thetaphi.de>.
Build: http://jenkins.thetaphi.de/job/Lucene-Solr-6.x-Windows/10/
Java: 32bit/jdk1.8.0_72 -server -XX:+UseG1GC

1 tests failed.
FAILED:  org.apache.lucene.codecs.simpletext.TestSimpleTextPointFormat.testAllPointDocsDeletedInSegment

Error Message:
SimpleText failure: footer does not start at expected position current=30 vs expected=0 (resource=BufferedChecksumIndexInput(MockIndexInputWrapper(RAMInputStream(name=RAMInputStream(name=_1.scf) [slice=_1.dim]))))

Stack Trace:
org.apache.lucene.index.CorruptIndexException: SimpleText failure: footer does not start at expected position current=30 vs expected=0 (resource=BufferedChecksumIndexInput(MockIndexInputWrapper(RAMInputStream(name=RAMInputStream(name=_1.scf) [slice=_1.dim]))))
	at __randomizedtesting.SeedInfo.seed([58CB0912E5F23AE:30891E3FB67E9E6E]:0)
	at org.apache.lucene.codecs.simpletext.SimpleTextPointReader.checkIntegrity(SimpleTextPointReader.java:214)
	at org.apache.lucene.index.CodecReader.checkIntegrity(CodecReader.java:398)
	at org.apache.lucene.index.CheckIndex.checkIndex(CheckIndex.java:676)
	at org.apache.lucene.util.TestUtil.checkIndex(TestUtil.java:300)
	at org.apache.lucene.store.MockDirectoryWrapper.close(MockDirectoryWrapper.java:848)
	at org.apache.lucene.util.IOUtils.close(IOUtils.java:89)
	at org.apache.lucene.util.IOUtils.close(IOUtils.java:76)
	at org.apache.lucene.index.BasePointFormatTestCase.testAllPointDocsDeletedInSegment(BasePointFormatTestCase.java:192)
	at sun.reflect.NativeMethodAccessorImpl.invoke0(Native Method)
	at sun.reflect.NativeMethodAccessorImpl.invoke(NativeMethodAccessorImpl.java:62)
	at sun.reflect.DelegatingMethodAccessorImpl.invoke(DelegatingMethodAccessorImpl.java:43)
	at java.lang.reflect.Method.invoke(Method.java:498)
	at com.carrotsearch.randomizedtesting.RandomizedRunner.invoke(RandomizedRunner.java:1764)
	at com.carrotsearch.randomizedtesting.RandomizedRunner$8.evaluate(RandomizedRunner.java:871)
	at com.carrotsearch.randomizedtesting.RandomizedRunner$9.evaluate(RandomizedRunner.java:907)
	at com.carrotsearch.randomizedtesting.RandomizedRunner$10.evaluate(RandomizedRunner.java:921)
	at org.apache.lucene.util.TestRuleSetupTeardownChained$1.evaluate(TestRuleSetupTeardownChained.java:49)
	at org.apache.lucene.util.AbstractBeforeAfterRule$1.evaluate(AbstractBeforeAfterRule.java:45)
	at org.apache.lucene.util.TestRuleThreadAndTestName$1.evaluate(TestRuleThreadAndTestName.java:48)
	at org.apache.lucene.util.TestRuleIgnoreAfterMaxFailures$1.evaluate(TestRuleIgnoreAfterMaxFailures.java:64)
	at org.apache.lucene.util.TestRuleMarkFailure$1.evaluate(TestRuleMarkFailure.java:47)
	at com.carrotsearch.randomizedtesting.rules.StatementAdapter.evaluate(StatementAdapter.java:36)
	at com.carrotsearch.randomizedtesting.ThreadLeakControl$StatementRunner.run(ThreadLeakControl.java:367)
	at com.carrotsearch.randomizedtesting.ThreadLeakControl.forkTimeoutingTask(ThreadLeakControl.java:809)
	at com.carrotsearch.randomizedtesting.ThreadLeakControl$3.evaluate(ThreadLeakControl.java:460)
	at com.carrotsearch.randomizedtesting.RandomizedRunner.runSingleTest(RandomizedRunner.java:880)
	at com.carrotsearch.randomizedtesting.RandomizedRunner$5.evaluate(RandomizedRunner.java:781)
	at com.carrotsearch.randomizedtesting.RandomizedRunner$6.evaluate(RandomizedRunner.java:816)
	at com.carrotsearch.randomizedtesting.RandomizedRunner$7.evaluate(RandomizedRunner.java:827)
	at org.apache.lucene.util.AbstractBeforeAfterRule$1.evaluate(AbstractBeforeAfterRule.java:45)
	at com.carrotsearch.randomizedtesting.rules.StatementAdapter.evaluate(StatementAdapter.java:36)
	at org.apache.lucene.util.TestRuleStoreClassName$1.evaluate(TestRuleStoreClassName.java:41)
	at com.carrotsearch.randomizedtesting.rules.NoShadowingOrOverridesOnMethodsRule$1.evaluate(NoShadowingOrOverridesOnMethodsRule.java:40)
	at com.carrotsearch.randomizedtesting.rules.NoShadowingOrOverridesOnMethodsRule$1.evaluate(NoShadowingOrOverridesOnMethodsRule.java:40)
	at com.carrotsearch.randomizedtesting.rules.StatementAdapter.evaluate(StatementAdapter.java:36)
	at com.carrotsearch.randomizedtesting.rules.StatementAdapter.evaluate(StatementAdapter.java:36)
	at com.carrotsearch.randomizedtesting.rules.StatementAdapter.evaluate(StatementAdapter.java:36)
	at org.apache.lucene.util.TestRuleAssertionsRequired$1.evaluate(TestRuleAssertionsRequired.java:53)
	at org.apache.lucene.util.TestRuleMarkFailure$1.evaluate(TestRuleMarkFailure.java:47)
	at org.apache.lucene.util.TestRuleIgnoreAfterMaxFailures$1.evaluate(TestRuleIgnoreAfterMaxFailures.java:64)
	at org.apache.lucene.util.TestRuleIgnoreTestSuites$1.evaluate(TestRuleIgnoreTestSuites.java:54)
	at com.carrotsearch.randomizedtesting.rules.StatementAdapter.evaluate(StatementAdapter.java:36)
	at com.carrotsearch.randomizedtesting.ThreadLeakControl$StatementRunner.run(ThreadLeakControl.java:367)
	at java.lang.Thread.run(Thread.java:745)




Build Log:
[...truncated 5931 lines...]
   [junit4] Suite: org.apache.lucene.codecs.simpletext.TestSimpleTextPointFormat
   [junit4]   2> NOTE: reproduce with: ant test  -Dtestcase=TestSimpleTextPointFormat -Dtests.method=testAllPointDocsDeletedInSegment -Dtests.seed=58CB0912E5F23AE -Dtests.slow=true -Dtests.locale=es-EC -Dtests.timezone=Africa/Sao_Tome -Dtests.asserts=true -Dtests.file.encoding=US-ASCII
   [junit4] ERROR   0.05s J0 | TestSimpleTextPointFormat.testAllPointDocsDeletedInSegment <<<
   [junit4]    > Throwable #1: org.apache.lucene.index.CorruptIndexException: SimpleText failure: footer does not start at expected position current=30 vs expected=0 (resource=BufferedChecksumIndexInput(MockIndexInputWrapper(RAMInputStream(name=RAMInputStream(name=_1.scf) [slice=_1.dim]))))
   [junit4]    > 	at __randomizedtesting.SeedInfo.seed([58CB0912E5F23AE:30891E3FB67E9E6E]:0)
   [junit4]    > 	at org.apache.lucene.codecs.simpletext.SimpleTextPointReader.checkIntegrity(SimpleTextPointReader.java:214)
   [junit4]    > 	at org.apache.lucene.index.CodecReader.checkIntegrity(CodecReader.java:398)
   [junit4]    > 	at org.apache.lucene.index.CheckIndex.checkIndex(CheckIndex.java:676)
   [junit4]    > 	at org.apache.lucene.util.TestUtil.checkIndex(TestUtil.java:300)
   [junit4]    > 	at org.apache.lucene.store.MockDirectoryWrapper.close(MockDirectoryWrapper.java:848)
   [junit4]    > 	at org.apache.lucene.util.IOUtils.close(IOUtils.java:89)
   [junit4]    > 	at org.apache.lucene.util.IOUtils.close(IOUtils.java:76)
   [junit4]    > 	at org.apache.lucene.index.BasePointFormatTestCase.testAllPointDocsDeletedInSegment(BasePointFormatTestCase.java:192)
   [junit4]    > 	at java.lang.Thread.run(Thread.java:745)
   [junit4] IGNOR/A 0.01s J0 | TestSimpleTextPointFormat.testRandomBinaryBig
   [junit4]    > Assumption #1: 'nightly' test group is disabled (@Nightly())
   [junit4] IGNOR/A 0.03s J0 | TestSimpleTextPointFormat.testMergeStability
   [junit4]    > Assumption #1: merge is not stable
   [junit4]   2> NOTE: leaving temporary files on disk at: C:\Users\JenkinsSlave\workspace\Lucene-Solr-6.x-Windows\lucene\build\codecs\test\J0\temp\lucene.codecs.simpletext.TestSimpleTextPointFormat_58CB0912E5F23AE-001
   [junit4]   2> NOTE: test params are: codec=Asserting(Lucene60): {}, docValues:{}, maxPointsInLeafNode=273, maxMBSortInHeap=5.667283643126551, sim=ClassicSimilarity, locale=es-EC, timezone=Africa/Sao_Tome
   [junit4]   2> NOTE: Windows 7 6.1 x86/Oracle Corporation 1.8.0_72 (32-bit)/cpus=3,threads=1,free=68550072,total=253755392
   [junit4]   2> NOTE: All tests run in this JVM: [TestSimpleTextTermVectorsFormat, TestFixedGapPostingsFormat, TestSimpleTextFieldInfoFormat, TestOrdsBlockTree, TestMemoryDocValuesFormat, TestSimpleTextPointFormat]
   [junit4] Completed [13/22 (1!)] on J0 in 16.85s, 16 tests, 1 error, 2 skipped <<< FAILURES!

[...truncated 87 lines...]
BUILD FAILED
C:\Users\JenkinsSlave\workspace\Lucene-Solr-6.x-Windows\build.xml:740: The following error occurred while executing this line:
C:\Users\JenkinsSlave\workspace\Lucene-Solr-6.x-Windows\build.xml:684: The following error occurred while executing this line:
C:\Users\JenkinsSlave\workspace\Lucene-Solr-6.x-Windows\build.xml:59: The following error occurred while executing this line:
C:\Users\JenkinsSlave\workspace\Lucene-Solr-6.x-Windows\lucene\build.xml:476: The following error occurred while executing this line:
C:\Users\JenkinsSlave\workspace\Lucene-Solr-6.x-Windows\lucene\common-build.xml:2187: The following error occurred while executing this line:
C:\Users\JenkinsSlave\workspace\Lucene-Solr-6.x-Windows\lucene\module-build.xml:58: The following error occurred while executing this line:
C:\Users\JenkinsSlave\workspace\Lucene-Solr-6.x-Windows\lucene\common-build.xml:1457: The following error occurred while executing this line:
C:\Users\JenkinsSlave\workspace\Lucene-Solr-6.x-Windows\lucene\common-build.xml:1014: There were test failures: 22 suites, 662 tests, 1 error, 29 ignored (29 assumptions) [seed: 58CB0912E5F23AE]

Total time: 16 minutes 45 seconds
Build step 'Invoke Ant' marked build as failure
Archiving artifacts
[WARNINGS] Skipping publisher since build result is FAILURE
Recording test results
Email was triggered for: Failure - Any
Sending email for trigger: Failure - Any