You are viewing a plain text version of this content. The canonical link for it is here.
Posted to dev@river.apache.org by Apache Jenkins Server <je...@builds.apache.org> on 2013/02/23 00:35:42 UTC
Build failed in Jenkins: river-qa-refactor-jdk7 #22
See <https://builds.apache.org/job/river-qa-refactor-jdk7/22/changes>
Changes:
[peter_firmstone] Refactoring of PreferredClassProvider and PreferredClassLoader, fixed ClassServer freeze when SecurityException is thrown.
Fixed SetLocatorsReplaceSome test when it inadvertantly gets an IP host instead of a string, which breaks the test.
[peter_firmstone] Refactoring of PreferredClassProvider and PreferredClassLoader, fixed ClassServer freeze when SecurityException is thrown.
Fixed SetLocatorsReplaceSome test when it inadvertantly gets an IP host instead of a string, which breaks the test.
[peter_firmstone] Reduce unnecessary locking, in an attempt to avoid ClassLoader deadlock on Freebsd.
------------------------------------------
[...truncated 8836 lines...]
[java] -----------------------------------------
[java] com/sun/jini/test/spec/javaspace/conformance/snapshot/SnapshotTransactionTakeIfExistsTest.td
[java] Test Passed: OK
[java]
[java] -----------------------------------------
[java] com/sun/jini/test/spec/javaspace/conformance/snapshot/SnapshotTransactionTakeIfExistsWaitTest.td
[java] Test Passed: OK
[java]
[java] -----------------------------------------
[java] com/sun/jini/test/spec/javaspace/conformance/snapshot/SnapshotTransactionTakeNO_WAITTest.td
[java] Test Passed: OK
[java]
[java] -----------------------------------------
[java] com/sun/jini/test/spec/javaspace/conformance/snapshot/SnapshotTransactionTakeReadTest.td
[java] Test Passed: OK
[java]
[java] -----------------------------------------
[java] com/sun/jini/test/spec/javaspace/conformance/snapshot/SnapshotTransactionTakeTest.td
[java] Test Passed: OK
[java]
[java] -----------------------------------------
[java] com/sun/jini/test/spec/javaspace/conformance/snapshot/SnapshotTransactionTakeWaitTest.td
[java] Test Passed: OK
[java]
[java] -----------------------------------------
[java] com/sun/jini/test/spec/javaspace/conformance/snapshot/SnapshotTransactionWriteLeaseANYTest.td
[java] Test Passed: OK
[java]
[java] -----------------------------------------
[java] com/sun/jini/test/spec/javaspace/conformance/snapshot/SnapshotTransactionWriteLeaseFOREVERTest.td
[java] Test Passed: OK
[java]
[java] -----------------------------------------
[java] com/sun/jini/test/spec/javaspace/conformance/snapshot/SnapshotTransactionWriteNegativeLeaseTest.td
[java] Test Passed: OK
[java]
[java] -----------------------------------------
[java] com/sun/jini/test/spec/javaspace/conformance/snapshot/SnapshotTransactionWriteTakeIfExistsNotifyTest.td
[java] Test Passed: OK
[java]
[java] -----------------------------------------
[java] com/sun/jini/test/spec/javaspace/conformance/snapshot/SnapshotTransactionWriteTakeIfExistsTest.td
[java] Test Passed: OK
[java]
[java] -----------------------------------------
[java] com/sun/jini/test/spec/javaspace/conformance/snapshot/SnapshotTransactionWriteTakeNotifyTest.td
[java] Test Passed: OK
[java]
[java] -----------------------------------------
[java] com/sun/jini/test/spec/javaspace/conformance/snapshot/SnapshotTransactionWriteTakeTest.td
[java] Test Passed: OK
[java]
[java] -----------------------------------------
[java] com/sun/jini/test/spec/javaspace/conformance/snapshot/SnapshotTransactionWriteTest.td
[java] Test Passed: OK
[java]
[java] -----------------------------------------
[java] com/sun/jini/test/spec/javaspace/conformance/snapshot/SnapshotWriteLeaseANYTest.td
[java] Test Passed: OK
[java]
[java] -----------------------------------------
[java] com/sun/jini/test/spec/javaspace/conformance/snapshot/SnapshotWriteLeaseFOREVERTest.td
[java] Test Passed: OK
[java]
[java] -----------------------------------------
[java] com/sun/jini/test/spec/javaspace/conformance/snapshot/SnapshotWriteNegativeLeaseTest.td
[java] Test Passed: OK
[java]
[java] -----------------------------------------
[java] com/sun/jini/test/spec/javaspace/conformance/snapshot/SnapshotWriteTest.td
[java] Test Passed: OK
[java]
[java] -----------------------------------------
[java] com/sun/jini/test/impl/mahalo/AdminIFShutdownTest.td
[java] Test Passed: OK
[java]
[java] -----------------------------------------
[java] com/sun/jini/test/impl/mahalo/AdminIFTest.td
[java] Test Passed: OK
[java]
[java] -----------------------------------------
[java] com/sun/jini/test/impl/mahalo/LeaseExpireCancelTest.td
[java] Test Passed: OK
[java]
[java] -----------------------------------------
[java] com/sun/jini/test/impl/mahalo/LeaseExpireRenewTest.td
[java] Test Passed: OK
[java]
[java] -----------------------------------------
[java] com/sun/jini/test/impl/mahalo/LeaseMapTest.td
[java] Test Passed: OK
[java]
[java] -----------------------------------------
[java] com/sun/jini/test/impl/mahalo/LeaseTest.td
[java] Test Passed: OK
[java]
[java] -----------------------------------------
[java] com/sun/jini/test/impl/mahalo/MahaloCreateShutdownTest.td
[java] Test Passed: OK
[java]
[java] -----------------------------------------
[java] com/sun/jini/test/impl/mahalo/MahaloIFTest.td
[java] Test Passed: OK
[java]
[java] -----------------------------------------
[java] com/sun/jini/test/impl/mahalo/MahaloImplReadyStateTest.td
[java] Test Skipped: verifiers are: com.sun.jini.test.impl.mercury.ActivatableMercuryVerifier com.sun.jini.qa.harness.SkipConfigTestVerifier
[java] -----------------------------------------
[java] com/sun/jini/test/impl/mahalo/NestableServerTransactionCreatedToStringTest.td
[java] Test Passed: OK
[java]
[java] -----------------------------------------
[java] com/sun/jini/test/impl/mahalo/NestableTransactionCreatedToStringTest.td
[java] Test Passed: OK
[java]
[java] -----------------------------------------
[java] com/sun/jini/test/impl/mahalo/PrepareAndCommitExceptionTest.td
[java] Test Passed: OK
[java]
[java] -----------------------------------------
[java] com/sun/jini/test/impl/mahalo/PrepareAndCommitExceptionTest2.td
[java] Test Passed: OK
[java]
[java] -----------------------------------------
[java] com/sun/jini/test/impl/mahalo/PrepareAndCommitExceptionTest3.td
[java] Test Passed: OK
[java]
[java] -----------------------------------------
[java] com/sun/jini/test/impl/mahalo/PrepareAndCommitExceptionTest4.td
[java] Test Passed: OK
[java]
[java] -----------------------------------------
[java] com/sun/jini/test/impl/mahalo/PrepareAndCommitExceptionTest5.td
[java] Test Passed: OK
[java]
[java] -----------------------------------------
[java] com/sun/jini/test/impl/mahalo/RandomStressTest.td
[java] Test Passed: OK
[java]
[java] -----------------------------------------
[java] com/sun/jini/test/impl/mahalo/ServerTransactionEqualityTest.td
[java] Test Passed: OK
[java]
[java] -----------------------------------------
[java] com/sun/jini/test/impl/mahalo/ServerTransactionToStringTest.td
[java] Test Passed: OK
[java]
[java] -----------------------------------------
[java] com/sun/jini/test/impl/mahalo/TransactionCreatedToStringTest.td
[java] Test Passed: OK
[java]
[java] -----------------------------------------
[java] com/sun/jini/test/impl/mahalo/TransactionManagerCreatedToStringTest.td
[java] Test Passed: OK
[java]
[java] -----------------------------------------
[java] com/sun/jini/test/impl/mahalo/TxnMgrImplNullActivationConfigEntries.td
[java] Test Skipped: verifiers are: com.sun.jini.test.impl.mahalo.ActivatableMahaloVerifier
[java] -----------------------------------------
[java] com/sun/jini/test/impl/mahalo/TxnMgrImplNullConfigEntries.td
[java] Test Passed: OK
[java]
[java] -----------------------------------------
[java] com/sun/jini/test/impl/mahalo/TxnMgrImplNullRecoveredLocators.td
[java] Test Skipped: verifiers are: com.sun.jini.test.impl.mahalo.ActivatableMahaloVerifier
[java] -----------------------------------------
[java] com/sun/jini/test/impl/mahalo/TxnMgrProxyEqualityTest.td
[java] Test Passed: OK
[java]
[java] -----------------------------------------
[java] com/sun/jini/test/spec/txnmanager/AsynchAbortOnCommitTest.td
[java] Test Passed: OK
[java]
[java] -----------------------------------------
[java] com/sun/jini/test/spec/txnmanager/AsynchAbortOnPrepareTest.td
[java] Test Passed: OK
[java]
[java] -----------------------------------------
[java] com/sun/jini/test/spec/txnmanager/CommitExpiredTest.td
[java] Test Passed: OK
[java]
[java] -----------------------------------------
[java] com/sun/jini/test/spec/txnmanager/CommitTimeoutTest.td
[java] Test Passed: OK
[java]
[java] -----------------------------------------
[java] com/sun/jini/test/spec/txnmanager/GetStateTest.td
[java] Test Passed: OK
[java]
[java] -----------------------------------------
[java] com/sun/jini/test/spec/txnmanager/JoinIdempotentTest.td
[java] Test Passed: OK
[java]
[java] -----------------------------------------
[java] com/sun/jini/test/spec/txnmanager/JoinWhileActiveTest.td
[java] Test Passed: OK
[java]
[java] -----------------------------------------
[java] com/sun/jini/test/spec/txnmanager/ManyParticipantsTest.td
[java] Test Passed: OK
[java]
[java] -----------------------------------------
[java] com/sun/jini/test/spec/txnmanager/PrepareTimeoutTest.td
[java] Test Passed: OK
[java]
[java] -----------------------------------------
[java] com/sun/jini/test/spec/txnmanager/RollBackErrorTest.td
[java] Test Passed: OK
[java]
[java] -----------------------------------------
[java] com/sun/jini/test/spec/txnmanager/RollForwardErrorTest.td
[java] Test Passed: OK
[java]
[java] -----------------------------------------
[java] com/sun/jini/test/spec/txnmanager/TwoPhaseTest.td
[java] Test Passed: OK
[java]
[java] -----------------------------------------
[java]
[java] # of tests started = 1411
[java] # of tests completed = 1411
[java] # of tests skipped = 47
[java] # of tests passed = 1408
[java] # of tests failed = 3
[java]
[java] -----------------------------------------
[java]
[java] Date finished:
[java] Fri Feb 22 23:34:55 UTC 2013
[java] Time elapsed:
[java] 64930 seconds
[java]
[java] Java Result: 1
collect-result:
[copy] Copying 1 file to <https://builds.apache.org/job/river-qa-refactor-jdk7/ws/trunk/qa/result>
[copy] Copying 1 file to <https://builds.apache.org/job/river-qa-refactor-jdk7/ws/trunk/qa/result>
[zip] Building zip: <https://builds.apache.org/job/river-qa-refactor-jdk7/22/artifact/trunk/qa/result/qaresults-amd64-Linux-1.7.0_04.zip>
BUILD FAILED
<https://builds.apache.org/job/river-qa-refactor-jdk7/ws/trunk/build.xml>:2093: The following error occurred while executing this line:
<https://builds.apache.org/job/river-qa-refactor-jdk7/ws/trunk/qa/build.xml>:406: The following error occurred while executing this line:
<https://builds.apache.org/job/river-qa-refactor-jdk7/ws/trunk/qa/build.xml>:380: condition satisfied
Total time: 1090 minutes 18 seconds
Build step 'Invoke Ant' marked build as failure
[locks-and-latches] Releasing all the locks
[locks-and-latches] All the locks released
Archiving artifacts
Build failed in Jenkins: river-qa-refactor-jdk7 #25
Posted by Apache Jenkins Server <je...@builds.apache.org>.
See <https://builds.apache.org/job/river-qa-refactor-jdk7/25/changes>
Changes:
[peter_firmstone] RIVER-416
[peter_firmstone] RIVER-416
[peter_firmstone] Attempt to fix another failing javaspace test
com/sun/jini/test/spec/javaspace/conformance/ExpirationNotifyTest.td
[java] Test Failed: Test Failed: com.sun.jini.qa.harness.TestException: Not all listeners've got expected number of events.
------------------------------------------
[...truncated 1184 lines...]
are-passwords-available:
password:
[echo] creating passwords
truststore:
[exec] Certificate was added to keystore
[exec] Certificate was added to keystore
[exec] Certificate was added to keystore
[exec] Certificate was added to keystore
[exec] Certificate was added to keystore
[exec] Certificate was added to keystore
[exec] Certificate was added to keystore
[exec] Certificate was added to keystore
[exec] Certificate was added to keystore
trust:
qaman.jar:
[jar] Building jar: <https://builds.apache.org/job/river-qa-refactor-jdk7/ws/trunk/qa/lib/qaman.jar>
mergedpolicyprovider.jar:
[jar] Building jar: <https://builds.apache.org/job/river-qa-refactor-jdk7/ws/trunk/qa/lib-ext/mergedpolicyprovider.jar>
nonactivatablegroup.jar:
[jar] Building jar: <https://builds.apache.org/job/river-qa-refactor-jdk7/ws/trunk/qa/lib/nonactivatablegroup.jar>
nonactivatablegroup-dl.jar:
[jar] Building jar: <https://builds.apache.org/job/river-qa-refactor-jdk7/ws/trunk/qa/lib/nonactivatablegroup-dl.jar>
harness-killer.jar:
[jar] Building jar: <https://builds.apache.org/job/river-qa-refactor-jdk7/ws/trunk/qa/lib/harness-killer.jar>
harness-killer-dl.jar:
[jar] Building jar: <https://builds.apache.org/job/river-qa-refactor-jdk7/ws/trunk/qa/lib/harness-killer-dl.jar>
jiniharness.jar:
[jar] Building jar: <https://builds.apache.org/job/river-qa-refactor-jdk7/ws/trunk/qa/lib/jiniharness.jar>
harness-jars:
qa1-end2end.jar:
[jar] Building jar: <https://builds.apache.org/job/river-qa-refactor-jdk7/ws/trunk/qa/lib/qa1-end2end.jar>
qa1-fiddler-dl.jar:
[jar] Building jar: <https://builds.apache.org/job/river-qa-refactor-jdk7/ws/trunk/qa/lib/qa1-fiddler-dl.jar>
qa1-joinmanager-dl.jar:
[jar] Building jar: <https://builds.apache.org/job/river-qa-refactor-jdk7/ws/trunk/qa/lib/qa1-joinmanager-dl.jar>
qa1-mahalo-dl.jar:
[jar] Building jar: <https://builds.apache.org/job/river-qa-refactor-jdk7/ws/trunk/qa/lib/qa1-mahalo-dl.jar>
qa1-mercury.jar:
[jar] Building jar: <https://builds.apache.org/job/river-qa-refactor-jdk7/ws/trunk/qa/lib/qa1-mercury.jar>
[jar] Updating jar: <https://builds.apache.org/job/river-qa-refactor-jdk7/ws/trunk/qa/lib/qa1-mercury.jar>
qa1-mercury-dl.jar:
[jar] Building jar: <https://builds.apache.org/job/river-qa-refactor-jdk7/ws/trunk/qa/lib/qa1-mercury-dl.jar>
[jar] Updating jar: <https://builds.apache.org/job/river-qa-refactor-jdk7/ws/trunk/qa/lib/qa1-mercury-dl.jar>
qa1-mercury-bogusimpl.jar:
[jar] Building jar: <https://builds.apache.org/job/river-qa-refactor-jdk7/ws/trunk/qa/lib/qa1-mercury-bogusimpl.jar>
qa1-wrapper.jar:
[jar] Building jar: <https://builds.apache.org/job/river-qa-refactor-jdk7/ws/trunk/qa/lib/qa1-wrapper.jar>
qa1-norm-dl.jar:
[jar] Building jar: <https://builds.apache.org/job/river-qa-refactor-jdk7/ws/trunk/qa/lib/qa1-norm-dl.jar>
qa1-outrigger-dl.jar:
[jar] Building jar: <https://builds.apache.org/job/river-qa-refactor-jdk7/ws/trunk/qa/lib/qa1-outrigger-dl.jar>
qa1-multihomedmetainf.jar:
[jar] Building jar: <https://builds.apache.org/job/river-qa-refactor-jdk7/ws/trunk/qa/lib/qa1-multihomedmetainf.jar>
jinitests:
[jar] Building jar: <https://builds.apache.org/job/river-qa-refactor-jdk7/ws/trunk/qa/lib/jinitests.jar>
[jar] Updating jar: <https://builds.apache.org/job/river-qa-refactor-jdk7/ws/trunk/qa/lib/jinitests.jar>
[jar] Updating jar: <https://builds.apache.org/job/river-qa-refactor-jdk7/ws/trunk/qa/lib/jinitests.jar>
jinitests.jar:
qa1-mainwrapper.jar:
[jar] Building jar: <https://builds.apache.org/job/river-qa-refactor-jdk7/ws/trunk/qa/lib/qa1-mainwrapper.jar>
qa1-start-cb1.jar:
[jar] Building jar: <https://builds.apache.org/job/river-qa-refactor-jdk7/ws/trunk/qa/lib/qa1-start-cb1.jar>
qa1-start-cb2.jar:
[jar] Building jar: <https://builds.apache.org/job/river-qa-refactor-jdk7/ws/trunk/qa/lib/qa1-start-cb2.jar>
qa1-start-cb3.jar:
[jar] Building jar: <https://builds.apache.org/job/river-qa-refactor-jdk7/ws/trunk/qa/lib/qa1-start-cb3.jar>
qa1-start-probe.jar:
[jar] Building jar: <https://builds.apache.org/job/river-qa-refactor-jdk7/ws/trunk/qa/lib/qa1-start-probe.jar>
qa1-start-probe-dl.jar:
[jar] Building jar: <https://builds.apache.org/job/river-qa-refactor-jdk7/ws/trunk/qa/lib/qa1-start-probe-dl.jar>
qa1-start-tests.jar:
[jar] Building jar: <https://builds.apache.org/job/river-qa-refactor-jdk7/ws/trunk/qa/lib/qa1-start-tests.jar>
[jar] Updating jar: <https://builds.apache.org/job/river-qa-refactor-jdk7/ws/trunk/qa/lib/qa1-start-tests.jar>
qa1-start-testservice1.jar:
[jar] Building jar: <https://builds.apache.org/job/river-qa-refactor-jdk7/ws/trunk/qa/lib/qa1-start-testservice1.jar>
[jar] Updating jar: <https://builds.apache.org/job/river-qa-refactor-jdk7/ws/trunk/qa/lib/qa1-start-testservice1.jar>
qa1-start-testservice1-dl.jar:
[jar] Building jar: <https://builds.apache.org/job/river-qa-refactor-jdk7/ws/trunk/qa/lib/qa1-start-testservice1-dl.jar>
qa1-start-testservice2.jar:
[jar] Building jar: <https://builds.apache.org/job/river-qa-refactor-jdk7/ws/trunk/qa/lib/qa1-start-testservice2.jar>
[jar] Updating jar: <https://builds.apache.org/job/river-qa-refactor-jdk7/ws/trunk/qa/lib/qa1-start-testservice2.jar>
qa1-start-testservice2-dl.jar:
[jar] Building jar: <https://builds.apache.org/job/river-qa-refactor-jdk7/ws/trunk/qa/lib/qa1-start-testservice2-dl.jar>
qa1-start-testservice-common.jar:
[jar] Building jar: <https://builds.apache.org/job/river-qa-refactor-jdk7/ws/trunk/qa/lib/qa1-start-testservice-common.jar>
qa1-start-testservice-common-dl.jar:
[jar] Building jar: <https://builds.apache.org/job/river-qa-refactor-jdk7/ws/trunk/qa/lib/qa1-start-testservice-common-dl.jar>
qa1-start-testservicenocons.jar:
[jar] Building jar: <https://builds.apache.org/job/river-qa-refactor-jdk7/ws/trunk/qa/lib/qa1-start-testservicenocons.jar>
qa1-start-testservicenocons-dl.jar:
[jar] Building jar: <https://builds.apache.org/job/river-qa-refactor-jdk7/ws/trunk/qa/lib/qa1-start-testservicenocons-dl.jar>
qa1-lookup-simulator.jar:
[jar] Building jar: <https://builds.apache.org/job/river-qa-refactor-jdk7/ws/trunk/qa/lib/qa1-lookup-simulator.jar>
[jar] Updating jar: <https://builds.apache.org/job/river-qa-refactor-jdk7/ws/trunk/qa/lib/qa1-lookup-simulator.jar>
qa1-lookup-simulator-dl.jar:
[jar] Building jar: <https://builds.apache.org/job/river-qa-refactor-jdk7/ws/trunk/qa/lib/qa1-lookup-simulator-dl.jar>
[jar] Updating jar: <https://builds.apache.org/job/river-qa-refactor-jdk7/ws/trunk/qa/lib/qa1-lookup-simulator-dl.jar>
qa1-share-dl.jar:
[jar] Building jar: <https://builds.apache.org/job/river-qa-refactor-jdk7/ws/trunk/qa/lib/qa1-share-dl.jar>
[jar] Updating jar: <https://builds.apache.org/job/river-qa-refactor-jdk7/ws/trunk/qa/lib/qa1-share-dl.jar>
qa1-reggie-race.jar:
[jar] Building jar: <https://builds.apache.org/job/river-qa-refactor-jdk7/ws/trunk/qa/lib/qa1-reggie-race.jar>
qa1-reggie-race-dl.jar:
[jar] Building jar: <https://builds.apache.org/job/river-qa-refactor-jdk7/ws/trunk/qa/lib/qa1-reggie-race-dl.jar>
fullloggingfilter.jar:
[jar] Building jar: <https://builds.apache.org/job/river-qa-refactor-jdk7/ws/trunk/qa/lib/fullloggingfilter.jar>
qa1-discoveryservice-dl.jar:
[jar] Building jar: <https://builds.apache.org/job/river-qa-refactor-jdk7/ws/trunk/qa/lib/qa1-discoveryservice-dl.jar>
qa1-export-servercontext-tests-non-null.jar:
[jar] Building jar: <https://builds.apache.org/job/river-qa-refactor-jdk7/ws/trunk/qa/lib/qa1-export-servercontext-tests-non-null.jar>
qa1-export-servercontext-tests-null.jar:
[jar] Building jar: <https://builds.apache.org/job/river-qa-refactor-jdk7/ws/trunk/qa/lib/qa1-export-servercontext-tests-null.jar>
qa1-export-servercontext-tests-providers-parsing.jar:
[jar] Building jar: <https://builds.apache.org/job/river-qa-refactor-jdk7/ws/trunk/qa/lib/qa1-export-servercontext-tests-providers-parsing.jar>
qa1-io-util-dl.jar:
[jar] Building jar: <https://builds.apache.org/job/river-qa-refactor-jdk7/ws/trunk/qa/lib/qa1-io-util-dl.jar>
qa1-io-marshalinputstream-test.jar:
[jar] Building jar: <https://builds.apache.org/job/river-qa-refactor-jdk7/ws/trunk/qa/lib/qa1-io-marshalinputstream-test.jar>
[jar] Updating jar: <https://builds.apache.org/job/river-qa-refactor-jdk7/ws/trunk/qa/lib/qa1-io-marshalinputstream-test.jar>
qa1-io-marshalledinstance-test.jar:
[jar] Building jar: <https://builds.apache.org/job/river-qa-refactor-jdk7/ws/trunk/qa/lib/qa1-io-marshalledinstance-test.jar>
[jar] Updating jar: <https://builds.apache.org/job/river-qa-refactor-jdk7/ws/trunk/qa/lib/qa1-io-marshalledinstance-test.jar>
qa1-javaspace-dl.jar:
[jar] Building jar: <https://builds.apache.org/job/river-qa-refactor-jdk7/ws/trunk/qa/lib/qa1-javaspace-dl.jar>
qa1-lookupservice-dl.jar:
[jar] Building jar: <https://builds.apache.org/job/river-qa-refactor-jdk7/ws/trunk/qa/lib/qa1-lookupservice-dl.jar>
qa1-renewalservice-dl.jar:
[jar] Building jar: <https://builds.apache.org/job/river-qa-refactor-jdk7/ws/trunk/qa/lib/qa1-renewalservice-dl.jar>
[jar] Updating jar: <https://builds.apache.org/job/river-qa-refactor-jdk7/ws/trunk/qa/lib/qa1-renewalservice-dl.jar>
qa1-securityDoPrivileged.jar:
[jar] Building jar: <https://builds.apache.org/job/river-qa-refactor-jdk7/ws/trunk/qa/lib/qa1-securityDoPrivileged.jar>
qa1-securityUtil.jar:
[jar] Building jar: <https://builds.apache.org/job/river-qa-refactor-jdk7/ws/trunk/qa/lib/qa1-securityUtil.jar>
qa1-servicediscovery-dl.jar:
[java] Warning: Class not found: net.jini.lookup.ServiceDiscoveryManager$LookupCacheImpl$LookupListener_Stub
[jar] Building jar: <https://builds.apache.org/job/river-qa-refactor-jdk7/ws/trunk/qa/lib/qa1-servicediscovery-dl.jar>
[java] Warning: Class not found: net.jini.lookup.ServiceDiscoveryManager$LookupCacheImpl$LookupListener_Stub
[jar] Updating jar: <https://builds.apache.org/job/river-qa-refactor-jdk7/ws/trunk/qa/lib/qa1-servicediscovery-dl.jar>
qa1-httpmd.jar:
[jar] Building jar: <https://builds.apache.org/job/river-qa-refactor-jdk7/ws/trunk/qa/lib/qa1-httpmd.jar>
qa1-httpmd-same.jar:
[copy] Copying 1 file to <https://builds.apache.org/job/river-qa-refactor-jdk7/ws/trunk/qa/lib>
qa1-httpmd-another.jar:
[jar] Building jar: <https://builds.apache.org/job/river-qa-refactor-jdk7/ws/trunk/qa/lib/qa1-httpmd-another.jar>
ld.jar:
[jar] Building jar: <https://builds.apache.org/job/river-qa-refactor-jdk7/ws/trunk/qa/lib/ld.jar>
qa1-loader-pref.jar:
[jar] Building jar: <https://builds.apache.org/job/river-qa-refactor-jdk7/ws/trunk/qa/lib/qa1-loader-pref.jar>
qa1-policy-provider.jar:
[jar] Building jar: <https://builds.apache.org/job/river-qa-refactor-jdk7/ws/trunk/qa/lib/qa1-policy-provider.jar>
jars:
harness-runtime:
run:
james-brown:
[mkdir] Created dir: <https://builds.apache.org/job/river-qa-refactor-jdk7/ws/trunk/qa/soul>
[touch] Creating <https://builds.apache.org/job/river-qa-refactor-jdk7/ws/trunk/qa/soul/soul.201302250202051891>
run-categories:
[java] Problem with KEEPALIVE_PORT:10004
[java] Unexpected exception:
[java] java.net.BindException: Address already in use
[java] at java.net.PlainSocketImpl.socketBind(Native Method)
[java] at java.net.AbstractPlainSocketImpl.bind(AbstractPlainSocketImpl.java:376)
[java] at java.net.ServerSocket.bind(ServerSocket.java:376)
[java] at java.net.ServerSocket.bind(ServerSocket.java:330)
[java] at com.sun.jini.qa.harness.MasterHarness$KeepAlivePort.run(MasterHarness.java:257)
[java] at java.lang.Thread.run(Thread.java:722)
[java] Java Result: 1
collect-result:
BUILD FAILED
<https://builds.apache.org/job/river-qa-refactor-jdk7/ws/trunk/build.xml>:2093: The following error occurred while executing this line:
<https://builds.apache.org/job/river-qa-refactor-jdk7/ws/trunk/qa/build.xml>:406: The following error occurred while executing this line:
<https://builds.apache.org/job/river-qa-refactor-jdk7/ws/trunk/qa/build.xml>:380: condition satisfied
Total time: 6 minutes 32 seconds
Build step 'Invoke Ant' marked build as failure
[locks-and-latches] Releasing all the locks
[locks-and-latches] All the locks released
Archiving artifacts
Jenkins build is back to normal : river-qa-refactor-jdk7 #27
Posted by Apache Jenkins Server <je...@builds.apache.org>.
See <https://builds.apache.org/job/river-qa-refactor-jdk7/27/changes>
Build failed in Jenkins: river-qa-refactor-jdk7 #26
Posted by Apache Jenkins Server <je...@builds.apache.org>.
See <https://builds.apache.org/job/river-qa-refactor-jdk7/26/>
------------------------------------------
[...truncated 8932 lines...]
[java] -----------------------------------------
[java] com/sun/jini/test/spec/javaspace/conformance/snapshot/SnapshotTransactionTakeIfExistsTest.td
[java] Test Passed: OK
[java]
[java] -----------------------------------------
[java] com/sun/jini/test/spec/javaspace/conformance/snapshot/SnapshotTransactionTakeIfExistsWaitTest.td
[java] Test Passed: OK
[java]
[java] -----------------------------------------
[java] com/sun/jini/test/spec/javaspace/conformance/snapshot/SnapshotTransactionTakeNO_WAITTest.td
[java] Test Passed: OK
[java]
[java] -----------------------------------------
[java] com/sun/jini/test/spec/javaspace/conformance/snapshot/SnapshotTransactionTakeReadTest.td
[java] Test Passed: OK
[java]
[java] -----------------------------------------
[java] com/sun/jini/test/spec/javaspace/conformance/snapshot/SnapshotTransactionTakeTest.td
[java] Test Passed: OK
[java]
[java] -----------------------------------------
[java] com/sun/jini/test/spec/javaspace/conformance/snapshot/SnapshotTransactionTakeWaitTest.td
[java] Test Passed: OK
[java]
[java] -----------------------------------------
[java] com/sun/jini/test/spec/javaspace/conformance/snapshot/SnapshotTransactionWriteLeaseANYTest.td
[java] Test Passed: OK
[java]
[java] -----------------------------------------
[java] com/sun/jini/test/spec/javaspace/conformance/snapshot/SnapshotTransactionWriteLeaseFOREVERTest.td
[java] Test Passed: OK
[java]
[java] -----------------------------------------
[java] com/sun/jini/test/spec/javaspace/conformance/snapshot/SnapshotTransactionWriteNegativeLeaseTest.td
[java] Test Passed: OK
[java]
[java] -----------------------------------------
[java] com/sun/jini/test/spec/javaspace/conformance/snapshot/SnapshotTransactionWriteTakeIfExistsNotifyTest.td
[java] Test Passed: OK
[java]
[java] -----------------------------------------
[java] com/sun/jini/test/spec/javaspace/conformance/snapshot/SnapshotTransactionWriteTakeIfExistsTest.td
[java] Test Passed: OK
[java]
[java] -----------------------------------------
[java] com/sun/jini/test/spec/javaspace/conformance/snapshot/SnapshotTransactionWriteTakeNotifyTest.td
[java] Test Passed: OK
[java]
[java] -----------------------------------------
[java] com/sun/jini/test/spec/javaspace/conformance/snapshot/SnapshotTransactionWriteTakeTest.td
[java] Test Passed: OK
[java]
[java] -----------------------------------------
[java] com/sun/jini/test/spec/javaspace/conformance/snapshot/SnapshotTransactionWriteTest.td
[java] Test Passed: OK
[java]
[java] -----------------------------------------
[java] com/sun/jini/test/spec/javaspace/conformance/snapshot/SnapshotWriteLeaseANYTest.td
[java] Test Passed: OK
[java]
[java] -----------------------------------------
[java] com/sun/jini/test/spec/javaspace/conformance/snapshot/SnapshotWriteLeaseFOREVERTest.td
[java] Test Passed: OK
[java]
[java] -----------------------------------------
[java] com/sun/jini/test/spec/javaspace/conformance/snapshot/SnapshotWriteNegativeLeaseTest.td
[java] Test Passed: OK
[java]
[java] -----------------------------------------
[java] com/sun/jini/test/spec/javaspace/conformance/snapshot/SnapshotWriteTest.td
[java] Test Passed: OK
[java]
[java] -----------------------------------------
[java] com/sun/jini/test/impl/mahalo/AdminIFShutdownTest.td
[java] Test Passed: OK
[java]
[java] -----------------------------------------
[java] com/sun/jini/test/impl/mahalo/AdminIFTest.td
[java] Test Passed: OK
[java]
[java] -----------------------------------------
[java] com/sun/jini/test/impl/mahalo/LeaseExpireCancelTest.td
[java] Test Passed: OK
[java]
[java] -----------------------------------------
[java] com/sun/jini/test/impl/mahalo/LeaseExpireRenewTest.td
[java] Test Passed: OK
[java]
[java] -----------------------------------------
[java] com/sun/jini/test/impl/mahalo/LeaseMapTest.td
[java] Test Passed: OK
[java]
[java] -----------------------------------------
[java] com/sun/jini/test/impl/mahalo/LeaseTest.td
[java] Test Passed: OK
[java]
[java] -----------------------------------------
[java] com/sun/jini/test/impl/mahalo/MahaloCreateShutdownTest.td
[java] Test Passed: OK
[java]
[java] -----------------------------------------
[java] com/sun/jini/test/impl/mahalo/MahaloIFTest.td
[java] Test Passed: OK
[java]
[java] -----------------------------------------
[java] com/sun/jini/test/impl/mahalo/MahaloImplReadyStateTest.td
[java] Test Skipped: verifiers are: com.sun.jini.test.impl.mercury.ActivatableMercuryVerifier com.sun.jini.qa.harness.SkipConfigTestVerifier
[java] -----------------------------------------
[java] com/sun/jini/test/impl/mahalo/NestableServerTransactionCreatedToStringTest.td
[java] Test Passed: OK
[java]
[java] -----------------------------------------
[java] com/sun/jini/test/impl/mahalo/NestableTransactionCreatedToStringTest.td
[java] Test Passed: OK
[java]
[java] -----------------------------------------
[java] com/sun/jini/test/impl/mahalo/PrepareAndCommitExceptionTest.td
[java] Test Passed: OK
[java]
[java] -----------------------------------------
[java] com/sun/jini/test/impl/mahalo/PrepareAndCommitExceptionTest2.td
[java] Test Passed: OK
[java]
[java] -----------------------------------------
[java] com/sun/jini/test/impl/mahalo/PrepareAndCommitExceptionTest3.td
[java] Test Passed: OK
[java]
[java] -----------------------------------------
[java] com/sun/jini/test/impl/mahalo/PrepareAndCommitExceptionTest4.td
[java] Test Passed: OK
[java]
[java] -----------------------------------------
[java] com/sun/jini/test/impl/mahalo/PrepareAndCommitExceptionTest5.td
[java] Test Passed: OK
[java]
[java] -----------------------------------------
[java] com/sun/jini/test/impl/mahalo/RandomStressTest.td
[java] Test Passed: OK
[java]
[java] -----------------------------------------
[java] com/sun/jini/test/impl/mahalo/ServerTransactionEqualityTest.td
[java] Test Passed: OK
[java]
[java] -----------------------------------------
[java] com/sun/jini/test/impl/mahalo/ServerTransactionToStringTest.td
[java] Test Passed: OK
[java]
[java] -----------------------------------------
[java] com/sun/jini/test/impl/mahalo/TransactionCreatedToStringTest.td
[java] Test Passed: OK
[java]
[java] -----------------------------------------
[java] com/sun/jini/test/impl/mahalo/TransactionManagerCreatedToStringTest.td
[java] Test Passed: OK
[java]
[java] -----------------------------------------
[java] com/sun/jini/test/impl/mahalo/TxnMgrImplNullActivationConfigEntries.td
[java] Test Skipped: verifiers are: com.sun.jini.test.impl.mahalo.ActivatableMahaloVerifier
[java] -----------------------------------------
[java] com/sun/jini/test/impl/mahalo/TxnMgrImplNullConfigEntries.td
[java] Test Passed: OK
[java]
[java] -----------------------------------------
[java] com/sun/jini/test/impl/mahalo/TxnMgrImplNullRecoveredLocators.td
[java] Test Skipped: verifiers are: com.sun.jini.test.impl.mahalo.ActivatableMahaloVerifier
[java] -----------------------------------------
[java] com/sun/jini/test/impl/mahalo/TxnMgrProxyEqualityTest.td
[java] Test Passed: OK
[java]
[java] -----------------------------------------
[java] com/sun/jini/test/spec/txnmanager/AsynchAbortOnCommitTest.td
[java] Test Passed: OK
[java]
[java] -----------------------------------------
[java] com/sun/jini/test/spec/txnmanager/AsynchAbortOnPrepareTest.td
[java] Test Passed: OK
[java]
[java] -----------------------------------------
[java] com/sun/jini/test/spec/txnmanager/CommitExpiredTest.td
[java] Test Passed: OK
[java]
[java] -----------------------------------------
[java] com/sun/jini/test/spec/txnmanager/CommitTimeoutTest.td
[java] Test Passed: OK
[java]
[java] -----------------------------------------
[java] com/sun/jini/test/spec/txnmanager/GetStateTest.td
[java] Test Passed: OK
[java]
[java] -----------------------------------------
[java] com/sun/jini/test/spec/txnmanager/JoinIdempotentTest.td
[java] Test Passed: OK
[java]
[java] -----------------------------------------
[java] com/sun/jini/test/spec/txnmanager/JoinWhileActiveTest.td
[java] Test Passed: OK
[java]
[java] -----------------------------------------
[java] com/sun/jini/test/spec/txnmanager/ManyParticipantsTest.td
[java] Test Passed: OK
[java]
[java] -----------------------------------------
[java] com/sun/jini/test/spec/txnmanager/PrepareTimeoutTest.td
[java] Test Passed: OK
[java]
[java] -----------------------------------------
[java] com/sun/jini/test/spec/txnmanager/RollBackErrorTest.td
[java] Test Passed: OK
[java]
[java] -----------------------------------------
[java] com/sun/jini/test/spec/txnmanager/RollForwardErrorTest.td
[java] Test Passed: OK
[java]
[java] -----------------------------------------
[java] com/sun/jini/test/spec/txnmanager/TwoPhaseTest.td
[java] Test Passed: OK
[java]
[java] -----------------------------------------
[java]
[java] # of tests started = 1411
[java] # of tests completed = 1411
[java] # of tests skipped = 47
[java] # of tests passed = 1360
[java] # of tests failed = 51
[java]
[java] -----------------------------------------
[java]
[java] Date finished:
[java] Mon Feb 25 21:38:43 UTC 2013
[java] Time elapsed:
[java] 59115 seconds
[java]
[java] Java Result: 1
collect-result:
[copy] Copying 1 file to <https://builds.apache.org/job/river-qa-refactor-jdk7/ws/trunk/qa/result>
[copy] Copying 1 file to <https://builds.apache.org/job/river-qa-refactor-jdk7/ws/trunk/qa/result>
[zip] Building zip: <https://builds.apache.org/job/river-qa-refactor-jdk7/26/artifact/trunk/qa/result/qaresults-amd64-Linux-1.7.0_04.zip>
BUILD FAILED
<https://builds.apache.org/job/river-qa-refactor-jdk7/ws/trunk/build.xml>:2093: The following error occurred while executing this line:
<https://builds.apache.org/job/river-qa-refactor-jdk7/ws/trunk/qa/build.xml>:406: The following error occurred while executing this line:
<https://builds.apache.org/job/river-qa-refactor-jdk7/ws/trunk/qa/build.xml>:380: condition satisfied
Total time: 991 minutes 1 second
Build step 'Invoke Ant' marked build as failure
[locks-and-latches] Releasing all the locks
[locks-and-latches] All the locks released
Archiving artifacts
Build failed in Jenkins: river-qa-refactor-jdk7 #24
Posted by Apache Jenkins Server <je...@builds.apache.org>.
See <https://builds.apache.org/job/river-qa-refactor-jdk7/24/changes>
Changes:
[peter_firmstone] Attempt to fix failing javaspace test
------------------------------------------
[...truncated 8825 lines...]
[java] -----------------------------------------
[java] com/sun/jini/test/spec/javaspace/conformance/snapshot/SnapshotTransactionTakeIfExistsTest.td
[java] Test Passed: OK
[java]
[java] -----------------------------------------
[java] com/sun/jini/test/spec/javaspace/conformance/snapshot/SnapshotTransactionTakeIfExistsWaitTest.td
[java] Test Passed: OK
[java]
[java] -----------------------------------------
[java] com/sun/jini/test/spec/javaspace/conformance/snapshot/SnapshotTransactionTakeNO_WAITTest.td
[java] Test Passed: OK
[java]
[java] -----------------------------------------
[java] com/sun/jini/test/spec/javaspace/conformance/snapshot/SnapshotTransactionTakeReadTest.td
[java] Test Passed: OK
[java]
[java] -----------------------------------------
[java] com/sun/jini/test/spec/javaspace/conformance/snapshot/SnapshotTransactionTakeTest.td
[java] Test Passed: OK
[java]
[java] -----------------------------------------
[java] com/sun/jini/test/spec/javaspace/conformance/snapshot/SnapshotTransactionTakeWaitTest.td
[java] Test Passed: OK
[java]
[java] -----------------------------------------
[java] com/sun/jini/test/spec/javaspace/conformance/snapshot/SnapshotTransactionWriteLeaseANYTest.td
[java] Test Passed: OK
[java]
[java] -----------------------------------------
[java] com/sun/jini/test/spec/javaspace/conformance/snapshot/SnapshotTransactionWriteLeaseFOREVERTest.td
[java] Test Passed: OK
[java]
[java] -----------------------------------------
[java] com/sun/jini/test/spec/javaspace/conformance/snapshot/SnapshotTransactionWriteNegativeLeaseTest.td
[java] Test Passed: OK
[java]
[java] -----------------------------------------
[java] com/sun/jini/test/spec/javaspace/conformance/snapshot/SnapshotTransactionWriteTakeIfExistsNotifyTest.td
[java] Test Passed: OK
[java]
[java] -----------------------------------------
[java] com/sun/jini/test/spec/javaspace/conformance/snapshot/SnapshotTransactionWriteTakeIfExistsTest.td
[java] Test Passed: OK
[java]
[java] -----------------------------------------
[java] com/sun/jini/test/spec/javaspace/conformance/snapshot/SnapshotTransactionWriteTakeNotifyTest.td
[java] Test Passed: OK
[java]
[java] -----------------------------------------
[java] com/sun/jini/test/spec/javaspace/conformance/snapshot/SnapshotTransactionWriteTakeTest.td
[java] Test Passed: OK
[java]
[java] -----------------------------------------
[java] com/sun/jini/test/spec/javaspace/conformance/snapshot/SnapshotTransactionWriteTest.td
[java] Test Passed: OK
[java]
[java] -----------------------------------------
[java] com/sun/jini/test/spec/javaspace/conformance/snapshot/SnapshotWriteLeaseANYTest.td
[java] Test Passed: OK
[java]
[java] -----------------------------------------
[java] com/sun/jini/test/spec/javaspace/conformance/snapshot/SnapshotWriteLeaseFOREVERTest.td
[java] Test Passed: OK
[java]
[java] -----------------------------------------
[java] com/sun/jini/test/spec/javaspace/conformance/snapshot/SnapshotWriteNegativeLeaseTest.td
[java] Test Passed: OK
[java]
[java] -----------------------------------------
[java] com/sun/jini/test/spec/javaspace/conformance/snapshot/SnapshotWriteTest.td
[java] Test Passed: OK
[java]
[java] -----------------------------------------
[java] com/sun/jini/test/impl/mahalo/AdminIFShutdownTest.td
[java] Test Passed: OK
[java]
[java] -----------------------------------------
[java] com/sun/jini/test/impl/mahalo/AdminIFTest.td
[java] Test Passed: OK
[java]
[java] -----------------------------------------
[java] com/sun/jini/test/impl/mahalo/LeaseExpireCancelTest.td
[java] Test Passed: OK
[java]
[java] -----------------------------------------
[java] com/sun/jini/test/impl/mahalo/LeaseExpireRenewTest.td
[java] Test Passed: OK
[java]
[java] -----------------------------------------
[java] com/sun/jini/test/impl/mahalo/LeaseMapTest.td
[java] Test Passed: OK
[java]
[java] -----------------------------------------
[java] com/sun/jini/test/impl/mahalo/LeaseTest.td
[java] Test Passed: OK
[java]
[java] -----------------------------------------
[java] com/sun/jini/test/impl/mahalo/MahaloCreateShutdownTest.td
[java] Test Passed: OK
[java]
[java] -----------------------------------------
[java] com/sun/jini/test/impl/mahalo/MahaloIFTest.td
[java] Test Passed: OK
[java]
[java] -----------------------------------------
[java] com/sun/jini/test/impl/mahalo/MahaloImplReadyStateTest.td
[java] Test Skipped: verifiers are: com.sun.jini.test.impl.mercury.ActivatableMercuryVerifier com.sun.jini.qa.harness.SkipConfigTestVerifier
[java] -----------------------------------------
[java] com/sun/jini/test/impl/mahalo/NestableServerTransactionCreatedToStringTest.td
[java] Test Passed: OK
[java]
[java] -----------------------------------------
[java] com/sun/jini/test/impl/mahalo/NestableTransactionCreatedToStringTest.td
[java] Test Passed: OK
[java]
[java] -----------------------------------------
[java] com/sun/jini/test/impl/mahalo/PrepareAndCommitExceptionTest.td
[java] Test Passed: OK
[java]
[java] -----------------------------------------
[java] com/sun/jini/test/impl/mahalo/PrepareAndCommitExceptionTest2.td
[java] Test Passed: OK
[java]
[java] -----------------------------------------
[java] com/sun/jini/test/impl/mahalo/PrepareAndCommitExceptionTest3.td
[java] Test Passed: OK
[java]
[java] -----------------------------------------
[java] com/sun/jini/test/impl/mahalo/PrepareAndCommitExceptionTest4.td
[java] Test Passed: OK
[java]
[java] -----------------------------------------
[java] com/sun/jini/test/impl/mahalo/PrepareAndCommitExceptionTest5.td
[java] Test Passed: OK
[java]
[java] -----------------------------------------
[java] com/sun/jini/test/impl/mahalo/RandomStressTest.td
[java] Test Passed: OK
[java]
[java] -----------------------------------------
[java] com/sun/jini/test/impl/mahalo/ServerTransactionEqualityTest.td
[java] Test Passed: OK
[java]
[java] -----------------------------------------
[java] com/sun/jini/test/impl/mahalo/ServerTransactionToStringTest.td
[java] Test Passed: OK
[java]
[java] -----------------------------------------
[java] com/sun/jini/test/impl/mahalo/TransactionCreatedToStringTest.td
[java] Test Passed: OK
[java]
[java] -----------------------------------------
[java] com/sun/jini/test/impl/mahalo/TransactionManagerCreatedToStringTest.td
[java] Test Passed: OK
[java]
[java] -----------------------------------------
[java] com/sun/jini/test/impl/mahalo/TxnMgrImplNullActivationConfigEntries.td
[java] Test Skipped: verifiers are: com.sun.jini.test.impl.mahalo.ActivatableMahaloVerifier
[java] -----------------------------------------
[java] com/sun/jini/test/impl/mahalo/TxnMgrImplNullConfigEntries.td
[java] Test Passed: OK
[java]
[java] -----------------------------------------
[java] com/sun/jini/test/impl/mahalo/TxnMgrImplNullRecoveredLocators.td
[java] Test Skipped: verifiers are: com.sun.jini.test.impl.mahalo.ActivatableMahaloVerifier
[java] -----------------------------------------
[java] com/sun/jini/test/impl/mahalo/TxnMgrProxyEqualityTest.td
[java] Test Passed: OK
[java]
[java] -----------------------------------------
[java] com/sun/jini/test/spec/txnmanager/AsynchAbortOnCommitTest.td
[java] Test Passed: OK
[java]
[java] -----------------------------------------
[java] com/sun/jini/test/spec/txnmanager/AsynchAbortOnPrepareTest.td
[java] Test Passed: OK
[java]
[java] -----------------------------------------
[java] com/sun/jini/test/spec/txnmanager/CommitExpiredTest.td
[java] Test Passed: OK
[java]
[java] -----------------------------------------
[java] com/sun/jini/test/spec/txnmanager/CommitTimeoutTest.td
[java] Test Passed: OK
[java]
[java] -----------------------------------------
[java] com/sun/jini/test/spec/txnmanager/GetStateTest.td
[java] Test Passed: OK
[java]
[java] -----------------------------------------
[java] com/sun/jini/test/spec/txnmanager/JoinIdempotentTest.td
[java] Test Passed: OK
[java]
[java] -----------------------------------------
[java] com/sun/jini/test/spec/txnmanager/JoinWhileActiveTest.td
[java] Test Passed: OK
[java]
[java] -----------------------------------------
[java] com/sun/jini/test/spec/txnmanager/ManyParticipantsTest.td
[java] Test Passed: OK
[java]
[java] -----------------------------------------
[java] com/sun/jini/test/spec/txnmanager/PrepareTimeoutTest.td
[java] Test Passed: OK
[java]
[java] -----------------------------------------
[java] com/sun/jini/test/spec/txnmanager/RollBackErrorTest.td
[java] Test Passed: OK
[java]
[java] -----------------------------------------
[java] com/sun/jini/test/spec/txnmanager/RollForwardErrorTest.td
[java] Test Passed: OK
[java]
[java] -----------------------------------------
[java] com/sun/jini/test/spec/txnmanager/TwoPhaseTest.td
[java] Test Passed: OK
[java]
[java] -----------------------------------------
[java]
[java] # of tests started = 1411
[java] # of tests completed = 1411
[java] # of tests skipped = 47
[java] # of tests passed = 1410
[java] # of tests failed = 1
[java]
[java] -----------------------------------------
[java]
[java] Date finished:
[java] Mon Feb 25 01:55:21 UTC 2013
[java] Time elapsed:
[java] 64613 seconds
[java]
[java] Java Result: 1
collect-result:
[copy] Copying 1 file to <https://builds.apache.org/job/river-qa-refactor-jdk7/ws/trunk/qa/result>
[copy] Copying 1 file to <https://builds.apache.org/job/river-qa-refactor-jdk7/ws/trunk/qa/result>
[zip] Building zip: <https://builds.apache.org/job/river-qa-refactor-jdk7/24/artifact/trunk/qa/result/qaresults-amd64-Linux-1.7.0_04.zip>
BUILD FAILED
<https://builds.apache.org/job/river-qa-refactor-jdk7/ws/trunk/build.xml>:2093: The following error occurred while executing this line:
<https://builds.apache.org/job/river-qa-refactor-jdk7/ws/trunk/qa/build.xml>:406: The following error occurred while executing this line:
<https://builds.apache.org/job/river-qa-refactor-jdk7/ws/trunk/qa/build.xml>:380: condition satisfied
Total time: 1082 minutes 31 seconds
Build step 'Invoke Ant' marked build as failure
[locks-and-latches] Releasing all the locks
[locks-and-latches] All the locks released
Archiving artifacts
Build failed in Jenkins: river-qa-refactor-jdk7 #23
Posted by Apache Jenkins Server <je...@builds.apache.org>.
See <https://builds.apache.org/job/river-qa-refactor-jdk7/23/changes>
Changes:
[peter_firmstone] Attempt to fix last failing test UseNotifyLeaseTestRenew on arm
------------------------------------------
[...truncated 8840 lines...]
[java] -----------------------------------------
[java] com/sun/jini/test/spec/javaspace/conformance/snapshot/SnapshotTransactionTakeIfExistsTest.td
[java] Test Passed: OK
[java]
[java] -----------------------------------------
[java] com/sun/jini/test/spec/javaspace/conformance/snapshot/SnapshotTransactionTakeIfExistsWaitTest.td
[java] Test Passed: OK
[java]
[java] -----------------------------------------
[java] com/sun/jini/test/spec/javaspace/conformance/snapshot/SnapshotTransactionTakeNO_WAITTest.td
[java] Test Passed: OK
[java]
[java] -----------------------------------------
[java] com/sun/jini/test/spec/javaspace/conformance/snapshot/SnapshotTransactionTakeReadTest.td
[java] Test Passed: OK
[java]
[java] -----------------------------------------
[java] com/sun/jini/test/spec/javaspace/conformance/snapshot/SnapshotTransactionTakeTest.td
[java] Test Passed: OK
[java]
[java] -----------------------------------------
[java] com/sun/jini/test/spec/javaspace/conformance/snapshot/SnapshotTransactionTakeWaitTest.td
[java] Test Passed: OK
[java]
[java] -----------------------------------------
[java] com/sun/jini/test/spec/javaspace/conformance/snapshot/SnapshotTransactionWriteLeaseANYTest.td
[java] Test Passed: OK
[java]
[java] -----------------------------------------
[java] com/sun/jini/test/spec/javaspace/conformance/snapshot/SnapshotTransactionWriteLeaseFOREVERTest.td
[java] Test Passed: OK
[java]
[java] -----------------------------------------
[java] com/sun/jini/test/spec/javaspace/conformance/snapshot/SnapshotTransactionWriteNegativeLeaseTest.td
[java] Test Passed: OK
[java]
[java] -----------------------------------------
[java] com/sun/jini/test/spec/javaspace/conformance/snapshot/SnapshotTransactionWriteTakeIfExistsNotifyTest.td
[java] Test Passed: OK
[java]
[java] -----------------------------------------
[java] com/sun/jini/test/spec/javaspace/conformance/snapshot/SnapshotTransactionWriteTakeIfExistsTest.td
[java] Test Passed: OK
[java]
[java] -----------------------------------------
[java] com/sun/jini/test/spec/javaspace/conformance/snapshot/SnapshotTransactionWriteTakeNotifyTest.td
[java] Test Passed: OK
[java]
[java] -----------------------------------------
[java] com/sun/jini/test/spec/javaspace/conformance/snapshot/SnapshotTransactionWriteTakeTest.td
[java] Test Passed: OK
[java]
[java] -----------------------------------------
[java] com/sun/jini/test/spec/javaspace/conformance/snapshot/SnapshotTransactionWriteTest.td
[java] Test Passed: OK
[java]
[java] -----------------------------------------
[java] com/sun/jini/test/spec/javaspace/conformance/snapshot/SnapshotWriteLeaseANYTest.td
[java] Test Passed: OK
[java]
[java] -----------------------------------------
[java] com/sun/jini/test/spec/javaspace/conformance/snapshot/SnapshotWriteLeaseFOREVERTest.td
[java] Test Passed: OK
[java]
[java] -----------------------------------------
[java] com/sun/jini/test/spec/javaspace/conformance/snapshot/SnapshotWriteNegativeLeaseTest.td
[java] Test Passed: OK
[java]
[java] -----------------------------------------
[java] com/sun/jini/test/spec/javaspace/conformance/snapshot/SnapshotWriteTest.td
[java] Test Passed: OK
[java]
[java] -----------------------------------------
[java] com/sun/jini/test/impl/mahalo/AdminIFShutdownTest.td
[java] Test Passed: OK
[java]
[java] -----------------------------------------
[java] com/sun/jini/test/impl/mahalo/AdminIFTest.td
[java] Test Passed: OK
[java]
[java] -----------------------------------------
[java] com/sun/jini/test/impl/mahalo/LeaseExpireCancelTest.td
[java] Test Passed: OK
[java]
[java] -----------------------------------------
[java] com/sun/jini/test/impl/mahalo/LeaseExpireRenewTest.td
[java] Test Passed: OK
[java]
[java] -----------------------------------------
[java] com/sun/jini/test/impl/mahalo/LeaseMapTest.td
[java] Test Passed: OK
[java]
[java] -----------------------------------------
[java] com/sun/jini/test/impl/mahalo/LeaseTest.td
[java] Test Passed: OK
[java]
[java] -----------------------------------------
[java] com/sun/jini/test/impl/mahalo/MahaloCreateShutdownTest.td
[java] Test Passed: OK
[java]
[java] -----------------------------------------
[java] com/sun/jini/test/impl/mahalo/MahaloIFTest.td
[java] Test Passed: OK
[java]
[java] -----------------------------------------
[java] com/sun/jini/test/impl/mahalo/MahaloImplReadyStateTest.td
[java] Test Skipped: verifiers are: com.sun.jini.test.impl.mercury.ActivatableMercuryVerifier com.sun.jini.qa.harness.SkipConfigTestVerifier
[java] -----------------------------------------
[java] com/sun/jini/test/impl/mahalo/NestableServerTransactionCreatedToStringTest.td
[java] Test Passed: OK
[java]
[java] -----------------------------------------
[java] com/sun/jini/test/impl/mahalo/NestableTransactionCreatedToStringTest.td
[java] Test Passed: OK
[java]
[java] -----------------------------------------
[java] com/sun/jini/test/impl/mahalo/PrepareAndCommitExceptionTest.td
[java] Test Passed: OK
[java]
[java] -----------------------------------------
[java] com/sun/jini/test/impl/mahalo/PrepareAndCommitExceptionTest2.td
[java] Test Passed: OK
[java]
[java] -----------------------------------------
[java] com/sun/jini/test/impl/mahalo/PrepareAndCommitExceptionTest3.td
[java] Test Passed: OK
[java]
[java] -----------------------------------------
[java] com/sun/jini/test/impl/mahalo/PrepareAndCommitExceptionTest4.td
[java] Test Passed: OK
[java]
[java] -----------------------------------------
[java] com/sun/jini/test/impl/mahalo/PrepareAndCommitExceptionTest5.td
[java] Test Passed: OK
[java]
[java] -----------------------------------------
[java] com/sun/jini/test/impl/mahalo/RandomStressTest.td
[java] Test Passed: OK
[java]
[java] -----------------------------------------
[java] com/sun/jini/test/impl/mahalo/ServerTransactionEqualityTest.td
[java] Test Passed: OK
[java]
[java] -----------------------------------------
[java] com/sun/jini/test/impl/mahalo/ServerTransactionToStringTest.td
[java] Test Passed: OK
[java]
[java] -----------------------------------------
[java] com/sun/jini/test/impl/mahalo/TransactionCreatedToStringTest.td
[java] Test Passed: OK
[java]
[java] -----------------------------------------
[java] com/sun/jini/test/impl/mahalo/TransactionManagerCreatedToStringTest.td
[java] Test Passed: OK
[java]
[java] -----------------------------------------
[java] com/sun/jini/test/impl/mahalo/TxnMgrImplNullActivationConfigEntries.td
[java] Test Skipped: verifiers are: com.sun.jini.test.impl.mahalo.ActivatableMahaloVerifier
[java] -----------------------------------------
[java] com/sun/jini/test/impl/mahalo/TxnMgrImplNullConfigEntries.td
[java] Test Passed: OK
[java]
[java] -----------------------------------------
[java] com/sun/jini/test/impl/mahalo/TxnMgrImplNullRecoveredLocators.td
[java] Test Skipped: verifiers are: com.sun.jini.test.impl.mahalo.ActivatableMahaloVerifier
[java] -----------------------------------------
[java] com/sun/jini/test/impl/mahalo/TxnMgrProxyEqualityTest.td
[java] Test Passed: OK
[java]
[java] -----------------------------------------
[java] com/sun/jini/test/spec/txnmanager/AsynchAbortOnCommitTest.td
[java] Test Passed: OK
[java]
[java] -----------------------------------------
[java] com/sun/jini/test/spec/txnmanager/AsynchAbortOnPrepareTest.td
[java] Test Passed: OK
[java]
[java] -----------------------------------------
[java] com/sun/jini/test/spec/txnmanager/CommitExpiredTest.td
[java] Test Passed: OK
[java]
[java] -----------------------------------------
[java] com/sun/jini/test/spec/txnmanager/CommitTimeoutTest.td
[java] Test Passed: OK
[java]
[java] -----------------------------------------
[java] com/sun/jini/test/spec/txnmanager/GetStateTest.td
[java] Test Passed: OK
[java]
[java] -----------------------------------------
[java] com/sun/jini/test/spec/txnmanager/JoinIdempotentTest.td
[java] Test Passed: OK
[java]
[java] -----------------------------------------
[java] com/sun/jini/test/spec/txnmanager/JoinWhileActiveTest.td
[java] Test Passed: OK
[java]
[java] -----------------------------------------
[java] com/sun/jini/test/spec/txnmanager/ManyParticipantsTest.td
[java] Test Passed: OK
[java]
[java] -----------------------------------------
[java] com/sun/jini/test/spec/txnmanager/PrepareTimeoutTest.td
[java] Test Passed: OK
[java]
[java] -----------------------------------------
[java] com/sun/jini/test/spec/txnmanager/RollBackErrorTest.td
[java] Test Passed: OK
[java]
[java] -----------------------------------------
[java] com/sun/jini/test/spec/txnmanager/RollForwardErrorTest.td
[java] Test Passed: OK
[java]
[java] -----------------------------------------
[java] com/sun/jini/test/spec/txnmanager/TwoPhaseTest.td
[java] Test Passed: OK
[java]
[java] -----------------------------------------
[java]
[java] # of tests started = 1411
[java] # of tests completed = 1411
[java] # of tests skipped = 47
[java] # of tests passed = 1410
[java] # of tests failed = 1
[java]
[java] -----------------------------------------
[java]
[java] Date finished:
[java] Sun Feb 24 07:52:10 UTC 2013
[java] Time elapsed:
[java] 64538 seconds
[java]
[java] Java Result: 1
collect-result:
[copy] Copying 1 file to <https://builds.apache.org/job/river-qa-refactor-jdk7/ws/trunk/qa/result>
[copy] Copying 1 file to <https://builds.apache.org/job/river-qa-refactor-jdk7/ws/trunk/qa/result>
[zip] Building zip: <https://builds.apache.org/job/river-qa-refactor-jdk7/23/artifact/trunk/qa/result/qaresults-amd64-Linux-1.7.0_04.zip>
BUILD FAILED
<https://builds.apache.org/job/river-qa-refactor-jdk7/ws/trunk/build.xml>:2093: The following error occurred while executing this line:
<https://builds.apache.org/job/river-qa-refactor-jdk7/ws/trunk/qa/build.xml>:406: The following error occurred while executing this line:
<https://builds.apache.org/job/river-qa-refactor-jdk7/ws/trunk/qa/build.xml>:380: condition satisfied
Total time: 1081 minutes 13 seconds
Build step 'Invoke Ant' marked build as failure
[locks-and-latches] Releasing all the locks
[locks-and-latches] All the locks released
Archiving artifacts