You are viewing a plain text version of this content. The canonical link for it is here.
Posted to notifications@directory.apache.org by Apache Jenkins Server <je...@builds.apache.org> on 2017/05/03 23:44:20 UTC

Build failed in Jenkins: dir-fortress-core-docker-test #336

See <https://builds.apache.org/job/dir-fortress-core-docker-test/336/display/redirect?page=changes>

Changes:

[smckinney] 2.0.0-RC2-SNAPSHOT release preps

------------------------------------------
Started by an SCM change
[EnvInject] - Loading node environment variables.
Building remotely on qnode3 (ubuntu) in workspace <https://builds.apache.org/job/dir-fortress-core-docker-test/ws/>
 > git rev-parse --is-inside-work-tree # timeout=10
Fetching changes from the remote Git repository
 > git config remote.origin.url https://git-wip-us.apache.org/repos/asf/directory-fortress-core.git # timeout=10
Fetching upstream changes from https://git-wip-us.apache.org/repos/asf/directory-fortress-core.git
 > git --version # timeout=10
 > git fetch --tags --progress https://git-wip-us.apache.org/repos/asf/directory-fortress-core.git +refs/heads/*:refs/remotes/origin/*
 > git rev-parse refs/remotes/origin/master^{commit} # timeout=10
 > git rev-parse refs/remotes/origin/origin/master^{commit} # timeout=10
Checking out Revision 1453608d85347c591a2e82247311378cf0d9af9c (refs/remotes/origin/master)
 > git config core.sparsecheckout # timeout=10
 > git checkout -f 1453608d85347c591a2e82247311378cf0d9af9c
 > git rev-list 2f72e8fd90cc5c625570f6af1bf39adb011e1ad4 # timeout=10
[dir-fortress-core-docker-test] $ /bin/bash /tmp/hudson8291752705498530248.sh
Error response from daemon: No such container: dir-fortress-core-test-ubuntu-openldap
Error response from daemon: No such container: dir-fortress-core-test-ubuntu-openldap
Docker version 17.03.0-ce, build 60ccb22
Using default tag: latest
latest: Pulling from apachedirectory/openldap-for-apache-fortress-tests
386a066cd84a: Already exists
a3ed95caeb02: Already exists
a3ed95caeb02: Already exists
fd3e0a2dc575: Already exists
46ac59bf7525: Already exists
eacabfc9d093: Already exists
0299602c4762: Already exists
0379e1b67a9d: Already exists
df7e5215927b: Already exists
caa5737d15ef: Already exists
89594c9aadba: Already exists
8efed4e7cea8: Already exists
0b6f7c352ee2: Already exists
a3ed95caeb02: Already exists
a3ed95caeb02: Already exists
Digest: sha256:03f757f5b2bcc5c7a86063ca343b0ad75201cb4e3f6d73accaf876190d800a7f
Status: Image is up to date for apachedirectory/openldap-for-apache-fortress-tests:latest
REPOSITORY                                           TAG                 IMAGE ID            CREATED             SIZE
apachedirectory/openldap-for-apache-fortress-tests   latest              d8d6052bc510        5 months ago        185 MB
beae1de95dc39b3992f6bd3d8989436a9dfbf32d10d79107fa90e129b4031850
[dir-fortress-core-docker-test] $ /home/jenkins/tools/maven/latest3/bin/mvn -Dmaven.repo.local=<https://builds.apache.org/job/dir-fortress-core-docker-test/ws/.repository> -U -V clean install
Apache Maven 3.3.9 (bb52d8502b132ec0a5a3f4c09453c07478323dc5; 2015-11-10T16:41:47+00:00)
Maven home: /home/jenkins/tools/maven/latest3
Java version: 1.7.0_80, vendor: Oracle Corporation
Java home: /usr/local/asfpackages/java/jdk1.7.0_80/jre
Default locale: en_US, platform encoding: UTF-8
OS name: "linux", version: "4.8.3-std-1", arch: "amd64", family: "unix"
[INFO] Scanning for projects...
[INFO]                                                                         
[INFO] ------------------------------------------------------------------------
[INFO] Building Apache Fortress Core 2.0.0-RC2-SNAPSHOT
[INFO] ------------------------------------------------------------------------
[INFO] 
[INFO] --- maven-clean-plugin:2.6.1:clean (default-clean) @ fortress-core ---
[INFO] Deleting <https://builds.apache.org/job/dir-fortress-core-docker-test/ws/target>
[INFO] 
[INFO] --- maven-resources-plugin:2.7:copy-resources (copy-resources) @ fortress-core ---
[INFO] Using 'UTF-8' encoding to copy filtered resources.
[INFO] Copying 8 resources
[INFO] 
[INFO] --- maven-remote-resources-plugin:1.5:process (default) @ fortress-core ---
[INFO] 
[INFO] --- maven-resources-plugin:2.7:resources (default-resources) @ fortress-core ---
[INFO] Using 'UTF-8' encoding to copy filtered resources.
[INFO] Copying 8 resources
[INFO] Copying 3 resources
[INFO] 
[INFO] --- maven-compiler-plugin:3.3:compile (default-compile) @ fortress-core ---
[INFO] Changes detected - recompiling the module!
[INFO] Compiling 236 source files to <https://builds.apache.org/job/dir-fortress-core-docker-test/ws/target/classes>
[INFO] ------------------------------------------------------------------------
[INFO] BUILD FAILURE
[INFO] ------------------------------------------------------------------------
[INFO] Total time: 17.128 s
[INFO] Finished at: 2017-05-03T23:44:17+00:00
[INFO] Final Memory: 21M/476M
[INFO] ------------------------------------------------------------------------
[ERROR] Failed to execute goal org.apache.maven.plugins:maven-compiler-plugin:3.3:compile (default-compile) on project fortress-core: Fatal error compiling: invalid target release: 1.8 -> [Help 1]
[ERROR] 
[ERROR] To see the full stack trace of the errors, re-run Maven with the -e switch.
[ERROR] Re-run Maven using the -X switch to enable full debug logging.
[ERROR] 
[ERROR] For more information about the errors and possible solutions, please read the following articles:
[ERROR] [Help 1] http://cwiki.apache.org/confluence/display/MAVEN/MojoExecutionException
Build step 'Invoke top-level Maven targets' marked build as failure
[dir-fortress-core-docker-test] $ /bin/bash /tmp/hudson2214324090690588144.sh
dir-fortress-core-test-ubuntu-openldap
dir-fortress-core-test-ubuntu-openldap
CONTAINER ID        IMAGE                         COMMAND                  CREATED             STATUS              PORTS               NAMES
ff7558c0ef47        madlib/postgres_9.6:jenkins   "docker-entrypoint..."   12 days ago         Up 12 days          5432/tcp            madlib

Jenkins build is back to normal : dir-fortress-core-docker-test #342

Posted by Apache Jenkins Server <je...@builds.apache.org>.
See <https://builds.apache.org/job/dir-fortress-core-docker-test/342/display/redirect>


Build failed in Jenkins: dir-fortress-core-docker-test #341

Posted by Apache Jenkins Server <je...@builds.apache.org>.
See <https://builds.apache.org/job/dir-fortress-core-docker-test/341/display/redirect?page=changes>

Changes:

[smckinney] 2.0.0-RC2 release

------------------------------------------
Started by an SCM change
[EnvInject] - Loading node environment variables.
Building remotely on H17 (ubuntu xenial) in workspace <https://builds.apache.org/job/dir-fortress-core-docker-test/ws/>
 > git rev-parse --is-inside-work-tree # timeout=10
Fetching changes from the remote Git repository
 > git config remote.origin.url https://git-wip-us.apache.org/repos/asf/directory-fortress-core.git # timeout=10
Fetching upstream changes from https://git-wip-us.apache.org/repos/asf/directory-fortress-core.git
 > git --version # timeout=10
 > git fetch --tags --progress https://git-wip-us.apache.org/repos/asf/directory-fortress-core.git +refs/heads/*:refs/remotes/origin/*
 > git rev-parse refs/remotes/origin/master^{commit} # timeout=10
 > git rev-parse refs/remotes/origin/origin/master^{commit} # timeout=10
Checking out Revision 3d77ad5377f3455fc9a749b34523c538edf0ceaf (refs/remotes/origin/master)
 > git config core.sparsecheckout # timeout=10
 > git checkout -f 3d77ad5377f3455fc9a749b34523c538edf0ceaf
 > git rev-list 017da896c1f820d85f215db80ee9742ba9d8e88e # timeout=10
[dir-fortress-core-docker-test] $ /bin/bash /tmp/hudson8624358460222774906.sh
Error response from daemon: No such container: dir-fortress-core-test-ubuntu-openldap
Error response from daemon: No such container: dir-fortress-core-test-ubuntu-openldap
Docker version 1.12.3, build 6b644ec
Using default tag: latest
latest: Pulling from apachedirectory/openldap-for-apache-fortress-tests
386a066cd84a: Already exists
a3ed95caeb02: Already exists
a3ed95caeb02: Already exists
fd3e0a2dc575: Already exists
46ac59bf7525: Already exists
eacabfc9d093: Already exists
0299602c4762: Already exists
0379e1b67a9d: Already exists
df7e5215927b: Already exists
caa5737d15ef: Already exists
89594c9aadba: Already exists
8efed4e7cea8: Already exists
0b6f7c352ee2: Already exists
a3ed95caeb02: Already exists
a3ed95caeb02: Already exists
Digest: sha256:03f757f5b2bcc5c7a86063ca343b0ad75201cb4e3f6d73accaf876190d800a7f
Status: Image is up to date for apachedirectory/openldap-for-apache-fortress-tests:latest
REPOSITORY                                           TAG                 IMAGE ID            CREATED             SIZE
apachedirectory/openldap-for-apache-fortress-tests   latest              d8d6052bc510        5 months ago        184.6 MB
4604cdab3fe4252a81188cd35617371126725e9c8a7b05388cb70dbad3567a37
[dir-fortress-core-docker-test] $ /home/jenkins/tools/maven/latest3/bin/mvn -Dmaven.repo.local=<https://builds.apache.org/job/dir-fortress-core-docker-test/ws/.repository> -U -V clean install
Apache Maven 3.3.9 (bb52d8502b132ec0a5a3f4c09453c07478323dc5; 2015-11-10T16:41:47+00:00)
Maven home: /home/jenkins/tools/maven/latest3
Java version: 1.7.0_80, vendor: Oracle Corporation
Java home: /usr/local/asfpackages/java/jdk1.7.0_80/jre
Default locale: en_US, platform encoding: ISO-8859-1
OS name: "linux", version: "4.4.0-43-generic", arch: "amd64", family: "unix"
[INFO] Scanning for projects...
[INFO]                                                                         
[INFO] ------------------------------------------------------------------------
[INFO] Building Apache Fortress Core 2.0.0-RC3-SNAPSHOT
[INFO] ------------------------------------------------------------------------
[INFO] 
[INFO] --- maven-clean-plugin:2.6.1:clean (default-clean) @ fortress-core ---
[INFO] Deleting <https://builds.apache.org/job/dir-fortress-core-docker-test/ws/target>
[INFO] 
[INFO] --- maven-resources-plugin:2.7:copy-resources (copy-resources) @ fortress-core ---
[INFO] Using 'UTF-8' encoding to copy filtered resources.
[INFO] Copying 8 resources
[INFO] 
[INFO] --- maven-remote-resources-plugin:1.5:process (default) @ fortress-core ---
[INFO] 
[INFO] --- maven-resources-plugin:2.7:resources (default-resources) @ fortress-core ---
[INFO] Using 'UTF-8' encoding to copy filtered resources.
[INFO] Copying 8 resources
[INFO] Copying 3 resources
[INFO] 
[INFO] --- maven-compiler-plugin:3.3:compile (default-compile) @ fortress-core ---
[INFO] Changes detected - recompiling the module!
[INFO] Compiling 236 source files to <https://builds.apache.org/job/dir-fortress-core-docker-test/ws/target/classes>
[INFO] ------------------------------------------------------------------------
[INFO] BUILD FAILURE
[INFO] ------------------------------------------------------------------------
[INFO] Total time: 8.951 s
[INFO] Finished at: 2017-05-07T01:01:58+00:00
[INFO] Final Memory: 22M/483M
[INFO] ------------------------------------------------------------------------
[ERROR] Failed to execute goal org.apache.maven.plugins:maven-compiler-plugin:3.3:compile (default-compile) on project fortress-core: Fatal error compiling: invalid target release: 1.8 -> [Help 1]
[ERROR] 
[ERROR] To see the full stack trace of the errors, re-run Maven with the -e switch.
[ERROR] Re-run Maven using the -X switch to enable full debug logging.
[ERROR] 
[ERROR] For more information about the errors and possible solutions, please read the following articles:
[ERROR] [Help 1] http://cwiki.apache.org/confluence/display/MAVEN/MojoExecutionException
Build step 'Invoke top-level Maven targets' marked build as failure
[dir-fortress-core-docker-test] $ /bin/bash /tmp/hudson5122032613605126301.sh
dir-fortress-core-test-ubuntu-openldap
dir-fortress-core-test-ubuntu-openldap
CONTAINER ID        IMAGE                         COMMAND                  CREATED             STATUS              PORTS               NAMES
232bb85232bf        madlib/postgres_9.6:jenkins   "docker-entrypoint.sh"   10 days ago         Up 10 days          5432/tcp            madlib

Build failed in Jenkins: dir-fortress-core-docker-test #340

Posted by Apache Jenkins Server <je...@builds.apache.org>.
See <https://builds.apache.org/job/dir-fortress-core-docker-test/340/display/redirect>

------------------------------------------
Started by timer
[EnvInject] - Loading node environment variables.
Building remotely on qnode3 (ubuntu) in workspace <https://builds.apache.org/job/dir-fortress-core-docker-test/ws/>
 > git rev-parse --is-inside-work-tree # timeout=10
Fetching changes from the remote Git repository
 > git config remote.origin.url https://git-wip-us.apache.org/repos/asf/directory-fortress-core.git # timeout=10
Fetching upstream changes from https://git-wip-us.apache.org/repos/asf/directory-fortress-core.git
 > git --version # timeout=10
 > git fetch --tags --progress https://git-wip-us.apache.org/repos/asf/directory-fortress-core.git +refs/heads/*:refs/remotes/origin/*
 > git rev-parse refs/remotes/origin/master^{commit} # timeout=10
 > git rev-parse refs/remotes/origin/origin/master^{commit} # timeout=10
Checking out Revision 017da896c1f820d85f215db80ee9742ba9d8e88e (refs/remotes/origin/master)
 > git config core.sparsecheckout # timeout=10
 > git checkout -f 017da896c1f820d85f215db80ee9742ba9d8e88e
 > git rev-list 017da896c1f820d85f215db80ee9742ba9d8e88e # timeout=10
[dir-fortress-core-docker-test] $ /bin/bash /tmp/hudson3210656148482160349.sh
Error response from daemon: No such container: dir-fortress-core-test-ubuntu-openldap
Error response from daemon: No such container: dir-fortress-core-test-ubuntu-openldap
Docker version 17.03.0-ce, build 60ccb22
Using default tag: latest
latest: Pulling from apachedirectory/openldap-for-apache-fortress-tests
386a066cd84a: Pulling fs layer
a3ed95caeb02: Pulling fs layer
fd3e0a2dc575: Pulling fs layer
46ac59bf7525: Pulling fs layer
eacabfc9d093: Pulling fs layer
0299602c4762: Pulling fs layer
0379e1b67a9d: Pulling fs layer
eacabfc9d093: Waiting
0299602c4762: Waiting
46ac59bf7525: Waiting
fd3e0a2dc575: Waiting
df7e5215927b: Pulling fs layer
caa5737d15ef: Pulling fs layer
0379e1b67a9d: Waiting
df7e5215927b: Waiting
89594c9aadba: Pulling fs layer
8efed4e7cea8: Pulling fs layer
89594c9aadba: Waiting
8efed4e7cea8: Waiting
0b6f7c352ee2: Pulling fs layer
0b6f7c352ee2: Waiting
a3ed95caeb02: Verifying Checksum
fd3e0a2dc575: Download complete
eacabfc9d093: Verifying Checksum
eacabfc9d093: Download complete
46ac59bf7525: Verifying Checksum
46ac59bf7525: Download complete
0299602c4762: Verifying Checksum
0379e1b67a9d: Download complete
386a066cd84a: Download complete
caa5737d15ef: Verifying Checksum
caa5737d15ef: Download complete
89594c9aadba: Verifying Checksum
89594c9aadba: Download complete
df7e5215927b: Verifying Checksum
df7e5215927b: Download complete
0b6f7c352ee2: Download complete
8efed4e7cea8: Verifying Checksum
8efed4e7cea8: Download complete
386a066cd84a: Pull complete
a3ed95caeb02: Pull complete
fd3e0a2dc575: Pull complete
46ac59bf7525: Pull complete
eacabfc9d093: Pull complete
0299602c4762: Pull complete
0379e1b67a9d: Pull complete
df7e5215927b: Pull complete
caa5737d15ef: Pull complete
89594c9aadba: Pull complete
8efed4e7cea8: Pull complete
0b6f7c352ee2: Pull complete
Digest: sha256:03f757f5b2bcc5c7a86063ca343b0ad75201cb4e3f6d73accaf876190d800a7f
Status: Downloaded newer image for apachedirectory/openldap-for-apache-fortress-tests:latest
REPOSITORY                                           TAG                 IMAGE ID            CREATED             SIZE
apachedirectory/openldap-for-apache-fortress-tests   latest              d8d6052bc510        5 months ago        185 MB
ecb3dcf2a5b9674779022cbc0e1a8c12d64bcde9622ebb796c6c5b5259b8ff0e
[dir-fortress-core-docker-test] $ /home/jenkins/tools/maven/latest3/bin/mvn -Dmaven.repo.local=<https://builds.apache.org/job/dir-fortress-core-docker-test/ws/.repository> -U -V clean install
Apache Maven 3.3.9 (bb52d8502b132ec0a5a3f4c09453c07478323dc5; 2015-11-10T16:41:47+00:00)
Maven home: /home/jenkins/tools/maven/latest3
Java version: 1.7.0_80, vendor: Oracle Corporation
Java home: /usr/local/asfpackages/java/jdk1.7.0_80/jre
Default locale: en_US, platform encoding: UTF-8
OS name: "linux", version: "4.8.3-std-1", arch: "amd64", family: "unix"
[INFO] Scanning for projects...
[INFO]                                                                         
[INFO] ------------------------------------------------------------------------
[INFO] Building Apache Fortress Core 2.0.0-RC3-SNAPSHOT
[INFO] ------------------------------------------------------------------------
[INFO] 
[INFO] --- maven-clean-plugin:2.6.1:clean (default-clean) @ fortress-core ---
[INFO] Deleting <https://builds.apache.org/job/dir-fortress-core-docker-test/ws/target>
[INFO] 
[INFO] --- maven-resources-plugin:2.7:copy-resources (copy-resources) @ fortress-core ---
[INFO] Using 'UTF-8' encoding to copy filtered resources.
[INFO] Copying 8 resources
[INFO] 
[INFO] --- maven-remote-resources-plugin:1.5:process (default) @ fortress-core ---
[INFO] 
[INFO] --- maven-resources-plugin:2.7:resources (default-resources) @ fortress-core ---
[INFO] Using 'UTF-8' encoding to copy filtered resources.
[INFO] Copying 8 resources
[INFO] Copying 3 resources
[INFO] 
[INFO] --- maven-compiler-plugin:3.3:compile (default-compile) @ fortress-core ---
[INFO] Changes detected - recompiling the module!
[INFO] Compiling 236 source files to <https://builds.apache.org/job/dir-fortress-core-docker-test/ws/target/classes>
[INFO] ------------------------------------------------------------------------
[INFO] BUILD FAILURE
[INFO] ------------------------------------------------------------------------
[INFO] Total time: 20.228 s
[INFO] Finished at: 2017-05-04T05:28:55+00:00
[INFO] Final Memory: 21M/475M
[INFO] ------------------------------------------------------------------------
[ERROR] Failed to execute goal org.apache.maven.plugins:maven-compiler-plugin:3.3:compile (default-compile) on project fortress-core: Fatal error compiling: invalid target release: 1.8 -> [Help 1]
[ERROR] 
[ERROR] To see the full stack trace of the errors, re-run Maven with the -e switch.
[ERROR] Re-run Maven using the -X switch to enable full debug logging.
[ERROR] 
[ERROR] For more information about the errors and possible solutions, please read the following articles:
[ERROR] [Help 1] http://cwiki.apache.org/confluence/display/MAVEN/MojoExecutionException
Build step 'Invoke top-level Maven targets' marked build as failure
[dir-fortress-core-docker-test] $ /bin/bash /tmp/hudson2032261581708210457.sh
dir-fortress-core-test-ubuntu-openldap
dir-fortress-core-test-ubuntu-openldap
CONTAINER ID        IMAGE                         COMMAND                  CREATED             STATUS              PORTS               NAMES
4ba2791dfe56        yetus/hbase:tp-21229          "/bin/sh -c /testp..."   3 hours ago         Up 3 hours                              yetus_tp-21229
2770f40d166a        madlib/postgres_9.6:jenkins   "docker-entrypoint..."   4 hours ago         Up 4 hours          5432/tcp            madlib

Build failed in Jenkins: dir-fortress-core-docker-test #339

Posted by Apache Jenkins Server <je...@builds.apache.org>.
See <https://builds.apache.org/job/dir-fortress-core-docker-test/339/display/redirect?page=changes>

Changes:

[smckinney] [maven-release-plugin] prepare for next development iteration

------------------------------------------
Started by an SCM change
[EnvInject] - Loading node environment variables.
Building remotely on qnode3 (ubuntu) in workspace <https://builds.apache.org/job/dir-fortress-core-docker-test/ws/>
 > git rev-parse --is-inside-work-tree # timeout=10
Fetching changes from the remote Git repository
 > git config remote.origin.url https://git-wip-us.apache.org/repos/asf/directory-fortress-core.git # timeout=10
Fetching upstream changes from https://git-wip-us.apache.org/repos/asf/directory-fortress-core.git
 > git --version # timeout=10
 > git fetch --tags --progress https://git-wip-us.apache.org/repos/asf/directory-fortress-core.git +refs/heads/*:refs/remotes/origin/*
 > git rev-parse refs/remotes/origin/master^{commit} # timeout=10
 > git rev-parse refs/remotes/origin/origin/master^{commit} # timeout=10
Checking out Revision 017da896c1f820d85f215db80ee9742ba9d8e88e (refs/remotes/origin/master)
 > git config core.sparsecheckout # timeout=10
 > git checkout -f 017da896c1f820d85f215db80ee9742ba9d8e88e
 > git rev-list 1cf42ce56b700b8b46d5ca2df168f334b1e90e20 # timeout=10
[dir-fortress-core-docker-test] $ /bin/bash /tmp/hudson3949138793565124695.sh
Error response from daemon: No such container: dir-fortress-core-test-ubuntu-openldap
Error response from daemon: No such container: dir-fortress-core-test-ubuntu-openldap
Docker version 17.03.0-ce, build 60ccb22
Using default tag: latest
latest: Pulling from apachedirectory/openldap-for-apache-fortress-tests
386a066cd84a: Already exists
a3ed95caeb02: Already exists
a3ed95caeb02: Already exists
fd3e0a2dc575: Already exists
46ac59bf7525: Already exists
eacabfc9d093: Already exists
0299602c4762: Already exists
0379e1b67a9d: Already exists
df7e5215927b: Already exists
caa5737d15ef: Already exists
89594c9aadba: Already exists
8efed4e7cea8: Already exists
0b6f7c352ee2: Already exists
a3ed95caeb02: Already exists
a3ed95caeb02: Already exists
Digest: sha256:03f757f5b2bcc5c7a86063ca343b0ad75201cb4e3f6d73accaf876190d800a7f
Status: Image is up to date for apachedirectory/openldap-for-apache-fortress-tests:latest
REPOSITORY                                           TAG                 IMAGE ID            CREATED             SIZE
apachedirectory/openldap-for-apache-fortress-tests   latest              d8d6052bc510        5 months ago        185 MB
af53c53bfa0dce7c9d4e8e85e44b800d0f199edb662d7168eca205ee93259908
[dir-fortress-core-docker-test] $ /home/jenkins/tools/maven/latest3/bin/mvn -Dmaven.repo.local=<https://builds.apache.org/job/dir-fortress-core-docker-test/ws/.repository> -U -V clean install
Apache Maven 3.3.9 (bb52d8502b132ec0a5a3f4c09453c07478323dc5; 2015-11-10T16:41:47+00:00)
Maven home: /home/jenkins/tools/maven/latest3
Java version: 1.7.0_80, vendor: Oracle Corporation
Java home: /usr/local/asfpackages/java/jdk1.7.0_80/jre
Default locale: en_US, platform encoding: UTF-8
OS name: "linux", version: "4.8.3-std-1", arch: "amd64", family: "unix"
[INFO] Scanning for projects...
[INFO]                                                                         
[INFO] ------------------------------------------------------------------------
[INFO] Building Apache Fortress Core 2.0.0-RC3-SNAPSHOT
[INFO] ------------------------------------------------------------------------
[INFO] 
[INFO] --- maven-clean-plugin:2.6.1:clean (default-clean) @ fortress-core ---
[INFO] Deleting <https://builds.apache.org/job/dir-fortress-core-docker-test/ws/target>
[INFO] 
[INFO] --- maven-resources-plugin:2.7:copy-resources (copy-resources) @ fortress-core ---
[INFO] Using 'UTF-8' encoding to copy filtered resources.
[INFO] Copying 8 resources
[INFO] 
[INFO] --- maven-remote-resources-plugin:1.5:process (default) @ fortress-core ---
[INFO] 
[INFO] --- maven-resources-plugin:2.7:resources (default-resources) @ fortress-core ---
[INFO] Using 'UTF-8' encoding to copy filtered resources.
[INFO] Copying 8 resources
[INFO] Copying 3 resources
[INFO] 
[INFO] --- maven-compiler-plugin:3.3:compile (default-compile) @ fortress-core ---
[INFO] Changes detected - recompiling the module!
[INFO] Compiling 236 source files to <https://builds.apache.org/job/dir-fortress-core-docker-test/ws/target/classes>
[INFO] ------------------------------------------------------------------------
[INFO] BUILD FAILURE
[INFO] ------------------------------------------------------------------------
[INFO] Total time: 16.169 s
[INFO] Finished at: 2017-05-03T23:48:26+00:00
[INFO] Final Memory: 21M/476M
[INFO] ------------------------------------------------------------------------
[ERROR] Failed to execute goal org.apache.maven.plugins:maven-compiler-plugin:3.3:compile (default-compile) on project fortress-core: Fatal error compiling: invalid target release: 1.8 -> [Help 1]
[ERROR] 
[ERROR] To see the full stack trace of the errors, re-run Maven with the -e switch.
[ERROR] Re-run Maven using the -X switch to enable full debug logging.
[ERROR] 
[ERROR] For more information about the errors and possible solutions, please read the following articles:
[ERROR] [Help 1] http://cwiki.apache.org/confluence/display/MAVEN/MojoExecutionException
Build step 'Invoke top-level Maven targets' marked build as failure
[dir-fortress-core-docker-test] $ /bin/bash /tmp/hudson1224195383408228340.sh
dir-fortress-core-test-ubuntu-openldap
dir-fortress-core-test-ubuntu-openldap
CONTAINER ID        IMAGE                         COMMAND                  CREATED             STATUS              PORTS               NAMES
ff7558c0ef47        madlib/postgres_9.6:jenkins   "docker-entrypoint..."   12 days ago         Up 12 days          5432/tcp            madlib

Build failed in Jenkins: dir-fortress-core-docker-test #338

Posted by Apache Jenkins Server <je...@builds.apache.org>.
See <https://builds.apache.org/job/dir-fortress-core-docker-test/338/display/redirect?page=changes>

Changes:

[smckinney] [maven-release-plugin] prepare release 2.0.0-RC2

------------------------------------------
Started by an SCM change
[EnvInject] - Loading node environment variables.
Building remotely on qnode3 (ubuntu) in workspace <https://builds.apache.org/job/dir-fortress-core-docker-test/ws/>
 > git rev-parse --is-inside-work-tree # timeout=10
Fetching changes from the remote Git repository
 > git config remote.origin.url https://git-wip-us.apache.org/repos/asf/directory-fortress-core.git # timeout=10
Fetching upstream changes from https://git-wip-us.apache.org/repos/asf/directory-fortress-core.git
 > git --version # timeout=10
 > git fetch --tags --progress https://git-wip-us.apache.org/repos/asf/directory-fortress-core.git +refs/heads/*:refs/remotes/origin/*
 > git rev-parse refs/remotes/origin/master^{commit} # timeout=10
 > git rev-parse refs/remotes/origin/origin/master^{commit} # timeout=10
Checking out Revision 1cf42ce56b700b8b46d5ca2df168f334b1e90e20 (refs/remotes/origin/master)
 > git config core.sparsecheckout # timeout=10
 > git checkout -f 1cf42ce56b700b8b46d5ca2df168f334b1e90e20
 > git rev-list ca651408b9f38735c955ab39ba1261563dc293b1 # timeout=10
[dir-fortress-core-docker-test] $ /bin/bash /tmp/hudson5537053222347052007.sh
Error response from daemon: No such container: dir-fortress-core-test-ubuntu-openldap
Error response from daemon: No such container: dir-fortress-core-test-ubuntu-openldap
Docker version 17.03.0-ce, build 60ccb22
Using default tag: latest
latest: Pulling from apachedirectory/openldap-for-apache-fortress-tests
386a066cd84a: Already exists
a3ed95caeb02: Already exists
a3ed95caeb02: Already exists
fd3e0a2dc575: Already exists
46ac59bf7525: Already exists
eacabfc9d093: Already exists
0299602c4762: Already exists
0379e1b67a9d: Already exists
df7e5215927b: Already exists
caa5737d15ef: Already exists
89594c9aadba: Already exists
8efed4e7cea8: Already exists
0b6f7c352ee2: Already exists
a3ed95caeb02: Already exists
a3ed95caeb02: Already exists
Digest: sha256:03f757f5b2bcc5c7a86063ca343b0ad75201cb4e3f6d73accaf876190d800a7f
Status: Image is up to date for apachedirectory/openldap-for-apache-fortress-tests:latest
REPOSITORY                                           TAG                 IMAGE ID            CREATED             SIZE
apachedirectory/openldap-for-apache-fortress-tests   latest              d8d6052bc510        5 months ago        185 MB
bf1475e2fa4a6e2760af25d86e613f42cbd89b7b48bc73286191668719a49363
[dir-fortress-core-docker-test] $ /home/jenkins/tools/maven/latest3/bin/mvn -Dmaven.repo.local=<https://builds.apache.org/job/dir-fortress-core-docker-test/ws/.repository> -U -V clean install
Apache Maven 3.3.9 (bb52d8502b132ec0a5a3f4c09453c07478323dc5; 2015-11-10T16:41:47+00:00)
Maven home: /home/jenkins/tools/maven/latest3
Java version: 1.7.0_80, vendor: Oracle Corporation
Java home: /usr/local/asfpackages/java/jdk1.7.0_80/jre
Default locale: en_US, platform encoding: UTF-8
OS name: "linux", version: "4.8.3-std-1", arch: "amd64", family: "unix"
[INFO] Scanning for projects...
[INFO]                                                                         
[INFO] ------------------------------------------------------------------------
[INFO] Building Apache Fortress Core 2.0.0-RC2
[INFO] ------------------------------------------------------------------------
[INFO] 
[INFO] --- maven-clean-plugin:2.6.1:clean (default-clean) @ fortress-core ---
[INFO] Deleting <https://builds.apache.org/job/dir-fortress-core-docker-test/ws/target>
[INFO] 
[INFO] --- maven-resources-plugin:2.7:copy-resources (copy-resources) @ fortress-core ---
[INFO] Using 'UTF-8' encoding to copy filtered resources.
[INFO] Copying 8 resources
[INFO] 
[INFO] --- maven-remote-resources-plugin:1.5:process (default) @ fortress-core ---
[INFO] 
[INFO] --- maven-resources-plugin:2.7:resources (default-resources) @ fortress-core ---
[INFO] Using 'UTF-8' encoding to copy filtered resources.
[INFO] Copying 8 resources
[INFO] Copying 3 resources
[INFO] 
[INFO] --- maven-compiler-plugin:3.3:compile (default-compile) @ fortress-core ---
[INFO] Changes detected - recompiling the module!
[INFO] Compiling 236 source files to <https://builds.apache.org/job/dir-fortress-core-docker-test/ws/target/classes>
[INFO] ------------------------------------------------------------------------
[INFO] BUILD FAILURE
[INFO] ------------------------------------------------------------------------
[INFO] Total time: 16.596 s
[INFO] Finished at: 2017-05-03T23:47:53+00:00
[INFO] Final Memory: 21M/477M
[INFO] ------------------------------------------------------------------------
[ERROR] Failed to execute goal org.apache.maven.plugins:maven-compiler-plugin:3.3:compile (default-compile) on project fortress-core: Fatal error compiling: invalid target release: 1.8 -> [Help 1]
[ERROR] 
[ERROR] To see the full stack trace of the errors, re-run Maven with the -e switch.
[ERROR] Re-run Maven using the -X switch to enable full debug logging.
[ERROR] 
[ERROR] For more information about the errors and possible solutions, please read the following articles:
[ERROR] [Help 1] http://cwiki.apache.org/confluence/display/MAVEN/MojoExecutionException
Build step 'Invoke top-level Maven targets' marked build as failure
[dir-fortress-core-docker-test] $ /bin/bash /tmp/hudson6023140654401573224.sh
dir-fortress-core-test-ubuntu-openldap
dir-fortress-core-test-ubuntu-openldap
CONTAINER ID        IMAGE                         COMMAND                  CREATED             STATUS              PORTS               NAMES
ff7558c0ef47        madlib/postgres_9.6:jenkins   "docker-entrypoint..."   12 days ago         Up 12 days          5432/tcp            madlib

Build failed in Jenkins: dir-fortress-core-docker-test #337

Posted by Apache Jenkins Server <je...@builds.apache.org>.
See <https://builds.apache.org/job/dir-fortress-core-docker-test/337/display/redirect?page=changes>

Changes:

[smckinney] 2.0.0-RC2-SNAPSHOT release preps

------------------------------------------
Started by an SCM change
[EnvInject] - Loading node environment variables.
Building remotely on qnode3 (ubuntu) in workspace <https://builds.apache.org/job/dir-fortress-core-docker-test/ws/>
 > git rev-parse --is-inside-work-tree # timeout=10
Fetching changes from the remote Git repository
 > git config remote.origin.url https://git-wip-us.apache.org/repos/asf/directory-fortress-core.git # timeout=10
Fetching upstream changes from https://git-wip-us.apache.org/repos/asf/directory-fortress-core.git
 > git --version # timeout=10
 > git fetch --tags --progress https://git-wip-us.apache.org/repos/asf/directory-fortress-core.git +refs/heads/*:refs/remotes/origin/*
 > git rev-parse refs/remotes/origin/master^{commit} # timeout=10
 > git rev-parse refs/remotes/origin/origin/master^{commit} # timeout=10
Checking out Revision ca651408b9f38735c955ab39ba1261563dc293b1 (refs/remotes/origin/master)
 > git config core.sparsecheckout # timeout=10
 > git checkout -f ca651408b9f38735c955ab39ba1261563dc293b1
 > git rev-list 1453608d85347c591a2e82247311378cf0d9af9c # timeout=10
[dir-fortress-core-docker-test] $ /bin/bash /tmp/hudson5796006732619924788.sh
Error response from daemon: No such container: dir-fortress-core-test-ubuntu-openldap
Error response from daemon: No such container: dir-fortress-core-test-ubuntu-openldap
Docker version 17.03.0-ce, build 60ccb22
Using default tag: latest
latest: Pulling from apachedirectory/openldap-for-apache-fortress-tests
386a066cd84a: Already exists
a3ed95caeb02: Already exists
a3ed95caeb02: Already exists
fd3e0a2dc575: Already exists
46ac59bf7525: Already exists
eacabfc9d093: Already exists
0299602c4762: Already exists
0379e1b67a9d: Already exists
df7e5215927b: Already exists
caa5737d15ef: Already exists
89594c9aadba: Already exists
8efed4e7cea8: Already exists
0b6f7c352ee2: Already exists
a3ed95caeb02: Already exists
a3ed95caeb02: Already exists
Digest: sha256:03f757f5b2bcc5c7a86063ca343b0ad75201cb4e3f6d73accaf876190d800a7f
Status: Image is up to date for apachedirectory/openldap-for-apache-fortress-tests:latest
REPOSITORY                                           TAG                 IMAGE ID            CREATED             SIZE
apachedirectory/openldap-for-apache-fortress-tests   latest              d8d6052bc510        5 months ago        185 MB
d2e467173787cb69c056c602977e6e34212465a1bf3e94173af38cb374154f2e
[dir-fortress-core-docker-test] $ /home/jenkins/tools/maven/latest3/bin/mvn -Dmaven.repo.local=<https://builds.apache.org/job/dir-fortress-core-docker-test/ws/.repository> -U -V clean install
Apache Maven 3.3.9 (bb52d8502b132ec0a5a3f4c09453c07478323dc5; 2015-11-10T16:41:47+00:00)
Maven home: /home/jenkins/tools/maven/latest3
Java version: 1.7.0_80, vendor: Oracle Corporation
Java home: /usr/local/asfpackages/java/jdk1.7.0_80/jre
Default locale: en_US, platform encoding: UTF-8
OS name: "linux", version: "4.8.3-std-1", arch: "amd64", family: "unix"
[INFO] Scanning for projects...
[INFO]                                                                         
[INFO] ------------------------------------------------------------------------
[INFO] Building Apache Fortress Core 2.0.0-RC2-SNAPSHOT
[INFO] ------------------------------------------------------------------------
[INFO] 
[INFO] --- maven-clean-plugin:2.6.1:clean (default-clean) @ fortress-core ---
[INFO] Deleting <https://builds.apache.org/job/dir-fortress-core-docker-test/ws/target>
[INFO] 
[INFO] --- maven-resources-plugin:2.7:copy-resources (copy-resources) @ fortress-core ---
[INFO] Using 'UTF-8' encoding to copy filtered resources.
[INFO] Copying 8 resources
[INFO] 
[INFO] --- maven-remote-resources-plugin:1.5:process (default) @ fortress-core ---
[INFO] 
[INFO] --- maven-resources-plugin:2.7:resources (default-resources) @ fortress-core ---
[INFO] Using 'UTF-8' encoding to copy filtered resources.
[INFO] Copying 8 resources
[INFO] Copying 3 resources
[INFO] 
[INFO] --- maven-compiler-plugin:3.3:compile (default-compile) @ fortress-core ---
[INFO] Changes detected - recompiling the module!
[INFO] Compiling 236 source files to <https://builds.apache.org/job/dir-fortress-core-docker-test/ws/target/classes>
[INFO] ------------------------------------------------------------------------
[INFO] BUILD FAILURE
[INFO] ------------------------------------------------------------------------
[INFO] Total time: 16.063 s
[INFO] Finished at: 2017-05-03T23:45:28+00:00
[INFO] Final Memory: 21M/476M
[INFO] ------------------------------------------------------------------------
[ERROR] Failed to execute goal org.apache.maven.plugins:maven-compiler-plugin:3.3:compile (default-compile) on project fortress-core: Fatal error compiling: invalid target release: 1.8 -> [Help 1]
[ERROR] 
[ERROR] To see the full stack trace of the errors, re-run Maven with the -e switch.
[ERROR] Re-run Maven using the -X switch to enable full debug logging.
[ERROR] 
[ERROR] For more information about the errors and possible solutions, please read the following articles:
[ERROR] [Help 1] http://cwiki.apache.org/confluence/display/MAVEN/MojoExecutionException
Build step 'Invoke top-level Maven targets' marked build as failure
[dir-fortress-core-docker-test] $ /bin/bash /tmp/hudson2880553954222653574.sh
dir-fortress-core-test-ubuntu-openldap
dir-fortress-core-test-ubuntu-openldap
CONTAINER ID        IMAGE                         COMMAND                  CREATED             STATUS              PORTS               NAMES
ff7558c0ef47        madlib/postgres_9.6:jenkins   "docker-entrypoint..."   12 days ago         Up 12 days          5432/tcp            madlib