You are viewing a plain text version of this content. The canonical link for it is here.
Posted to builds@beam.apache.org by Apache Jenkins Server <je...@builds.apache.org> on 2020/02/27 12:04:44 UTC
Build failed in Jenkins: beam_PostCommit_Java_ValidatesRunner_Flink
#6801
See <https://builds.apache.org/job/beam_PostCommit_Java_ValidatesRunner_Flink/6801/display/redirect>
Changes:
------------------------------------------
Started by timer
Running as SYSTEM
[EnvInject] - Loading node environment variables.
Building remotely on apache-beam-jenkins-14 (beam) in workspace <https://builds.apache.org/job/beam_PostCommit_Java_ValidatesRunner_Flink/ws/>
No credentials specified
Wiping out workspace first.
Cloning the remote Git repository
Cloning repository https://github.com/apache/beam.git
> git init <https://builds.apache.org/job/beam_PostCommit_Java_ValidatesRunner_Flink/ws/src> # timeout=10
Fetching upstream changes from https://github.com/apache/beam.git
> git --version # timeout=10
> git fetch --tags --progress https://github.com/apache/beam.git +refs/heads/*:refs/remotes/origin/*
> git config remote.origin.url https://github.com/apache/beam.git # timeout=10
> git config --add remote.origin.fetch +refs/heads/*:refs/remotes/origin/* # timeout=10
> git config remote.origin.url https://github.com/apache/beam.git # timeout=10
Fetching upstream changes from https://github.com/apache/beam.git
> git fetch --tags --progress https://github.com/apache/beam.git +refs/heads/*:refs/remotes/origin/* +refs/pull/${ghprbPullId}/*:refs/remotes/origin/pr/${ghprbPullId}/*
> git rev-parse origin/master^{commit} # timeout=10
Checking out Revision 1856d8533c879ab236d0593be1f9c7fff41edd7f (origin/master)
> git config core.sparsecheckout # timeout=10
> git checkout -f 1856d8533c879ab236d0593be1f9c7fff41edd7f
Commit message: "Merge pull request #10811: [BEAM-9276] Create a class to encapsulate the steps required to submit a pipeline"
> git rev-list --no-walk 1856d8533c879ab236d0593be1f9c7fff41edd7f # timeout=10
No emails were triggered.
[EnvInject] - Executing scripts and injecting environment variables after the SCM step.
[EnvInject] - Injecting as environment variables the properties content
SPARK_LOCAL_IP=127.0.0.1
[EnvInject] - Variables injected successfully.
[Gradle] - Launching build.
[src] $ <https://builds.apache.org/job/beam_PostCommit_Java_ValidatesRunner_Flink/ws/src/gradlew> --continue --max-workers=12 -Dorg.gradle.jvmargs=-Xms2g -Dorg.gradle.jvmargs=-Xmx4g :runners:flink:1.9:validatesRunner
Starting a Gradle Daemon, 1 stopped Daemon could not be reused, use --status for details
> Task :buildSrc:compileJava NO-SOURCE
> Task :buildSrc:compileGroovy FROM-CACHE
> Task :buildSrc:pluginDescriptors
> Task :buildSrc:processResources
> Task :buildSrc:classes
> Task :buildSrc:jar
> Task :buildSrc:assemble
> Task :buildSrc:spotlessGroovy
> Task :buildSrc:spotlessGroovyCheck
> Task :buildSrc:spotlessGroovyGradle
> Task :buildSrc:spotlessGroovyGradleCheck
> Task :buildSrc:spotlessCheck
> Task :buildSrc:pluginUnderTestMetadata
> Task :buildSrc:compileTestJava NO-SOURCE
> Task :buildSrc:compileTestGroovy NO-SOURCE
> Task :buildSrc:processTestResources NO-SOURCE
> Task :buildSrc:testClasses UP-TO-DATE
> Task :buildSrc:test NO-SOURCE
> Task :buildSrc:validateTaskProperties FROM-CACHE
> Task :buildSrc:check
> Task :buildSrc:build
Configuration on demand is an incubating feature.
FAILURE: Build failed with an exception.
* What went wrong:
Could not determine the dependencies of task ':model:fn-execution:shadowJar'.
> Could not resolve all dependencies for configuration ':model:fn-execution:runtimeClasspath'.
> Problems writing to Binary store in /tmp/gradle3815665807581399642.bin (exist: true)
* Try:
Run with --stacktrace option to get the stack trace. Run with --info or --debug option to get more log output. Run with --scan to get full insights.
* Get more help at https://help.gradle.org
Deprecated Gradle features were used in this build, making it incompatible with Gradle 6.0.
Use '--warning-mode all' to show the individual deprecation warnings.
See https://docs.gradle.org/5.2.1/userguide/command_line_interface.html#sec:command_line_warnings
BUILD FAILED in 16s
A build scan cannot be produced as an error occurred spooling the build data.
Please report this problem via https://gradle.com/scans/help/plugin and include the following via copy/paste:
----------
Gradle version: 5.2.1
Plugin version: 2.3
java.lang.IllegalStateException: java.io.IOException: No space left on device
at com.gradle.scan.a.e.b.flush(SourceFile:233)
at com.gradle.scan.a.e.b.close(SourceFile:244)
at com.gradle.scan.a.e.c.close(SourceFile:66)
at com.gradle.scan.plugin.internal.n.a(SourceFile:78)
at com.gradle.scan.plugin.internal.e.c.c.b(SourceFile:125)
at com.gradle.scan.plugin.internal.e.c.c.a(SourceFile:117)
at com.gradle.scan.plugin.internal.o.a$a.a(SourceFile:30)
at com.gradle.scan.plugin.internal.o.a$a.a(SourceFile:19)
at com.gradle.scan.plugin.internal.o.a.c(SourceFile:60)
Caused by: java.io.IOException: No space left on device
at com.gradle.scan.a.e.b.flush(SourceFile:231)
... 8 more
----------
FAILURE: Build failed with an exception.
* What went wrong:
java.io.IOException: No space left on device
> No space left on device
* Try:
Run with --stacktrace option to get the stack trace. Run with --info or --debug option to get more log output. Run with --scan to get full insights.
* Get more help at https://help.gradle.org
Deprecated Gradle features were used in this build, making it incompatible with Gradle 6.0.
Use '--warning-mode all' to show the individual deprecation warnings.
See https://docs.gradle.org/5.2.1/userguide/command_line_interface.html#sec:command_line_warnings
BUILD FAILED in 17s
FAILURE: Build failed with an exception.
* What went wrong:
Could not write cache value to '/home/jenkins/.gradle/daemon/5.2.1/registry.bin'.
* Try:
Run with --stacktrace option to get the stack trace. Run with --info or --debug option to get more log output. Run with --scan to get full insights.
* Get more help at https://help.gradle.org
Build step 'Invoke Gradle script' changed build result to FAILURE
Build step 'Invoke Gradle script' marked build as failure
---------------------------------------------------------------------
To unsubscribe, e-mail: builds-unsubscribe@beam.apache.org
For additional commands, e-mail: builds-help@beam.apache.org
Jenkins build is back to normal :
beam_PostCommit_Java_ValidatesRunner_Flink #6803
Posted by Apache Jenkins Server <je...@builds.apache.org>.
See <https://builds.apache.org/job/beam_PostCommit_Java_ValidatesRunner_Flink/6803/display/redirect>
---------------------------------------------------------------------
To unsubscribe, e-mail: builds-unsubscribe@beam.apache.org
For additional commands, e-mail: builds-help@beam.apache.org
Build failed in Jenkins: beam_PostCommit_Java_ValidatesRunner_Flink
#6802
Posted by Apache Jenkins Server <je...@builds.apache.org>.
See <https://builds.apache.org/job/beam_PostCommit_Java_ValidatesRunner_Flink/6802/display/redirect?page=changes>
Changes:
[michal.walenia] [BEAM-9258] Add integration test for Cloud DLP
------------------------------------------
[...truncated 11.59 KB...]
> Task :sdks:java:core:processResources
> Task :sdks:java:core:generateTestAvroProtocol NO-SOURCE
> Task :sdks:java:build-tools:compileJava FROM-CACHE
> Task :sdks:java:build-tools:processResources
> Task :sdks:java:build-tools:classes
> Task :sdks:java:build-tools:jar
> Task :sdks:java:core:generateTestAvroJava
> Task :sdks:java:core:generateTestGrammarSource NO-SOURCE
> Task :sdks:java:core:processTestResources
> Task :model:pipeline:extractIncludeProto
> Task :model:pipeline:extractProto
> Task :model:pipeline:generateProto
> Task :model:pipeline:compileJava FROM-CACHE
> Task :model:pipeline:processResources
> Task :model:pipeline:classes
> Task :model:pipeline:jar
> Task :model:job-management:extractIncludeProto
> Task :model:fn-execution:extractIncludeProto
> Task :model:job-management:generateProto
> Task :model:fn-execution:generateProto
> Task :model:job-management:compileJava FROM-CACHE
> Task :model:job-management:classes
> Task :model:fn-execution:compileJava FROM-CACHE
> Task :model:fn-execution:classes
> Task :model:pipeline:shadowJar FAILED
ex
org.gradle.api.GradleException: Could not add file '<https://builds.apache.org/job/beam_PostCommit_Java_ValidatesRunner_Flink/ws/src/model/pipeline/build/classes/java/main/org/apache/beam/model/pipeline/v1/RunnerApi$TestStreamPayload$Event$AdvanceProcessingTime.class'> to ZIP '<https://builds.apache.org/job/beam_PostCommit_Java_ValidatesRunner_Flink/ws/src/model/pipeline/build/libs/beam-model-pipeline-2.20.0-SNAPSHOT.jar'.>
at sun.reflect.NativeConstructorAccessorImpl.newInstance0(Native Method)
at sun.reflect.NativeConstructorAccessorImpl.newInstance(NativeConstructorAccessorImpl.java:62)
at sun.reflect.DelegatingConstructorAccessorImpl.newInstance(DelegatingConstructorAccessorImpl.java:45)
at java.lang.reflect.Constructor.newInstance(Constructor.java:423)
at org.codehaus.groovy.reflection.CachedConstructor.invoke(CachedConstructor.java:83)
at org.codehaus.groovy.runtime.callsite.ConstructorSite$ConstructorSiteNoUnwrapNoCoerce.callConstructor(ConstructorSite.java:105)
at org.codehaus.groovy.runtime.callsite.CallSiteArray.defaultCallConstructor(CallSiteArray.java:59)
at org.codehaus.groovy.runtime.callsite.AbstractCallSite.callConstructor(AbstractCallSite.java:237)
at org.codehaus.groovy.runtime.callsite.AbstractCallSite.callConstructor(AbstractCallSite.java:257)
at com.github.jengelman.gradle.plugins.shadow.tasks.ShadowCopyAction$StreamAction.visitFile(ShadowCopyAction.groovy:245)
at sun.reflect.GeneratedMethodAccessor303.invoke(Unknown Source)
at sun.reflect.DelegatingMethodAccessorImpl.invoke(DelegatingMethodAccessorImpl.java:43)
at java.lang.reflect.Method.invoke(Method.java:498)
at org.codehaus.groovy.runtime.callsite.PlainObjectMetaMethodSite.doInvoke(PlainObjectMetaMethodSite.java:43)
at org.codehaus.groovy.runtime.callsite.PogoMetaMethodSite$PogoCachedMethodSiteNoUnwrapNoCoerce.invoke(PogoMetaMethodSite.java:190)
at org.codehaus.groovy.runtime.callsite.PogoMetaMethodSite.callCurrent(PogoMetaMethodSite.java:58)
at org.codehaus.groovy.runtime.callsite.AbstractCallSite.callCurrent(AbstractCallSite.java:168)
at com.github.jengelman.gradle.plugins.shadow.tasks.ShadowCopyAction$BaseStreamAction.processFile(ShadowCopyAction.groovy:183)
at org.gradle.api.internal.file.copy.NormalizingCopyActionDecorator$1$1.processFile(NormalizingCopyActionDecorator.java:66)
at org.gradle.api.internal.file.copy.DuplicateHandlingCopyActionDecorator$1$1.processFile(DuplicateHandlingCopyActionDecorator.java:60)
at org.gradle.api.internal.file.copy.CopyFileVisitorImpl.processFile(CopyFileVisitorImpl.java:62)
at org.gradle.api.internal.file.copy.CopyFileVisitorImpl.visitFile(CopyFileVisitorImpl.java:46)
at org.gradle.api.internal.file.collections.jdk7.Jdk7DirectoryWalker$1.visitFile(Jdk7DirectoryWalker.java:86)
at org.gradle.api.internal.file.collections.jdk7.Jdk7DirectoryWalker$1.visitFile(Jdk7DirectoryWalker.java:59)
at java.nio.file.Files.walkFileTree(Files.java:2670)
at org.gradle.api.internal.file.collections.jdk7.Jdk7DirectoryWalker.walkDir(Jdk7DirectoryWalker.java:59)
at org.gradle.api.internal.file.collections.DirectoryFileTree.walkDir(DirectoryFileTree.java:154)
at org.gradle.api.internal.file.collections.DirectoryFileTree.visitFrom(DirectoryFileTree.java:132)
at org.gradle.api.internal.file.collections.DirectoryFileTree.visit(DirectoryFileTree.java:117)
at org.gradle.api.internal.file.collections.FileTreeAdapter.visit(FileTreeAdapter.java:118)
at org.gradle.api.internal.file.CompositeFileTree.visit(CompositeFileTree.java:93)
at org.gradle.api.internal.file.copy.CopySpecActionImpl.execute(CopySpecActionImpl.java:39)
at org.gradle.api.internal.file.copy.CopySpecActionImpl.execute(CopySpecActionImpl.java:24)
at org.gradle.api.internal.file.copy.DefaultCopySpec$DefaultCopySpecResolver.walk(DefaultCopySpec.java:693)
at org.gradle.api.internal.file.copy.DefaultCopySpec$DefaultCopySpecResolver.walk(DefaultCopySpec.java:695)
at org.gradle.api.internal.file.copy.DefaultCopySpec.walk(DefaultCopySpec.java:499)
at org.gradle.api.internal.file.copy.CopySpecBackedCopyActionProcessingStream.process(CopySpecBackedCopyActionProcessingStream.java:38)
at org.gradle.api.internal.file.copy.DuplicateHandlingCopyActionDecorator$1.process(DuplicateHandlingCopyActionDecorator.java:44)
at org.gradle.api.internal.file.copy.NormalizingCopyActionDecorator$1.process(NormalizingCopyActionDecorator.java:57)
at org.gradle.api.internal.file.copy.CopyActionProcessingStream$process.call(Unknown Source)
at org.codehaus.groovy.runtime.callsite.CallSiteArray.defaultCall(CallSiteArray.java:47)
at org.codehaus.groovy.runtime.callsite.AbstractCallSite.call(AbstractCallSite.java:115)
at org.codehaus.groovy.runtime.callsite.AbstractCallSite.call(AbstractCallSite.java:127)
at com.github.jengelman.gradle.plugins.shadow.tasks.ShadowCopyAction$2.execute(ShadowCopyAction.groovy:110)
at com.github.jengelman.gradle.plugins.shadow.tasks.ShadowCopyAction$2$execute.call(Unknown Source)
at org.codehaus.groovy.runtime.callsite.CallSiteArray.defaultCall(CallSiteArray.java:47)
at org.codehaus.groovy.runtime.callsite.AbstractCallSite.call(AbstractCallSite.java:115)
at org.codehaus.groovy.runtime.callsite.AbstractCallSite.call(AbstractCallSite.java:127)
at com.github.jengelman.gradle.plugins.shadow.tasks.ShadowCopyAction.withResource(ShadowCopyAction.groovy:152)
at sun.reflect.NativeMethodAccessorImpl.invoke0(Native Method)
at sun.reflect.NativeMethodAccessorImpl.invoke(NativeMethodAccessorImpl.java:62)
at sun.reflect.DelegatingMethodAccessorImpl.invoke(DelegatingMethodAccessorImpl.java:43)
at java.lang.reflect.Method.invoke(Method.java:498)
at org.codehaus.groovy.reflection.CachedMethod.invoke(CachedMethod.java:104)
at org.codehaus.groovy.runtime.callsite.StaticMetaMethodSite$StaticMetaMethodSiteNoUnwrapNoCoerce.invoke(StaticMetaMethodSite.java:151)
at org.codehaus.groovy.runtime.callsite.StaticMetaMethodSite.callStatic(StaticMetaMethodSite.java:102)
at org.codehaus.groovy.runtime.callsite.CallSiteArray.defaultCallStatic(CallSiteArray.java:55)
at org.codehaus.groovy.runtime.callsite.AbstractCallSite.callStatic(AbstractCallSite.java:196)
at org.codehaus.groovy.runtime.callsite.AbstractCallSite.callStatic(AbstractCallSite.java:216)
at com.github.jengelman.gradle.plugins.shadow.tasks.ShadowCopyAction.execute(ShadowCopyAction.groovy:107)
at org.gradle.api.internal.file.copy.NormalizingCopyActionDecorator.execute(NormalizingCopyActionDecorator.java:53)
at org.gradle.api.internal.file.copy.DuplicateHandlingCopyActionDecorator.execute(DuplicateHandlingCopyActionDecorator.java:42)
at org.gradle.api.internal.file.copy.CopyActionExecuter.execute(CopyActionExecuter.java:40)
at org.gradle.api.tasks.AbstractCopyTask.copy(AbstractCopyTask.java:179)
at com.github.jengelman.gradle.plugins.shadow.tasks.ShadowJar.copy(ShadowJar.java:96)
at sun.reflect.NativeMethodAccessorImpl.invoke0(Native Method)
at sun.reflect.NativeMethodAccessorImpl.invoke(NativeMethodAccessorImpl.java:62)
at sun.reflect.DelegatingMethodAccessorImpl.invoke(DelegatingMethodAccessorImpl.java:43)
at java.lang.reflect.Method.invoke(Method.java:498)
at org.gradle.internal.reflect.JavaMethod.invoke(JavaMethod.java:103)
at org.gradle.api.internal.project.taskfactory.StandardTaskAction.doExecute(StandardTaskAction.java:48)
at org.gradle.api.internal.project.taskfactory.StandardTaskAction.execute(StandardTaskAction.java:41)
at org.gradle.api.internal.project.taskfactory.StandardTaskAction.execute(StandardTaskAction.java:28)
at org.gradle.api.internal.AbstractTask$TaskActionWrapper.execute(AbstractTask.java:705)
at org.gradle.api.internal.AbstractTask$TaskActionWrapper.execute(AbstractTask.java:672)
at org.gradle.api.internal.tasks.execution.ExecuteActionsTaskExecuter$4.run(ExecuteActionsTaskExecuter.java:338)
at org.gradle.internal.operations.DefaultBuildOperationExecutor$RunnableBuildOperationWorker.execute(DefaultBuildOperationExecutor.java:402)
at org.gradle.internal.operations.DefaultBuildOperationExecutor$RunnableBuildOperationWorker.execute(DefaultBuildOperationExecutor.java:394)
at org.gradle.internal.operations.DefaultBuildOperationExecutor$1.execute(DefaultBuildOperationExecutor.java:165)
at org.gradle.internal.operations.DefaultBuildOperationExecutor.execute(DefaultBuildOperationExecutor.java:250)
at org.gradle.internal.operations.DefaultBuildOperationExecutor.execute(DefaultBuildOperationExecutor.java:158)
at org.gradle.internal.operations.DefaultBuildOperationExecutor.run(DefaultBuildOperationExecutor.java:92)
at org.gradle.internal.operations.DelegatingBuildOperationExecutor.run(DelegatingBuildOperationExecutor.java:31)
at org.gradle.api.internal.tasks.execution.ExecuteActionsTaskExecuter.executeAction(ExecuteActionsTaskExecuter.java:327)
at org.gradle.api.internal.tasks.execution.ExecuteActionsTaskExecuter.executeActions(ExecuteActionsTaskExecuter.java:312)
at org.gradle.api.internal.tasks.execution.ExecuteActionsTaskExecuter.access$200(ExecuteActionsTaskExecuter.java:75)
at org.gradle.api.internal.tasks.execution.ExecuteActionsTaskExecuter$TaskExecution.execute(ExecuteActionsTaskExecuter.java:158)
at org.gradle.internal.execution.impl.steps.ExecuteStep.execute(ExecuteStep.java:46)
at org.gradle.internal.execution.impl.steps.CancelExecutionStep.execute(CancelExecutionStep.java:34)
at org.gradle.internal.execution.impl.steps.TimeoutStep.executeWithoutTimeout(TimeoutStep.java:69)
at org.gradle.internal.execution.impl.steps.TimeoutStep.execute(TimeoutStep.java:49)
at org.gradle.internal.execution.impl.steps.CatchExceptionStep.execute(CatchExceptionStep.java:34)
at org.gradle.internal.execution.impl.steps.CreateOutputsStep.execute(CreateOutputsStep.java:49)
at org.gradle.internal.execution.impl.steps.SnapshotOutputStep.execute(SnapshotOutputStep.java:42)
at org.gradle.internal.execution.impl.steps.SnapshotOutputStep.execute(SnapshotOutputStep.java:28)
at org.gradle.internal.execution.impl.steps.CacheStep.executeWithoutCache(CacheStep.java:133)
at org.gradle.internal.execution.impl.steps.CacheStep.lambda$execute$5(CacheStep.java:83)
at java.util.Optional.orElseGet(Optional.java:267)
at org.gradle.internal.execution.impl.steps.CacheStep.execute(CacheStep.java:82)
at org.gradle.internal.execution.impl.steps.CacheStep.execute(CacheStep.java:37)
at org.gradle.internal.execution.impl.steps.PrepareCachingStep.execute(PrepareCachingStep.java:33)
at org.gradle.internal.execution.impl.steps.StoreSnapshotsStep.execute(StoreSnapshotsStep.java:38)
at org.gradle.internal.execution.impl.steps.StoreSnapshotsStep.execute(StoreSnapshotsStep.java:23)
at org.gradle.internal.execution.impl.steps.SkipUpToDateStep.executeBecause(SkipUpToDateStep.java:95)
at org.gradle.internal.execution.impl.steps.SkipUpToDateStep.lambda$execute$1(SkipUpToDateStep.java:90)
at java.util.Optional.orElseGet(Optional.java:267)
at org.gradle.internal.execution.impl.steps.SkipUpToDateStep.execute(SkipUpToDateStep.java:90)
at org.gradle.internal.execution.impl.steps.SkipUpToDateStep.execute(SkipUpToDateStep.java:36)
at org.gradle.internal.execution.impl.DefaultWorkExecutor.execute(DefaultWorkExecutor.java:34)
at org.gradle.api.internal.tasks.execution.ExecuteActionsTaskExecuter.execute(ExecuteActionsTaskExecuter.java:109)
at org.gradle.api.internal.tasks.execution.ResolveIncrementalChangesTaskExecuter.execute(ResolveIncrementalChangesTaskExecuter.java:84)
at org.gradle.api.internal.tasks.execution.ResolveTaskOutputCachingStateExecuter.execute(ResolveTaskOutputCachingStateExecuter.java:91)
at org.gradle.api.internal.tasks.execution.FinishSnapshotTaskInputsBuildOperationTaskExecuter.execute(FinishSnapshotTaskInputsBuildOperationTaskExecuter.java:51)
at org.gradle.api.internal.tasks.execution.ResolveBuildCacheKeyExecuter.execute(ResolveBuildCacheKeyExecuter.java:102)
at org.gradle.api.internal.tasks.execution.ResolveBeforeExecutionStateTaskExecuter.execute(ResolveBeforeExecutionStateTaskExecuter.java:74)
at org.gradle.api.internal.tasks.execution.ValidatingTaskExecuter.execute(ValidatingTaskExecuter.java:58)
at org.gradle.api.internal.tasks.execution.SkipEmptySourceFilesTaskExecuter.execute(SkipEmptySourceFilesTaskExecuter.java:109)
at org.gradle.api.internal.tasks.execution.ResolveBeforeExecutionOutputsTaskExecuter.execute(ResolveBeforeExecutionOutputsTaskExecuter.java:67)
at org.gradle.api.internal.tasks.execution.StartSnapshotTaskInputsBuildOperationTaskExecuter.execute(StartSnapshotTaskInputsBuildOperationTaskExecuter.java:52)
at org.gradle.api.internal.tasks.execution.ResolveAfterPreviousExecutionStateTaskExecuter.execute(ResolveAfterPreviousExecutionStateTaskExecuter.java:46)
at org.gradle.api.internal.tasks.execution.CleanupStaleOutputsExecuter.execute(CleanupStaleOutputsExecuter.java:93)
at org.gradle.api.internal.tasks.execution.FinalizePropertiesTaskExecuter.execute(FinalizePropertiesTaskExecuter.java:45)
at org.gradle.api.internal.tasks.execution.ResolveTaskExecutionModeExecuter.execute(ResolveTaskExecutionModeExecuter.java:94)
at org.gradle.api.internal.tasks.execution.SkipTaskWithNoActionsExecuter.execute(SkipTaskWithNoActionsExecuter.java:57)
at org.gradle.api.internal.tasks.execution.SkipOnlyIfTaskExecuter.execute(SkipOnlyIfTaskExecuter.java:56)
at org.gradle.api.internal.tasks.execution.CatchExceptionTaskExecuter.execute(CatchExceptionTaskExecuter.java:36)
at org.gradle.api.internal.tasks.execution.EventFiringTaskExecuter$1.executeTask(EventFiringTaskExecuter.java:63)
at org.gradle.api.internal.tasks.execution.EventFiringTaskExecuter$1.call(EventFiringTaskExecuter.java:49)
at org.gradle.api.internal.tasks.execution.EventFiringTaskExecuter$1.call(EventFiringTaskExecuter.java:46)
at org.gradle.internal.operations.DefaultBuildOperationExecutor$CallableBuildOperationWorker.execute(DefaultBuildOperationExecutor.java:416)
at org.gradle.internal.operations.DefaultBuildOperationExecutor$CallableBuildOperationWorker.execute(DefaultBuildOperationExecutor.java:406)
at org.gradle.internal.operations.DefaultBuildOperationExecutor$1.execute(DefaultBuildOperationExecutor.java:165)
at org.gradle.internal.operations.DefaultBuildOperationExecutor.execute(DefaultBuildOperationExecutor.java:250)
at org.gradle.internal.operations.DefaultBuildOperationExecutor.execute(DefaultBuildOperationExecutor.java:158)
at org.gradle.internal.operations.DefaultBuildOperationExecutor.call(DefaultBuildOperationExecutor.java:102)
at org.gradle.internal.operations.DelegatingBuildOperationExecutor.call(DelegatingBuildOperationExecutor.java:36)
at org.gradle.api.internal.tasks.execution.EventFiringTaskExecuter.execute(EventFiringTaskExecuter.java:46)
at org.gradle.execution.plan.LocalTaskNodeExecutor.execute(LocalTaskNodeExecutor.java:43)
at org.gradle.execution.taskgraph.DefaultTaskExecutionGraph$InvokeNodeExecutorsAction.execute(DefaultTaskExecutionGraph.java:355)
at org.gradle.execution.taskgraph.DefaultTaskExecutionGraph$InvokeNodeExecutorsAction.execute(DefaultTaskExecutionGraph.java:343)
at org.gradle.execution.taskgraph.DefaultTaskExecutionGraph$BuildOperationAwareExecutionAction.execute(DefaultTaskExecutionGraph.java:336)
at org.gradle.execution.taskgraph.DefaultTaskExecutionGraph$BuildOperationAwareExecutionAction.execute(DefaultTaskExecutionGraph.java:322)
at org.gradle.execution.plan.DefaultPlanExecutor$ExecutorWorker$1.execute(DefaultPlanExecutor.java:134)
at org.gradle.execution.plan.DefaultPlanExecutor$ExecutorWorker$1.execute(DefaultPlanExecutor.java:129)
at org.gradle.execution.plan.DefaultPlanExecutor$ExecutorWorker.execute(DefaultPlanExecutor.java:202)
at org.gradle.execution.plan.DefaultPlanExecutor$ExecutorWorker.executeNextNode(DefaultPlanExecutor.java:193)
at org.gradle.execution.plan.DefaultPlanExecutor$ExecutorWorker.run(DefaultPlanExecutor.java:129)
at org.gradle.internal.concurrent.ExecutorPolicy$CatchAndRecordFailures.onExecute(ExecutorPolicy.java:63)
at org.gradle.internal.concurrent.ManagedExecutorImpl$1.run(ManagedExecutorImpl.java:46)
at java.util.concurrent.ThreadPoolExecutor.runWorker(ThreadPoolExecutor.java:1149)
at java.util.concurrent.ThreadPoolExecutor$Worker.run(ThreadPoolExecutor.java:624)
at org.gradle.internal.concurrent.ThreadFactoryImpl$ManagedThreadRunnable.run(ThreadFactoryImpl.java:55)
at java.lang.Thread.run(Thread.java:748)
Caused by: java.io.IOException: No space left on device
at java.io.RandomAccessFile.writeBytes(Native Method)
at java.io.RandomAccessFile.write(RandomAccessFile.java:525)
at shadow.org.apache.tools.zip.ZipOutputStream.writeOut(ZipOutputStream.java:1472)
at shadow.org.apache.tools.zip.ZipOutputStream.writeCounted(ZipOutputStream.java:898)
at shadow.org.apache.tools.zip.ZipOutputStream.deflate(ZipOutputStream.java:1003)
at shadow.org.apache.tools.zip.ZipOutputStream.flushDeflater(ZipOutputStream.java:578)
at shadow.org.apache.tools.zip.ZipOutputStream.closeEntry(ZipOutputStream.java:535)
at shadow.org.apache.tools.zip.ZipOutputStream$closeEntry$3.call(Unknown Source)
at com.github.jengelman.gradle.plugins.shadow.tasks.ShadowCopyAction$StreamAction.remapClass(ShadowCopyAction.groovy:365)
at sun.reflect.GeneratedMethodAccessor314.invoke(Unknown Source)
at sun.reflect.DelegatingMethodAccessorImpl.invoke(DelegatingMethodAccessorImpl.java:43)
at java.lang.reflect.Method.invoke(Method.java:498)
at org.codehaus.groovy.runtime.callsite.PlainObjectMetaMethodSite.doInvoke(PlainObjectMetaMethodSite.java:43)
at org.codehaus.groovy.runtime.callsite.PogoMetaMethodSite$PogoCachedMethodSiteNoUnwrapNoCoerce.invoke(PogoMetaMethodSite.java:190)
at org.codehaus.groovy.runtime.callsite.PogoMetaMethodSite.callCurrent(PogoMetaMethodSite.java:58)
at org.codehaus.groovy.runtime.callsite.AbstractCallSite.callCurrent(AbstractCallSite.java:184)
at com.github.jengelman.gradle.plugins.shadow.tasks.ShadowCopyAction$StreamAction.remapClass(ShadowCopyAction.groovy:330)
at sun.reflect.GeneratedMethodAccessor311.invoke(Unknown Source)
at sun.reflect.DelegatingMethodAccessorImpl.invoke(DelegatingMethodAccessorImpl.java:43)
at java.lang.reflect.Method.invoke(Method.java:498)
at org.codehaus.groovy.runtime.callsite.PlainObjectMetaMethodSite.doInvoke(PlainObjectMetaMethodSite.java:43)
at org.codehaus.groovy.runtime.callsite.PogoMetaMethodSite$PogoCachedMethodSiteNoUnwrapNoCoerce.invoke(PogoMetaMethodSite.java:190)
at org.codehaus.groovy.runtime.callsite.PogoMetaMethodSite.callCurrent(PogoMetaMethodSite.java:58)
at org.codehaus.groovy.runtime.callsite.AbstractCallSite.callCurrent(AbstractCallSite.java:168)
at com.github.jengelman.gradle.plugins.shadow.tasks.ShadowCopyAction$StreamAction.visitFile(ShadowCopyAction.groovy:241)
... 143 more
FAILURE: Build failed with an exception.
* What went wrong:
Execution failed for task ':model:pipeline:shadowJar'.
> Could not add file '<https://builds.apache.org/job/beam_PostCommit_Java_ValidatesRunner_Flink/ws/src/model/pipeline/build/classes/java/main/org/apache/beam/model/pipeline/v1/RunnerApi$TestStreamPayload$Event$AdvanceProcessingTime.class'> to ZIP '<https://builds.apache.org/job/beam_PostCommit_Java_ValidatesRunner_Flink/ws/src/model/pipeline/build/libs/beam-model-pipeline-2.20.0-SNAPSHOT.jar'.>
* Try:
Run with --stacktrace option to get the stack trace. Run with --info or --debug option to get more log output. Run with --scan to get full insights.
* Get more help at https://help.gradle.org
Deprecated Gradle features were used in this build, making it incompatible with Gradle 6.0.
Use '--warning-mode all' to show the individual deprecation warnings.
See https://docs.gradle.org/5.2.1/userguide/command_line_interface.html#sec:command_line_warnings
BUILD FAILED in 51s
26 actionable tasks: 21 executed, 5 from cache
Publishing build scan...
https://gradle.com/s/w5z5a72d63d44
FAILURE: Build failed with an exception.
* What went wrong:
Could not add entry ':model:pipeline:shadowJar' to cache executionHistory.bin (<https://builds.apache.org/job/beam_PostCommit_Java_ValidatesRunner_Flink/ws/src/.gradle/5.2.1/executionHistory/executionHistory.bin).>
> java.io.IOException: No space left on device
* Try:
Run with --stacktrace option to get the stack trace. Run with --info or --debug option to get more log output. Run with --scan to get full insights.
* Get more help at https://help.gradle.org
Deprecated Gradle features were used in this build, making it incompatible with Gradle 6.0.
Use '--warning-mode all' to show the individual deprecation warnings.
See https://docs.gradle.org/5.2.1/userguide/command_line_interface.html#sec:command_line_warnings
BUILD FAILED in 53s
Build step 'Invoke Gradle script' changed build result to FAILURE
Build step 'Invoke Gradle script' marked build as failure
---------------------------------------------------------------------
To unsubscribe, e-mail: builds-unsubscribe@beam.apache.org
For additional commands, e-mail: builds-help@beam.apache.org