You are viewing a plain text version of this content. The canonical link for it is here.
Posted to builds@beam.apache.org by Apache Jenkins Server <je...@builds.apache.org> on 2020/08/24 19:21:03 UTC

Build failed in Jenkins: beam_PostCommit_Java #6512

See <https://ci-beam.apache.org/job/beam_PostCommit_Java/6512/display/redirect?page=changes>

Changes:

[Udi Meiri] Silence red PYTHONPATH warning from tox

[tobiasz.kedzierski] [BEAM-10682] Add workflow to run Java tests on Linux/Windows/Mac


------------------------------------------
[...truncated 29.27 KB...]
> Task :sdks:java:extensions:protobuf:classes UP-TO-DATE
> Task :sdks:java:extensions:protobuf:jar
> Task :sdks:java:extensions:google-cloud-platform-core:jar
> Task :runners:core-construction-java:compileJava FROM-CACHE
> Task :runners:core-construction-java:classes UP-TO-DATE
> Task :runners:core-construction-java:jar
> Task :sdks:java:testing:test-utils:compileJava FROM-CACHE
> Task :sdks:java:testing:test-utils:classes UP-TO-DATE
> Task :sdks:java:testing:test-utils:jar
> Task :runners:core-java:compileJava FROM-CACHE
> Task :runners:core-java:classes UP-TO-DATE
> Task :runners:core-java:jar
> Task :sdks:java:harness:compileJava FROM-CACHE
> Task :sdks:java:harness:classes UP-TO-DATE
> Task :sdks:java:harness:jar

> Task :sdks:java:io:common:compileTestJava
Note: <https://ci-beam.apache.org/job/beam_PostCommit_Java/ws/src/sdks/java/io/common/src/test/java/org/apache/beam/sdk/io/common/IOITHelperTest.java> uses or overrides a deprecated API.
Note: Recompile with -Xlint:deprecation for details.

> Task :sdks:java:io:common:testClasses
> Task :sdks:java:io:common:testJar
> Task :sdks:java:testing:test-utils:compileTestJava
> Task :sdks:java:testing:test-utils:testClasses
> Task :sdks:java:testing:test-utils:testJar

> Task :sdks:java:io:kinesis:compileTestJava
Note: Some input files use or override a deprecated API.
Note: Recompile with -Xlint:deprecation for details.

> Task :sdks:java:extensions:zetasketch:compileJava
> Task :sdks:java:extensions:zetasketch:classes
> Task :sdks:java:io:kinesis:testClasses
> Task :sdks:java:core:compileTestJava
> Task :sdks:java:harness:shadowJar
> Task :runners:java-fn-execution:compileJava FROM-CACHE
> Task :runners:java-fn-execution:classes UP-TO-DATE
> Task :runners:java-fn-execution:jar
> Task :sdks:java:expansion-service:compileJava FROM-CACHE
> Task :sdks:java:expansion-service:classes UP-TO-DATE
> Task :sdks:java:expansion-service:jar
> Task :runners:direct-java:compileJava FROM-CACHE
> Task :runners:direct-java:classes UP-TO-DATE
> Task :sdks:java:extensions:ml:compileJava FROM-CACHE
> Task :sdks:java:extensions:ml:classes UP-TO-DATE
> Task :sdks:java:extensions:ml:jar
> Task :sdks:java:io:google-cloud-platform:compileJava FROM-CACHE
> Task :sdks:java:io:google-cloud-platform:classes UP-TO-DATE
> Task :sdks:java:io:google-cloud-platform:jar
> Task :runners:direct-java:shadowJar

> Task :examples:java:compileJava
Note: Some input files use or override a deprecated API.
Note: Recompile with -Xlint:deprecation for details.
Note: <https://ci-beam.apache.org/job/beam_PostCommit_Java/ws/src/examples/java/src/main/java/org/apache/beam/examples/snippets/transforms/io/gcp/bigquery/BigQueryMyData.java> uses unchecked or unsafe operations.
Note: Recompile with -Xlint:unchecked for details.

> Task :examples:java:classes
> Task :examples:java:jar
> Task :sdks:java:extensions:zetasketch:compileTestJava
> Task :runners:google-cloud-dataflow-java:compileJava
Note: Some input files use or override a deprecated API.
Note: Recompile with -Xlint:deprecation for details.
Note: Some input files use unchecked or unsafe operations.
Note: Recompile with -Xlint:unchecked for details.

> Task :runners:google-cloud-dataflow-java:classes
> Task :runners:google-cloud-dataflow-java:jar
> Task :sdks:java:io:kinesis:integrationTest

> Task :examples:java:compileTestJava
Note: Some input files use or override a deprecated API.
Note: Recompile with -Xlint:deprecation for details.
Note: Some input files use unchecked or unsafe operations.
Note: Recompile with -Xlint:unchecked for details.

> Task :examples:java:testClasses
> Task :examples:java:testJar

> Task :sdks:java:extensions:zetasketch:compileTestJava
Note: <https://ci-beam.apache.org/job/beam_PostCommit_Java/ws/src/sdks/java/extensions/zetasketch/src/test/java/org/apache/beam/sdk/extensions/zetasketch/HllCountTest.java> uses or overrides a deprecated API.
Note: Recompile with -Xlint:deprecation for details.

> Task :sdks:java:extensions:zetasketch:testClasses

> Task :sdks:java:core:compileTestJava
Note: Some input files use or override a deprecated API.
Note: Recompile with -Xlint:deprecation for details.
Note: Some input files use unchecked or unsafe operations.
Note: Recompile with -Xlint:unchecked for details.

> Task :sdks:java:core:testClasses
> Task :sdks:java:core:shadowTestJar

> Task :runners:google-cloud-dataflow-java:worker:legacy-worker:compileJava
Note: Some input files use or override a deprecated API.
Note: Recompile with -Xlint:deprecation for details.
Note: Some input files use unchecked or unsafe operations.
Note: Recompile with -Xlint:unchecked for details.

> Task :runners:google-cloud-dataflow-java:worker:legacy-worker:classes

> Task :sdks:java:extensions:google-cloud-platform-core:compileTestJava
Note: Some input files use or override a deprecated API.
Note: Recompile with -Xlint:deprecation for details.

> Task :sdks:java:extensions:google-cloud-platform-core:testClasses
> Task :sdks:java:extensions:google-cloud-platform-core:testJar
> Task :runners:google-cloud-dataflow-java:worker:legacy-worker:shadowJar
> Task :runners:google-cloud-dataflow-java:coreSDKJavaLegacyWorkerIntegrationTest NO-SOURCE
> Task :sdks:java:extensions:google-cloud-platform-core:integrationTestKms
> Task :sdks:java:extensions:google-cloud-platform-core:postCommit
> Task :sdks:java:io:google-cloud-platform:compileTestJava
Note: Some input files use or override a deprecated API.
Note: Recompile with -Xlint:deprecation for details.
Note: Some input files use unchecked or unsafe operations.
Note: Recompile with -Xlint:unchecked for details.

> Task :sdks:java:io:google-cloud-platform:testClasses
> Task :sdks:java:io:google-cloud-platform:testJar
> Task :sdks:java:extensions:zetasketch:integrationTest
> Task :runners:google-cloud-dataflow-java:examplesJavaLegacyWorkerIntegrationTest
> Task :sdks:java:io:google-cloud-platform:integrationTest

> Task :runners:google-cloud-dataflow-java:examplesJavaLegacyWorkerIntegrationTest

***********************************************************
***********************************************************
**********************Set Up Pubsub************************
The Pub/Sub topic has been set up for this example: projects/apache-beam-testing/topics/testpipeline-jenkins-0824180350-245037fe
The Pub/Sub subscription has been set up for this example: projects/apache-beam-testing/subscriptions/testpipeline-jenkins-0824180350-245037fe
******************Set Up Big Query Table*******************
The BigQuery table has been set up for this example: apache-beam-testing:traffic_routes_1598292219959.traffic_routes_table
*************************Tear Down*************************
The Pub/Sub topic has been deleted: projects/apache-beam-testing/topics/testpipeline-jenkins-0824180350-245037fe
The Pub/Sub subscription has been deleted: projects/apache-beam-testing/subscriptions/testpipeline-jenkins-0824180350-245037fe
The BigQuery table might contain the example's output, and it is not deleted automatically: apache-beam-testing:traffic_routes_1598292219959.traffic_routes_table
Please go to the Developers Console to delete it manually. Otherwise, you may be charged for its usage.
***********************************************************
***********************************************************

> Task :sdks:java:io:google-cloud-platform:integrationTestKms

> Task :sdks:java:extensions:zetasketch:integrationTest

org.apache.beam.sdk.extensions.zetasketch.BigQueryHllSketchCompatibilityIT > testReadNonEmptySketchFromBigQuery FAILED
    java.lang.RuntimeException at BigQueryHllSketchCompatibilityIT.java:201

> Task :runners:google-cloud-dataflow-java:examplesJavaLegacyWorkerIntegrationTest

***********************************************************
***********************************************************
**********************Set Up Pubsub************************
The Pub/Sub topic has been set up for this example: projects/apache-beam-testing/topics/testpipeline-jenkins-0824181222-5eff590d
The Pub/Sub subscription has been set up for this example: projects/apache-beam-testing/subscriptions/testpipeline-jenkins-0824181222-5eff590d
******************Set Up Big Query Table*******************
The BigQuery table has been set up for this example: apache-beam-testing:traffic_max_lane_flow_1598292742008.traffic_max_lane_flow_table
*************************Tear Down*************************
The Pub/Sub topic has been deleted: projects/apache-beam-testing/topics/testpipeline-jenkins-0824181222-5eff590d
The Pub/Sub subscription has been deleted: projects/apache-beam-testing/subscriptions/testpipeline-jenkins-0824181222-5eff590d
The BigQuery table might contain the example's output, and it is not deleted automatically: apache-beam-testing:traffic_max_lane_flow_1598292742008.traffic_max_lane_flow_table
Please go to the Developers Console to delete it manually. Otherwise, you may be charged for its usage.
***********************************************************
***********************************************************

> Task :sdks:java:io:google-cloud-platform:postCommit

> Task :runners:google-cloud-dataflow-java:examplesJavaLegacyWorkerIntegrationTest

org.apache.beam.examples.snippets.transforms.io.gcp.bigquery.BigQuerySamplesIT > testTableIO FAILED
    java.lang.RuntimeException at BigQuerySamplesIT.java:130

> Task :sdks:java:extensions:zetasketch:integrationTest

4 tests completed, 1 failed

> Task :sdks:java:extensions:zetasketch:integrationTest FAILED

> Task :runners:google-cloud-dataflow-java:examplesJavaLegacyWorkerIntegrationTest

***********************************************************
***********************************************************
*************************Tear Down*************************
The Pub/Sub topic has been deleted: projects/apache-beam-testing/topics/testpipeline-jenkins-0824182356-a6cf2b13
The Pub/Sub subscription has been deleted: projects/apache-beam-testing/subscriptions/testpipeline-jenkins-0824182356-a6cf2b13
The BigQuery table might contain the example's output, and it is not deleted automatically: apache-beam-testing:beam_examples.testpipeline_jenkins_0824182356_a6cf2b13
Please go to the Developers Console to delete it manually. Otherwise, you may be charged for its usage.
***********************************************************
***********************************************************

10 tests completed, 1 failed

> Task :runners:google-cloud-dataflow-java:examplesJavaLegacyWorkerIntegrationTest FAILED
> Task :runners:google-cloud-dataflow-java:googleCloudPlatformLegacyWorkerIntegrationTest

org.apache.beam.sdk.io.gcp.bigquery.BigQueryIOStorageReadIT > testBigQueryStorageRead1G FAILED
    java.lang.RuntimeException at BigQueryIOStorageReadIT.java:93

39 tests completed, 1 failed

> Task :runners:google-cloud-dataflow-java:googleCloudPlatformLegacyWorkerIntegrationTest FAILED
> Task :runners:google-cloud-dataflow-java:googleCloudPlatformLegacyWorkerKmsIntegrationTest

FAILURE: Build completed with 3 failures.

1: Task failed with an exception.
-----------
* What went wrong:
Execution failed for task ':sdks:java:extensions:zetasketch:integrationTest'.
> There were failing tests. See the report at: file://<https://ci-beam.apache.org/job/beam_PostCommit_Java/ws/src/sdks/java/extensions/zetasketch/build/reports/tests/integrationTest/index.html>

* Try:
Run with --stacktrace option to get the stack trace. Run with --info or --debug option to get more log output. Run with --scan to get full insights.
==============================================================================

2: Task failed with an exception.
-----------
* What went wrong:
Execution failed for task ':runners:google-cloud-dataflow-java:examplesJavaLegacyWorkerIntegrationTest'.
> There were failing tests. See the report at: file://<https://ci-beam.apache.org/job/beam_PostCommit_Java/ws/src/runners/google-cloud-dataflow-java/build/reports/tests/examplesJavaLegacyWorkerIntegrationTest/index.html>

* Try:
Run with --stacktrace option to get the stack trace. Run with --info or --debug option to get more log output. Run with --scan to get full insights.
==============================================================================

3: Task failed with an exception.
-----------
* What went wrong:
Execution failed for task ':runners:google-cloud-dataflow-java:googleCloudPlatformLegacyWorkerIntegrationTest'.
> There were failing tests. See the report at: file://<https://ci-beam.apache.org/job/beam_PostCommit_Java/ws/src/runners/google-cloud-dataflow-java/build/reports/tests/googleCloudPlatformLegacyWorkerIntegrationTest/index.html>

* Try:
Run with --stacktrace option to get the stack trace. Run with --info or --debug option to get more log output. Run with --scan to get full insights.
==============================================================================

* Get more help at https://help.gradle.org

Deprecated Gradle features were used in this build, making it incompatible with Gradle 6.0.
Use '--warning-mode all' to show the individual deprecation warnings.
See https://docs.gradle.org/5.2.1/userguide/command_line_interface.html#sec:command_line_warnings

BUILD FAILED in 1h 20m 34s
99 actionable tasks: 79 executed, 20 from cache

Publishing build scan...
https://gradle.com/s/wwbf4pgckyyo2

Build step 'Invoke Gradle script' changed build result to FAILURE
Build step 'Invoke Gradle script' marked build as failure

---------------------------------------------------------------------
To unsubscribe, e-mail: builds-unsubscribe@beam.apache.org
For additional commands, e-mail: builds-help@beam.apache.org


Jenkins build is back to normal : beam_PostCommit_Java #6522

Posted by Apache Jenkins Server <je...@builds.apache.org>.
See <https://ci-beam.apache.org/job/beam_PostCommit_Java/6522/display/redirect?page=changes>


---------------------------------------------------------------------
To unsubscribe, e-mail: builds-unsubscribe@beam.apache.org
For additional commands, e-mail: builds-help@beam.apache.org


Build failed in Jenkins: beam_PostCommit_Java #6521

Posted by Apache Jenkins Server <je...@builds.apache.org>.
See <https://ci-beam.apache.org/job/beam_PostCommit_Java/6521/display/redirect?page=changes>

Changes:

[leiyiz] implement query 12

[saavan] Fix author names

[noreply] [BEAM-10701] Add codecov config, fix paths hopefully (#12684)

[noreply] Merge pull request #12674 from [BEAM-8258] basic metric feature for

[noreply] Add skipped tests for Series.dt and Series.str methods (#12615)

[noreply] [BEAM-9547] Add a few more DataFrame operations (#12682)


------------------------------------------
[...truncated 10.86 KB...]
> Task :sdks:java:io:common:compileJava NO-SOURCE
> Task :runners:local-java:processResources NO-SOURCE
> Task :runners:direct-java:processResources NO-SOURCE
> Task :examples:java:processTestResources
> Task :sdks:java:expansion-service:createCheckerFrameworkManifest
> Task :sdks:java:extensions:protobuf:extractProto
> Task :sdks:java:io:common:processResources NO-SOURCE
> Task :sdks:java:io:common:classes UP-TO-DATE
> Task :model:fn-execution:extractProto
> Task :model:job-management:extractProto
> Task :sdks:java:extensions:protobuf:processResources NO-SOURCE
> Task :sdks:java:testing:test-utils:processResources NO-SOURCE
> Task :sdks:java:expansion-service:processResources NO-SOURCE
> Task :sdks:java:testing:test-utils:processTestResources NO-SOURCE
> Task :sdks:java:extensions:zetasketch:createCheckerFrameworkManifest
> Task :model:job-management:processResources
> Task :sdks:java:extensions:zetasketch:processResources NO-SOURCE
> Task :sdks:java:extensions:zetasketch:processTestResources NO-SOURCE
> Task :runners:google-cloud-dataflow-java:processResources
> Task :sdks:java:io:common:jar
> Task :sdks:java:core:generateGrammarSource FROM-CACHE
> Task :sdks:java:io:common:processTestResources NO-SOURCE
> Task :sdks:java:core:processResources
> Task :sdks:java:core:generateTestAvroProtocol NO-SOURCE
> Task :sdks:java:io:kinesis:processResources NO-SOURCE
> Task :sdks:java:io:kinesis:processTestResources NO-SOURCE
> Task :model:fn-execution:processResources
> Task :sdks:java:io:google-cloud-platform:processTestResources
> Task :runners:google-cloud-dataflow-java:copyGoogleCloudPlatformTestResources
> Task :sdks:java:core:generateTestAvroJava
> Task :sdks:java:core:generateTestGrammarSource NO-SOURCE
> Task :sdks:java:core:processTestResources
> Task :model:pipeline:extractIncludeProto
> Task :model:pipeline:extractProto
> Task :runners:google-cloud-dataflow-java:worker:windmill:extractIncludeProto
> Task :runners:google-cloud-dataflow-java:worker:windmill:extractProto
> Task :runners:google-cloud-dataflow-java:worker:windmill:generateProto
> Task :model:pipeline:generateProto
> Task :model:pipeline:compileJava FROM-CACHE
> Task :model:pipeline:processResources
> Task :model:pipeline:classes
> Task :runners:google-cloud-dataflow-java:worker:windmill:compileJava FROM-CACHE
> Task :runners:google-cloud-dataflow-java:worker:windmill:processResources
> Task :runners:google-cloud-dataflow-java:worker:windmill:classes
> Task :model:pipeline:jar
> Task :model:job-management:extractIncludeProto
> Task :model:job-management:generateProto
> Task :model:fn-execution:extractIncludeProto
> Task :model:job-management:compileJava FROM-CACHE
> Task :model:job-management:classes
> Task :runners:google-cloud-dataflow-java:worker:windmill:shadowJar
> Task :model:fn-execution:generateProto
> Task :model:fn-execution:compileJava FROM-CACHE
> Task :model:fn-execution:classes
> Task :model:pipeline:shadowJar
> Task :model:job-management:shadowJar
> Task :model:fn-execution:shadowJar
> Task :sdks:java:core:compileJava FROM-CACHE
> Task :sdks:java:core:classes
> Task :sdks:java:core:shadowJar
> Task :sdks:java:extensions:zetasketch:compileJava FROM-CACHE
> Task :sdks:java:extensions:zetasketch:classes UP-TO-DATE
> Task :vendor:sdks-java-extensions-protobuf:compileJava FROM-CACHE
> Task :vendor:sdks-java-extensions-protobuf:classes UP-TO-DATE
> Task :sdks:java:extensions:google-cloud-platform-core:compileJava FROM-CACHE
> Task :sdks:java:extensions:google-cloud-platform-core:classes UP-TO-DATE
> Task :runners:local-java:compileJava FROM-CACHE
> Task :runners:local-java:classes UP-TO-DATE
> Task :sdks:java:io:common:compileTestJava FROM-CACHE
> Task :sdks:java:io:common:testClasses UP-TO-DATE
> Task :runners:local-java:jar
> Task :sdks:java:io:common:testJar
> Task :sdks:java:extensions:google-cloud-platform-core:jar
> Task :vendor:sdks-java-extensions-protobuf:shadowJar
> Task :runners:core-construction-java:compileJava FROM-CACHE
> Task :runners:core-construction-java:classes UP-TO-DATE
> Task :sdks:java:fn-execution:compileJava FROM-CACHE
> Task :sdks:java:fn-execution:classes UP-TO-DATE
> Task :sdks:java:extensions:protobuf:extractIncludeProto
> Task :sdks:java:extensions:protobuf:generateProto NO-SOURCE
> Task :sdks:java:extensions:protobuf:compileJava FROM-CACHE
> Task :sdks:java:extensions:protobuf:classes UP-TO-DATE
> Task :sdks:java:fn-execution:jar
> Task :sdks:java:testing:test-utils:compileJava FROM-CACHE
> Task :sdks:java:testing:test-utils:classes UP-TO-DATE
> Task :sdks:java:testing:test-utils:jar
> Task :sdks:java:extensions:protobuf:jar
> Task :runners:core-construction-java:jar
> Task :sdks:java:testing:test-utils:compileTestJava FROM-CACHE
> Task :sdks:java:testing:test-utils:testClasses UP-TO-DATE
> Task :sdks:java:testing:test-utils:testJar
> Task :sdks:java:io:kinesis:compileJava FROM-CACHE
> Task :sdks:java:io:kinesis:classes UP-TO-DATE
> Task :runners:core-java:compileJava FROM-CACHE
> Task :runners:core-java:classes UP-TO-DATE
> Task :sdks:java:io:kinesis:compileTestJava FROM-CACHE
> Task :sdks:java:io:kinesis:testClasses UP-TO-DATE
> Task :runners:core-java:jar
> Task :sdks:java:harness:compileJava FROM-CACHE
> Task :sdks:java:harness:classes UP-TO-DATE
> Task :sdks:java:harness:jar
> Task :sdks:java:core:compileTestJava FROM-CACHE
> Task :sdks:java:core:testClasses
> Task :sdks:java:core:shadowTestJar
> Task :sdks:java:extensions:google-cloud-platform-core:compileTestJava FROM-CACHE
> Task :sdks:java:extensions:google-cloud-platform-core:testClasses UP-TO-DATE
> Task :sdks:java:extensions:google-cloud-platform-core:testJar
> Task :sdks:java:extensions:google-cloud-platform-core:integrationTestKms
> Task :sdks:java:extensions:google-cloud-platform-core:postCommit
> Task :sdks:java:harness:shadowJar
> Task :runners:java-fn-execution:compileJava FROM-CACHE
> Task :runners:java-fn-execution:classes UP-TO-DATE
> Task :runners:java-fn-execution:jar
> Task :sdks:java:expansion-service:compileJava FROM-CACHE
> Task :sdks:java:expansion-service:classes UP-TO-DATE
> Task :runners:direct-java:compileJava FROM-CACHE
> Task :runners:direct-java:classes UP-TO-DATE
> Task :sdks:java:expansion-service:jar
> Task :sdks:java:extensions:ml:compileJava FROM-CACHE
> Task :sdks:java:extensions:ml:classes UP-TO-DATE
> Task :sdks:java:extensions:ml:jar
> Task :sdks:java:io:google-cloud-platform:compileJava FROM-CACHE
> Task :sdks:java:io:google-cloud-platform:classes UP-TO-DATE
> Task :sdks:java:io:google-cloud-platform:jar
> Task :sdks:java:extensions:zetasketch:compileTestJava FROM-CACHE
> Task :sdks:java:extensions:zetasketch:testClasses UP-TO-DATE
> Task :examples:java:compileJava FROM-CACHE
> Task :examples:java:classes UP-TO-DATE
> Task :runners:google-cloud-dataflow-java:compileJava FROM-CACHE
> Task :runners:google-cloud-dataflow-java:classes
> Task :runners:google-cloud-dataflow-java:jar
> Task :examples:java:jar
> Task :examples:java:compileTestJava FROM-CACHE
> Task :examples:java:testClasses
> Task :runners:direct-java:shadowJar
> Task :examples:java:testJar
> Task :runners:google-cloud-dataflow-java:worker:legacy-worker:compileJava FROM-CACHE
> Task :runners:google-cloud-dataflow-java:worker:legacy-worker:classes UP-TO-DATE
> Task :sdks:java:io:google-cloud-platform:compileTestJava FROM-CACHE
> Task :sdks:java:io:google-cloud-platform:testClasses
> Task :sdks:java:io:google-cloud-platform:testJar
> Task :runners:google-cloud-dataflow-java:worker:legacy-worker:shadowJar
> Task :runners:google-cloud-dataflow-java:coreSDKJavaLegacyWorkerIntegrationTest NO-SOURCE
> Task :sdks:java:io:kinesis:integrationTest
> Task :sdks:java:io:google-cloud-platform:integrationTest
> Task :sdks:java:extensions:zetasketch:integrationTest
> Task :runners:google-cloud-dataflow-java:examplesJavaLegacyWorkerIntegrationTest

org.apache.beam.examples.complete.TfIdfIT > testE2ETfIdf FAILED
    java.lang.RuntimeException at TfIdfIT.java:70

***********************************************************
***********************************************************
**********************Set Up Pubsub************************
The Pub/Sub topic has been set up for this example: projects/apache-beam-testing/topics/testpipeline-jenkins-0827000458-d43e4316
The Pub/Sub subscription has been set up for this example: projects/apache-beam-testing/subscriptions/testpipeline-jenkins-0827000458-d43e4316
******************Set Up Big Query Table*******************
The BigQuery table has been set up for this example: apache-beam-testing:traffic_routes_1598486672037.traffic_routes_table
*************************Tear Down*************************
The Pub/Sub topic has been deleted: projects/apache-beam-testing/topics/testpipeline-jenkins-0827000458-d43e4316
The Pub/Sub subscription has been deleted: projects/apache-beam-testing/subscriptions/testpipeline-jenkins-0827000458-d43e4316
The BigQuery table might contain the example's output, and it is not deleted automatically: apache-beam-testing:traffic_routes_1598486672037.traffic_routes_table
Please go to the Developers Console to delete it manually. Otherwise, you may be charged for its usage.
***********************************************************
***********************************************************

***********************************************************
***********************************************************
**********************Set Up Pubsub************************
The Pub/Sub topic has been set up for this example: projects/apache-beam-testing/topics/testpipeline-jenkins-0827000629-b63b3810
The Pub/Sub subscription has been set up for this example: projects/apache-beam-testing/subscriptions/testpipeline-jenkins-0827000629-b63b3810
******************Set Up Big Query Table*******************
The BigQuery table has been set up for this example: apache-beam-testing:traffic_max_lane_flow_1598486788154.traffic_max_lane_flow_table
*************************Tear Down*************************
The Pub/Sub topic has been deleted: projects/apache-beam-testing/topics/testpipeline-jenkins-0827000629-b63b3810
The Pub/Sub subscription has been deleted: projects/apache-beam-testing/subscriptions/testpipeline-jenkins-0827000629-b63b3810
The BigQuery table might contain the example's output, and it is not deleted automatically: apache-beam-testing:traffic_max_lane_flow_1598486788154.traffic_max_lane_flow_table
Please go to the Developers Console to delete it manually. Otherwise, you may be charged for its usage.
***********************************************************
***********************************************************

> Task :sdks:java:extensions:zetasketch:integrationTest

org.apache.beam.sdk.extensions.zetasketch.BigQueryHllSketchCompatibilityIT > testWriteNonEmptySketchToBigQuery FAILED
    java.lang.RuntimeException at BigQueryHllSketchCompatibilityIT.java:257

> Task :sdks:java:io:google-cloud-platform:integrationTestKms
> Task :sdks:java:io:google-cloud-platform:postCommit

> Task :sdks:java:extensions:zetasketch:integrationTest

4 tests completed, 1 failed

> Task :sdks:java:extensions:zetasketch:integrationTest FAILED

> Task :runners:google-cloud-dataflow-java:examplesJavaLegacyWorkerIntegrationTest

***********************************************************
***********************************************************
*************************Tear Down*************************
The Pub/Sub topic has been deleted: projects/apache-beam-testing/topics/testpipeline-jenkins-0827002534-483c2ff8
The Pub/Sub subscription has been deleted: projects/apache-beam-testing/subscriptions/testpipeline-jenkins-0827002534-483c2ff8
The BigQuery table might contain the example's output, and it is not deleted automatically: apache-beam-testing:beam_examples.testpipeline_jenkins_0827002534_483c2ff8
Please go to the Developers Console to delete it manually. Otherwise, you may be charged for its usage.
***********************************************************
***********************************************************

10 tests completed, 1 failed

> Task :runners:google-cloud-dataflow-java:examplesJavaLegacyWorkerIntegrationTest FAILED
> Task :runners:google-cloud-dataflow-java:googleCloudPlatformLegacyWorkerIntegrationTest
> Task :runners:google-cloud-dataflow-java:googleCloudPlatformLegacyWorkerKmsIntegrationTest

FAILURE: Build completed with 2 failures.

1: Task failed with an exception.
-----------
* What went wrong:
Execution failed for task ':sdks:java:extensions:zetasketch:integrationTest'.
> There were failing tests. See the report at: file://<https://ci-beam.apache.org/job/beam_PostCommit_Java/ws/src/sdks/java/extensions/zetasketch/build/reports/tests/integrationTest/index.html>

* Try:
Run with --stacktrace option to get the stack trace. Run with --info or --debug option to get more log output. Run with --scan to get full insights.
==============================================================================

2: Task failed with an exception.
-----------
* What went wrong:
Execution failed for task ':runners:google-cloud-dataflow-java:examplesJavaLegacyWorkerIntegrationTest'.
> There were failing tests. See the report at: file://<https://ci-beam.apache.org/job/beam_PostCommit_Java/ws/src/runners/google-cloud-dataflow-java/build/reports/tests/examplesJavaLegacyWorkerIntegrationTest/index.html>

* Try:
Run with --stacktrace option to get the stack trace. Run with --info or --debug option to get more log output. Run with --scan to get full insights.
==============================================================================

* Get more help at https://help.gradle.org

Deprecated Gradle features were used in this build, making it incompatible with Gradle 6.0.
Use '--warning-mode all' to show the individual deprecation warnings.
See https://docs.gradle.org/5.2.1/userguide/command_line_interface.html#sec:command_line_warnings

BUILD FAILED in 1h 24m 28s
99 actionable tasks: 66 executed, 33 from cache

Publishing build scan...
https://gradle.com/s/ccqyzvr5op2vo

Build step 'Invoke Gradle script' changed build result to FAILURE
Build step 'Invoke Gradle script' marked build as failure

---------------------------------------------------------------------
To unsubscribe, e-mail: builds-unsubscribe@beam.apache.org
For additional commands, e-mail: builds-help@beam.apache.org


Build failed in Jenkins: beam_PostCommit_Java #6520

Posted by Apache Jenkins Server <je...@builds.apache.org>.
See <https://ci-beam.apache.org/job/beam_PostCommit_Java/6520/display/redirect?page=changes>

Changes:

[sychen] Refactor to reuse computation+key

[Luke Cwik] [BEAM-10771] Fix whitespace error causing whitespace lint to fail

[noreply] [BEAM-4980] Upgrade to Netty 4.1.51.Final and Netty_tcnative

[noreply] [BEAM-10670] Make Twister2Runner opt-out for using an SDF powered Read


------------------------------------------
[...truncated 23.28 KB...]
> Task :model:job-management:compileJava FROM-CACHE
> Task :model:job-management:classes
> Task :runners:google-cloud-dataflow-java:worker:windmill:shadowJar
> Task :model:pipeline:shadowJar
> Task :model:job-management:shadowJar
> Task :model:fn-execution:shadowJar
> Task :sdks:java:core:compileJava FROM-CACHE
> Task :sdks:java:core:classes
> Task :sdks:java:core:shadowJar
> Task :runners:local-java:compileJava FROM-CACHE
> Task :runners:local-java:classes UP-TO-DATE
> Task :runners:local-java:jar
> Task :vendor:sdks-java-extensions-protobuf:compileJava FROM-CACHE
> Task :vendor:sdks-java-extensions-protobuf:classes UP-TO-DATE
> Task :sdks:java:extensions:google-cloud-platform-core:compileJava FROM-CACHE
> Task :sdks:java:extensions:google-cloud-platform-core:classes UP-TO-DATE
> Task :runners:core-construction-java:compileJava FROM-CACHE
> Task :runners:core-construction-java:classes UP-TO-DATE
> Task :sdks:java:extensions:google-cloud-platform-core:jar
> Task :sdks:java:fn-execution:compileJava FROM-CACHE
> Task :sdks:java:fn-execution:classes UP-TO-DATE
> Task :vendor:sdks-java-extensions-protobuf:shadowJar
> Task :sdks:java:fn-execution:jar
> Task :sdks:java:extensions:protobuf:extractIncludeProto
> Task :sdks:java:extensions:protobuf:generateProto NO-SOURCE
> Task :sdks:java:extensions:protobuf:compileJava FROM-CACHE
> Task :sdks:java:extensions:protobuf:classes UP-TO-DATE
> Task :sdks:java:extensions:protobuf:jar
> Task :runners:core-construction-java:jar
> Task :runners:core-java:compileJava FROM-CACHE
> Task :runners:core-java:classes UP-TO-DATE
> Task :runners:core-java:jar
> Task :sdks:java:harness:compileJava FROM-CACHE
> Task :sdks:java:harness:classes UP-TO-DATE
> Task :sdks:java:harness:jar

> Task :sdks:java:io:common:compileTestJava
Note: <https://ci-beam.apache.org/job/beam_PostCommit_Java/ws/src/sdks/java/io/common/src/test/java/org/apache/beam/sdk/io/common/IOITHelperTest.java> uses or overrides a deprecated API.
Note: Recompile with -Xlint:deprecation for details.

> Task :sdks:java:io:common:testClasses
> Task :sdks:java:testing:test-utils:compileJava
> Task :sdks:java:io:common:testJar
> Task :sdks:java:testing:test-utils:classes
> Task :sdks:java:testing:test-utils:jar
> Task :sdks:java:io:kinesis:compileJava
> Task :sdks:java:io:kinesis:classes
> Task :sdks:java:core:compileTestJava
> Task :sdks:java:extensions:zetasketch:compileJava
> Task :sdks:java:testing:test-utils:compileTestJava
> Task :sdks:java:testing:test-utils:testClasses
> Task :sdks:java:testing:test-utils:testJar
> Task :sdks:java:harness:shadowJar
> Task :sdks:java:extensions:zetasketch:classes

> Task :sdks:java:io:kinesis:compileTestJava
Note: Some input files use or override a deprecated API.
Note: Recompile with -Xlint:deprecation for details.

> Task :sdks:java:io:kinesis:testClasses
> Task :runners:java-fn-execution:compileJava FROM-CACHE
> Task :runners:java-fn-execution:classes UP-TO-DATE
> Task :runners:java-fn-execution:jar
> Task :sdks:java:expansion-service:compileJava FROM-CACHE
> Task :sdks:java:expansion-service:classes UP-TO-DATE
> Task :sdks:java:expansion-service:jar
> Task :runners:direct-java:compileJava FROM-CACHE
> Task :runners:direct-java:classes UP-TO-DATE
> Task :sdks:java:extensions:ml:compileJava FROM-CACHE
> Task :sdks:java:extensions:ml:classes UP-TO-DATE
> Task :sdks:java:extensions:ml:jar
> Task :sdks:java:io:google-cloud-platform:compileJava FROM-CACHE
> Task :sdks:java:io:google-cloud-platform:classes UP-TO-DATE
> Task :sdks:java:io:google-cloud-platform:jar
> Task :examples:java:compileJava FROM-CACHE
> Task :examples:java:classes UP-TO-DATE
> Task :runners:google-cloud-dataflow-java:compileJava FROM-CACHE
> Task :runners:google-cloud-dataflow-java:classes
> Task :examples:java:jar
> Task :runners:google-cloud-dataflow-java:jar
> Task :examples:java:compileTestJava FROM-CACHE
> Task :examples:java:testClasses
> Task :examples:java:testJar
> Task :runners:google-cloud-dataflow-java:worker:legacy-worker:compileJava FROM-CACHE
> Task :runners:google-cloud-dataflow-java:worker:legacy-worker:classes UP-TO-DATE
> Task :runners:direct-java:shadowJar
> Task :runners:google-cloud-dataflow-java:worker:legacy-worker:shadowJar

> Task :sdks:java:extensions:zetasketch:compileTestJava
Note: <https://ci-beam.apache.org/job/beam_PostCommit_Java/ws/src/sdks/java/extensions/zetasketch/src/test/java/org/apache/beam/sdk/extensions/zetasketch/HllCountTest.java> uses or overrides a deprecated API.
Note: Recompile with -Xlint:deprecation for details.

> Task :sdks:java:extensions:zetasketch:testClasses
> Task :sdks:java:io:kinesis:integrationTest

> Task :sdks:java:core:compileTestJava
Note: Some input files use or override a deprecated API.
Note: Recompile with -Xlint:deprecation for details.
Note: Some input files use unchecked or unsafe operations.
Note: Recompile with -Xlint:unchecked for details.

> Task :sdks:java:core:testClasses
> Task :sdks:java:core:shadowTestJar
> Task :runners:google-cloud-dataflow-java:examplesJavaLegacyWorkerIntegrationTest

> Task :sdks:java:extensions:google-cloud-platform-core:compileTestJava
Note: Some input files use or override a deprecated API.
Note: Recompile with -Xlint:deprecation for details.

> Task :sdks:java:extensions:google-cloud-platform-core:testClasses
> Task :sdks:java:extensions:google-cloud-platform-core:testJar
> Task :sdks:java:extensions:zetasketch:integrationTest
> Task :sdks:java:extensions:google-cloud-platform-core:integrationTestKms
> Task :sdks:java:extensions:google-cloud-platform-core:postCommit

> Task :sdks:java:io:google-cloud-platform:compileTestJava
Note: Some input files use or override a deprecated API.
Note: Recompile with -Xlint:deprecation for details.
Note: Some input files use unchecked or unsafe operations.
Note: Recompile with -Xlint:unchecked for details.

> Task :sdks:java:io:google-cloud-platform:testClasses
> Task :sdks:java:io:google-cloud-platform:testJar
> Task :sdks:java:io:google-cloud-platform:integrationTest

> Task :runners:google-cloud-dataflow-java:examplesJavaLegacyWorkerIntegrationTest

***********************************************************
***********************************************************
**********************Set Up Pubsub************************
The Pub/Sub topic has been set up for this example: projects/apache-beam-testing/topics/testpipeline-jenkins-0826180341-b5404f14
The Pub/Sub subscription has been set up for this example: projects/apache-beam-testing/subscriptions/testpipeline-jenkins-0826180341-b5404f14
******************Set Up Big Query Table*******************
The BigQuery table has been set up for this example: apache-beam-testing:traffic_routes_1598465010593.traffic_routes_table
*************************Tear Down*************************
The Pub/Sub topic has been deleted: projects/apache-beam-testing/topics/testpipeline-jenkins-0826180341-b5404f14
The Pub/Sub subscription has been deleted: projects/apache-beam-testing/subscriptions/testpipeline-jenkins-0826180341-b5404f14
The BigQuery table might contain the example's output, and it is not deleted automatically: apache-beam-testing:traffic_routes_1598465010593.traffic_routes_table
Please go to the Developers Console to delete it manually. Otherwise, you may be charged for its usage.
***********************************************************
***********************************************************

org.apache.beam.examples.snippets.transforms.io.gcp.bigquery.BigQuerySamplesIT > testTableIO FAILED
    java.lang.RuntimeException at BigQuerySamplesIT.java:120

> Task :sdks:java:extensions:zetasketch:integrationTest

org.apache.beam.sdk.extensions.zetasketch.BigQueryHllSketchCompatibilityIT > testWriteNonEmptySketchToBigQuery FAILED
    java.lang.RuntimeException at BigQueryHllSketchCompatibilityIT.java:257

> Task :runners:google-cloud-dataflow-java:examplesJavaLegacyWorkerIntegrationTest

***********************************************************
***********************************************************
**********************Set Up Pubsub************************
The Pub/Sub topic has been set up for this example: projects/apache-beam-testing/topics/testpipeline-jenkins-0826180855-8951ec98
The Pub/Sub subscription has been set up for this example: projects/apache-beam-testing/subscriptions/testpipeline-jenkins-0826180855-8951ec98
******************Set Up Big Query Table*******************
The BigQuery table has been set up for this example: apache-beam-testing:traffic_max_lane_flow_1598465335061.traffic_max_lane_flow_table
*************************Tear Down*************************
The Pub/Sub topic has been deleted: projects/apache-beam-testing/topics/testpipeline-jenkins-0826180855-8951ec98
The Pub/Sub subscription has been deleted: projects/apache-beam-testing/subscriptions/testpipeline-jenkins-0826180855-8951ec98
The BigQuery table might contain the example's output, and it is not deleted automatically: apache-beam-testing:traffic_max_lane_flow_1598465335061.traffic_max_lane_flow_table
Please go to the Developers Console to delete it manually. Otherwise, you may be charged for its usage.
***********************************************************
***********************************************************

> Task :sdks:java:io:google-cloud-platform:integrationTestKms
> Task :sdks:java:io:google-cloud-platform:postCommit

> Task :sdks:java:extensions:zetasketch:integrationTest FAILED

4 tests completed, 1 failed

> Task :runners:google-cloud-dataflow-java:examplesJavaLegacyWorkerIntegrationTest

***********************************************************
***********************************************************
*************************Tear Down*************************
The Pub/Sub topic has been deleted: projects/apache-beam-testing/topics/testpipeline-jenkins-0826182020-1211115
The Pub/Sub subscription has been deleted: projects/apache-beam-testing/subscriptions/testpipeline-jenkins-0826182020-1211115
The BigQuery table might contain the example's output, and it is not deleted automatically: apache-beam-testing:beam_examples.testpipeline_jenkins_0826182020_1211115
Please go to the Developers Console to delete it manually. Otherwise, you may be charged for its usage.
***********************************************************
***********************************************************

10 tests completed, 1 failed

> Task :runners:google-cloud-dataflow-java:examplesJavaLegacyWorkerIntegrationTest FAILED
> Task :runners:google-cloud-dataflow-java:coreSDKJavaLegacyWorkerIntegrationTest NO-SOURCE
> Task :runners:google-cloud-dataflow-java:googleCloudPlatformLegacyWorkerIntegrationTest

org.apache.beam.sdk.io.gcp.bigquery.BigQueryTimePartitioningClusteringIT > testE2EBigQueryClusteringDynamicDestinations FAILED
    java.lang.RuntimeException at BigQueryTimePartitioningClusteringIT.java:222

org.apache.beam.sdk.io.gcp.spanner.SpannerReadIT > testRead FAILED
    java.lang.RuntimeException at SpannerReadIT.java:149

39 tests completed, 2 failed

> Task :runners:google-cloud-dataflow-java:googleCloudPlatformLegacyWorkerIntegrationTest FAILED
> Task :runners:google-cloud-dataflow-java:googleCloudPlatformLegacyWorkerKmsIntegrationTest

FAILURE: Build completed with 3 failures.

1: Task failed with an exception.
-----------
* What went wrong:
Execution failed for task ':sdks:java:extensions:zetasketch:integrationTest'.
> There were failing tests. See the report at: file://<https://ci-beam.apache.org/job/beam_PostCommit_Java/ws/src/sdks/java/extensions/zetasketch/build/reports/tests/integrationTest/index.html>

* Try:
Run with --stacktrace option to get the stack trace. Run with --info or --debug option to get more log output. Run with --scan to get full insights.
==============================================================================

2: Task failed with an exception.
-----------
* What went wrong:
Execution failed for task ':runners:google-cloud-dataflow-java:examplesJavaLegacyWorkerIntegrationTest'.
> There were failing tests. See the report at: file://<https://ci-beam.apache.org/job/beam_PostCommit_Java/ws/src/runners/google-cloud-dataflow-java/build/reports/tests/examplesJavaLegacyWorkerIntegrationTest/index.html>

* Try:
Run with --stacktrace option to get the stack trace. Run with --info or --debug option to get more log output. Run with --scan to get full insights.
==============================================================================

3: Task failed with an exception.
-----------
* What went wrong:
Execution failed for task ':runners:google-cloud-dataflow-java:googleCloudPlatformLegacyWorkerIntegrationTest'.
> There were failing tests. See the report at: file://<https://ci-beam.apache.org/job/beam_PostCommit_Java/ws/src/runners/google-cloud-dataflow-java/build/reports/tests/googleCloudPlatformLegacyWorkerIntegrationTest/index.html>

* Try:
Run with --stacktrace option to get the stack trace. Run with --info or --debug option to get more log output. Run with --scan to get full insights.
==============================================================================

* Get more help at https://help.gradle.org

Deprecated Gradle features were used in this build, making it incompatible with Gradle 6.0.
Use '--warning-mode all' to show the individual deprecation warnings.
See https://docs.gradle.org/5.2.1/userguide/command_line_interface.html#sec:command_line_warnings

BUILD FAILED in 1h 17m 33s
99 actionable tasks: 76 executed, 23 from cache

Publishing build scan...
https://gradle.com/s/4wveszt3n67iu

Build step 'Invoke Gradle script' changed build result to FAILURE
Build step 'Invoke Gradle script' marked build as failure

---------------------------------------------------------------------
To unsubscribe, e-mail: builds-unsubscribe@beam.apache.org
For additional commands, e-mail: builds-help@beam.apache.org


Build failed in Jenkins: beam_PostCommit_Java #6519

Posted by Apache Jenkins Server <je...@builds.apache.org>.
See <https://ci-beam.apache.org/job/beam_PostCommit_Java/6519/display/redirect?page=changes>

Changes:

[noreply] [BEAM-10675] Add Python GBK Load Tests for streaming on Dataflow 


------------------------------------------
[...truncated 7.03 KB...]
> Task :buildSrc:build
Configuration on demand is an incubating feature.

> Configure project :sdks:java:container
Found go 1.12 in /usr/bin/go, use it.

> Task :sdks:java:harness:processResources NO-SOURCE
> Task :runners:java-fn-execution:processResources NO-SOURCE
> Task :sdks:java:extensions:google-cloud-platform-core:processResources NO-SOURCE
> Task :vendor:sdks-java-extensions-protobuf:processResources NO-SOURCE
> Task :sdks:java:fn-execution:processResources NO-SOURCE
> Task :runners:core-java:processResources NO-SOURCE
> Task :runners:core-construction-java:processResources NO-SOURCE
> Task :sdks:java:core:generateAvroProtocol NO-SOURCE
> Task :sdks:java:core:generateAvroJava NO-SOURCE
> Task :model:job-management:extractProto
> Task :model:fn-execution:extractProto
> Task :examples:java:processResources NO-SOURCE
> Task :sdks:java:io:google-cloud-platform:processResources NO-SOURCE
> Task :sdks:java:expansion-service:createCheckerFrameworkManifest
> Task :sdks:java:extensions:ml:processResources NO-SOURCE
> Task :runners:google-cloud-dataflow-java:worker:legacy-worker:processResources NO-SOURCE
> Task :runners:direct-java:processResources NO-SOURCE
> Task :sdks:java:extensions:google-cloud-platform-core:processTestResources NO-SOURCE
> Task :sdks:java:io:common:compileJava NO-SOURCE
> Task :sdks:java:testing:test-utils:processResources NO-SOURCE
> Task :sdks:java:extensions:protobuf:extractProto
> Task :model:job-management:processResources
> Task :sdks:java:expansion-service:processResources NO-SOURCE
> Task :model:fn-execution:processResources
> Task :examples:java:processTestResources
> Task :runners:google-cloud-dataflow-java:processResources
> Task :sdks:java:testing:test-utils:processTestResources NO-SOURCE
> Task :sdks:java:io:common:processResources NO-SOURCE
> Task :runners:local-java:processResources NO-SOURCE
> Task :sdks:java:io:kinesis:processResources NO-SOURCE
> Task :sdks:java:extensions:protobuf:processResources NO-SOURCE
> Task :sdks:java:io:common:classes UP-TO-DATE
> Task :sdks:java:core:generateGrammarSource FROM-CACHE
> Task :sdks:java:extensions:zetasketch:createCheckerFrameworkManifest
> Task :sdks:java:io:kinesis:processTestResources NO-SOURCE
> Task :sdks:java:extensions:zetasketch:processResources NO-SOURCE
> Task :sdks:java:extensions:zetasketch:processTestResources NO-SOURCE
> Task :sdks:java:io:common:jar
> Task :sdks:java:core:processResources
> Task :sdks:java:io:common:processTestResources NO-SOURCE
> Task :sdks:java:core:generateTestAvroProtocol NO-SOURCE
> Task :runners:google-cloud-dataflow-java:copyGoogleCloudPlatformTestResources
> Task :sdks:java:io:google-cloud-platform:processTestResources
> Task :sdks:java:core:generateTestAvroJava
> Task :sdks:java:core:generateTestGrammarSource NO-SOURCE
> Task :sdks:java:core:processTestResources
> Task :runners:google-cloud-dataflow-java:worker:windmill:extractIncludeProto
> Task :model:pipeline:extractIncludeProto
> Task :runners:google-cloud-dataflow-java:worker:windmill:extractProto
> Task :model:pipeline:extractProto
> Task :runners:google-cloud-dataflow-java:worker:windmill:generateProto
> Task :model:pipeline:generateProto
> Task :runners:google-cloud-dataflow-java:worker:windmill:compileJava FROM-CACHE
> Task :runners:google-cloud-dataflow-java:worker:windmill:processResources
> Task :runners:google-cloud-dataflow-java:worker:windmill:classes
> Task :model:pipeline:compileJava FROM-CACHE
> Task :model:pipeline:processResources
> Task :model:pipeline:classes
> Task :model:pipeline:jar
> Task :model:job-management:extractIncludeProto
> Task :model:fn-execution:extractIncludeProto
> Task :model:job-management:generateProto
> Task :model:fn-execution:generateProto
> Task :runners:google-cloud-dataflow-java:worker:windmill:shadowJar
> Task :model:fn-execution:compileJava FROM-CACHE
> Task :model:fn-execution:classes
> Task :model:job-management:compileJava FROM-CACHE
> Task :model:job-management:classes
> Task :model:pipeline:shadowJar
> Task :model:job-management:shadowJar
> Task :model:fn-execution:shadowJar
> Task :sdks:java:core:compileJava FROM-CACHE
> Task :sdks:java:core:classes
> Task :sdks:java:core:shadowJar
> Task :sdks:java:extensions:google-cloud-platform-core:compileJava FROM-CACHE
> Task :sdks:java:extensions:google-cloud-platform-core:classes UP-TO-DATE
> Task :vendor:sdks-java-extensions-protobuf:compileJava FROM-CACHE
> Task :vendor:sdks-java-extensions-protobuf:classes UP-TO-DATE
> Task :sdks:java:io:kinesis:compileJava FROM-CACHE
> Task :sdks:java:io:kinesis:classes UP-TO-DATE
> Task :runners:local-java:compileJava FROM-CACHE
> Task :runners:local-java:classes UP-TO-DATE
> Task :runners:local-java:jar
> Task :sdks:java:extensions:google-cloud-platform-core:jar
> Task :sdks:java:extensions:zetasketch:compileJava FROM-CACHE
> Task :sdks:java:extensions:zetasketch:classes UP-TO-DATE
> Task :sdks:java:io:common:compileTestJava FROM-CACHE
> Task :sdks:java:io:common:testClasses UP-TO-DATE
> Task :runners:core-construction-java:compileJava FROM-CACHE
> Task :runners:core-construction-java:classes UP-TO-DATE
> Task :sdks:java:io:common:testJar
> Task :sdks:java:fn-execution:compileJava FROM-CACHE
> Task :sdks:java:fn-execution:classes UP-TO-DATE
> Task :vendor:sdks-java-extensions-protobuf:shadowJar
> Task :sdks:java:fn-execution:jar
> Task :sdks:java:testing:test-utils:compileJava FROM-CACHE
> Task :sdks:java:testing:test-utils:classes UP-TO-DATE
> Task :sdks:java:testing:test-utils:jar
> Task :runners:core-construction-java:jar
> Task :sdks:java:testing:test-utils:compileTestJava FROM-CACHE
> Task :sdks:java:testing:test-utils:testClasses UP-TO-DATE
> Task :sdks:java:testing:test-utils:testJar
> Task :sdks:java:io:kinesis:compileTestJava FROM-CACHE
> Task :sdks:java:io:kinesis:testClasses UP-TO-DATE
> Task :runners:core-java:compileJava FROM-CACHE
> Task :runners:core-java:classes UP-TO-DATE
> Task :runners:core-java:jar
> Task :sdks:java:extensions:protobuf:extractIncludeProto
> Task :sdks:java:extensions:protobuf:generateProto NO-SOURCE
> Task :sdks:java:extensions:protobuf:compileJava FROM-CACHE
> Task :sdks:java:extensions:protobuf:classes UP-TO-DATE
> Task :sdks:java:extensions:protobuf:jar
> Task :sdks:java:harness:compileJava FROM-CACHE
> Task :sdks:java:harness:classes UP-TO-DATE
> Task :sdks:java:harness:jar
> Task :sdks:java:core:compileTestJava FROM-CACHE
> Task :sdks:java:core:testClasses
> Task :sdks:java:core:shadowTestJar
> Task :sdks:java:extensions:google-cloud-platform-core:compileTestJava FROM-CACHE
> Task :sdks:java:extensions:google-cloud-platform-core:testClasses UP-TO-DATE
> Task :sdks:java:extensions:google-cloud-platform-core:testJar
> Task :sdks:java:harness:shadowJar
> Task :sdks:java:extensions:google-cloud-platform-core:integrationTestKms
> Task :sdks:java:extensions:google-cloud-platform-core:postCommit
> Task :runners:java-fn-execution:compileJava FROM-CACHE
> Task :runners:java-fn-execution:classes UP-TO-DATE
> Task :runners:java-fn-execution:jar
> Task :sdks:java:expansion-service:compileJava FROM-CACHE
> Task :sdks:java:expansion-service:classes UP-TO-DATE
> Task :sdks:java:expansion-service:jar
> Task :runners:direct-java:compileJava FROM-CACHE
> Task :runners:direct-java:classes UP-TO-DATE
> Task :sdks:java:extensions:ml:compileJava FROM-CACHE
> Task :sdks:java:extensions:ml:classes UP-TO-DATE
> Task :sdks:java:extensions:ml:jar
> Task :sdks:java:io:google-cloud-platform:compileJava FROM-CACHE
> Task :sdks:java:io:google-cloud-platform:classes UP-TO-DATE
> Task :sdks:java:io:google-cloud-platform:jar
> Task :sdks:java:extensions:zetasketch:compileTestJava FROM-CACHE
> Task :sdks:java:extensions:zetasketch:testClasses UP-TO-DATE
> Task :examples:java:compileJava FROM-CACHE
> Task :examples:java:classes UP-TO-DATE
> Task :runners:google-cloud-dataflow-java:compileJava FROM-CACHE
> Task :runners:google-cloud-dataflow-java:classes
> Task :examples:java:jar
> Task :runners:google-cloud-dataflow-java:jar
> Task :examples:java:compileTestJava FROM-CACHE
> Task :examples:java:testClasses
> Task :examples:java:testJar
> Task :runners:direct-java:shadowJar
> Task :runners:google-cloud-dataflow-java:worker:legacy-worker:compileJava FROM-CACHE
> Task :runners:google-cloud-dataflow-java:worker:legacy-worker:classes UP-TO-DATE
> Task :sdks:java:io:google-cloud-platform:compileTestJava FROM-CACHE
> Task :sdks:java:io:google-cloud-platform:testClasses
> Task :sdks:java:io:google-cloud-platform:testJar
> Task :runners:google-cloud-dataflow-java:worker:legacy-worker:shadowJar
> Task :runners:google-cloud-dataflow-java:coreSDKJavaLegacyWorkerIntegrationTest NO-SOURCE
> Task :sdks:java:io:kinesis:integrationTest
> Task :sdks:java:io:google-cloud-platform:integrationTest
> Task :sdks:java:extensions:zetasketch:integrationTest
> Task :runners:google-cloud-dataflow-java:examplesJavaLegacyWorkerIntegrationTest

***********************************************************
***********************************************************
**********************Set Up Pubsub************************
The Pub/Sub topic has been set up for this example: projects/apache-beam-testing/topics/testpipeline-jenkins-0826120158-76cfaae
The Pub/Sub subscription has been set up for this example: projects/apache-beam-testing/subscriptions/testpipeline-jenkins-0826120158-76cfaae
******************Set Up Big Query Table*******************
The BigQuery table has been set up for this example: apache-beam-testing:traffic_routes_1598443308064.traffic_routes_table
*************************Tear Down*************************
The Pub/Sub topic has been deleted: projects/apache-beam-testing/topics/testpipeline-jenkins-0826120158-76cfaae
The Pub/Sub subscription has been deleted: projects/apache-beam-testing/subscriptions/testpipeline-jenkins-0826120158-76cfaae
The BigQuery table might contain the example's output, and it is not deleted automatically: apache-beam-testing:traffic_routes_1598443308064.traffic_routes_table
Please go to the Developers Console to delete it manually. Otherwise, you may be charged for its usage.
***********************************************************
***********************************************************

org.apache.beam.examples.snippets.transforms.io.gcp.bigquery.BigQuerySamplesIT > testTableIO FAILED
    java.lang.RuntimeException at BigQuerySamplesIT.java:120

> Task :sdks:java:io:google-cloud-platform:integrationTestKms

> Task :runners:google-cloud-dataflow-java:examplesJavaLegacyWorkerIntegrationTest

***********************************************************
***********************************************************
**********************Set Up Pubsub************************
The Pub/Sub topic has been set up for this example: projects/apache-beam-testing/topics/testpipeline-jenkins-0826120816-598262da
The Pub/Sub subscription has been set up for this example: projects/apache-beam-testing/subscriptions/testpipeline-jenkins-0826120816-598262da
******************Set Up Big Query Table*******************
The BigQuery table has been set up for this example: apache-beam-testing:traffic_max_lane_flow_1598443696119.traffic_max_lane_flow_table
*************************Tear Down*************************
The Pub/Sub topic has been deleted: projects/apache-beam-testing/topics/testpipeline-jenkins-0826120816-598262da
The Pub/Sub subscription has been deleted: projects/apache-beam-testing/subscriptions/testpipeline-jenkins-0826120816-598262da
The BigQuery table might contain the example's output, and it is not deleted automatically: apache-beam-testing:traffic_max_lane_flow_1598443696119.traffic_max_lane_flow_table
Please go to the Developers Console to delete it manually. Otherwise, you may be charged for its usage.
***********************************************************
***********************************************************

> Task :sdks:java:io:google-cloud-platform:postCommit
> Task :sdks:java:extensions:zetasketch:postCommit

> Task :runners:google-cloud-dataflow-java:examplesJavaLegacyWorkerIntegrationTest

***********************************************************
***********************************************************
*************************Tear Down*************************
The Pub/Sub topic has been deleted: projects/apache-beam-testing/topics/testpipeline-jenkins-0826122045-fbe3e365
The Pub/Sub subscription has been deleted: projects/apache-beam-testing/subscriptions/testpipeline-jenkins-0826122045-fbe3e365
The BigQuery table might contain the example's output, and it is not deleted automatically: apache-beam-testing:beam_examples.testpipeline_jenkins_0826122045_fbe3e365
Please go to the Developers Console to delete it manually. Otherwise, you may be charged for its usage.
***********************************************************
***********************************************************

10 tests completed, 1 failed

> Task :runners:google-cloud-dataflow-java:examplesJavaLegacyWorkerIntegrationTest FAILED
> Task :runners:google-cloud-dataflow-java:googleCloudPlatformLegacyWorkerIntegrationTest
> Task :runners:google-cloud-dataflow-java:googleCloudPlatformLegacyWorkerKmsIntegrationTest

FAILURE: Build failed with an exception.

* What went wrong:
Execution failed for task ':runners:google-cloud-dataflow-java:examplesJavaLegacyWorkerIntegrationTest'.
> There were failing tests. See the report at: file://<https://ci-beam.apache.org/job/beam_PostCommit_Java/ws/src/runners/google-cloud-dataflow-java/build/reports/tests/examplesJavaLegacyWorkerIntegrationTest/index.html>

* Try:
Run with --stacktrace option to get the stack trace. Run with --info or --debug option to get more log output. Run with --scan to get full insights.

* Get more help at https://help.gradle.org

Deprecated Gradle features were used in this build, making it incompatible with Gradle 6.0.
Use '--warning-mode all' to show the individual deprecation warnings.
See https://docs.gradle.org/5.2.1/userguide/command_line_interface.html#sec:command_line_warnings

BUILD FAILED in 1h 18m 6s
99 actionable tasks: 66 executed, 33 from cache

Publishing build scan...
https://gradle.com/s/jxyf3pkjjqjxw

Build step 'Invoke Gradle script' changed build result to FAILURE
Build step 'Invoke Gradle script' marked build as failure

---------------------------------------------------------------------
To unsubscribe, e-mail: builds-unsubscribe@beam.apache.org
For additional commands, e-mail: builds-help@beam.apache.org


Build failed in Jenkins: beam_PostCommit_Java #6518

Posted by Apache Jenkins Server <je...@builds.apache.org>.
See <https://ci-beam.apache.org/job/beam_PostCommit_Java/6518/display/redirect?page=changes>

Changes:

[noreply] [BEAM-9680] Add Aggregation Count lesson to Go SDK katas (#12646)


------------------------------------------
[...truncated 7.58 KB...]
> Task :sdks:java:fn-execution:processResources NO-SOURCE
> Task :sdks:java:extensions:google-cloud-platform-core:processResources NO-SOURCE
> Task :runners:core-construction-java:processResources NO-SOURCE
> Task :runners:core-java:processResources NO-SOURCE
> Task :vendor:sdks-java-extensions-protobuf:processResources NO-SOURCE
> Task :runners:java-fn-execution:processResources NO-SOURCE
> Task :sdks:java:harness:processResources NO-SOURCE
> Task :sdks:java:core:generateAvroJava NO-SOURCE
> Task :sdks:java:expansion-service:createCheckerFrameworkManifest
> Task :sdks:java:io:google-cloud-platform:processResources NO-SOURCE
> Task :sdks:java:expansion-service:processResources NO-SOURCE
> Task :runners:google-cloud-dataflow-java:worker:legacy-worker:processResources NO-SOURCE
> Task :sdks:java:extensions:protobuf:extractProto
> Task :examples:java:processResources NO-SOURCE
> Task :model:job-management:extractProto
> Task :sdks:java:extensions:ml:processResources NO-SOURCE
> Task :model:fn-execution:extractProto
> Task :sdks:java:extensions:google-cloud-platform-core:processTestResources NO-SOURCE
> Task :runners:local-java:processResources NO-SOURCE
> Task :runners:direct-java:processResources NO-SOURCE
> Task :sdks:java:extensions:protobuf:processResources NO-SOURCE
> Task :sdks:java:testing:test-utils:processResources NO-SOURCE
> Task :sdks:java:testing:test-utils:processTestResources NO-SOURCE
> Task :sdks:java:io:common:compileJava NO-SOURCE
> Task :sdks:java:io:common:processResources NO-SOURCE
> Task :sdks:java:io:common:classes UP-TO-DATE
> Task :examples:java:processTestResources
> Task :sdks:java:extensions:zetasketch:createCheckerFrameworkManifest
> Task :sdks:java:extensions:zetasketch:processResources NO-SOURCE
> Task :sdks:java:extensions:zetasketch:processTestResources NO-SOURCE
> Task :model:job-management:processResources
> Task :sdks:java:io:common:jar
> Task :sdks:java:io:common:processTestResources NO-SOURCE
> Task :runners:google-cloud-dataflow-java:processResources
> Task :sdks:java:core:generateGrammarSource FROM-CACHE
> Task :sdks:java:core:processResources
> Task :sdks:java:core:generateTestAvroProtocol NO-SOURCE
> Task :sdks:java:io:kinesis:processResources NO-SOURCE
> Task :sdks:java:io:kinesis:processTestResources NO-SOURCE
> Task :model:fn-execution:processResources
> Task :sdks:java:io:google-cloud-platform:processTestResources
> Task :runners:google-cloud-dataflow-java:copyGoogleCloudPlatformTestResources
> Task :sdks:java:core:generateTestAvroJava
> Task :sdks:java:core:generateTestGrammarSource NO-SOURCE
> Task :sdks:java:core:processTestResources
> Task :model:pipeline:extractIncludeProto
> Task :runners:google-cloud-dataflow-java:worker:windmill:extractIncludeProto
> Task :model:pipeline:extractProto
> Task :runners:google-cloud-dataflow-java:worker:windmill:extractProto
> Task :runners:google-cloud-dataflow-java:worker:windmill:generateProto
> Task :model:pipeline:generateProto
> Task :runners:google-cloud-dataflow-java:worker:windmill:compileJava FROM-CACHE
> Task :runners:google-cloud-dataflow-java:worker:windmill:processResources
> Task :runners:google-cloud-dataflow-java:worker:windmill:classes
> Task :model:pipeline:compileJava FROM-CACHE
> Task :model:pipeline:processResources
> Task :model:pipeline:classes
> Task :model:pipeline:jar
> Task :model:fn-execution:extractIncludeProto
> Task :model:job-management:extractIncludeProto
> Task :runners:google-cloud-dataflow-java:worker:windmill:shadowJar
> Task :model:job-management:generateProto
> Task :model:fn-execution:generateProto
> Task :model:fn-execution:compileJava FROM-CACHE
> Task :model:fn-execution:classes
> Task :model:job-management:compileJava FROM-CACHE
> Task :model:job-management:classes
> Task :model:pipeline:shadowJar
> Task :model:job-management:shadowJar
> Task :model:fn-execution:shadowJar
> Task :sdks:java:core:compileJava FROM-CACHE
> Task :sdks:java:core:classes
> Task :sdks:java:core:shadowJar
> Task :sdks:java:io:common:compileTestJava FROM-CACHE
> Task :sdks:java:io:common:testClasses UP-TO-DATE
> Task :sdks:java:io:common:testJar
> Task :sdks:java:io:kinesis:compileJava FROM-CACHE
> Task :sdks:java:io:kinesis:classes UP-TO-DATE
> Task :runners:local-java:compileJava FROM-CACHE
> Task :runners:local-java:classes UP-TO-DATE
> Task :runners:local-java:jar
> Task :vendor:sdks-java-extensions-protobuf:compileJava FROM-CACHE
> Task :vendor:sdks-java-extensions-protobuf:classes UP-TO-DATE
> Task :sdks:java:extensions:google-cloud-platform-core:compileJava FROM-CACHE
> Task :sdks:java:extensions:google-cloud-platform-core:classes UP-TO-DATE
> Task :sdks:java:io:kinesis:compileTestJava FROM-CACHE
> Task :sdks:java:io:kinesis:testClasses UP-TO-DATE
> Task :sdks:java:extensions:zetasketch:compileJava FROM-CACHE
> Task :sdks:java:extensions:zetasketch:classes UP-TO-DATE
> Task :sdks:java:extensions:google-cloud-platform-core:jar
> Task :sdks:java:fn-execution:compileJava FROM-CACHE
> Task :sdks:java:fn-execution:classes UP-TO-DATE
> Task :runners:core-construction-java:compileJava FROM-CACHE
> Task :runners:core-construction-java:classes UP-TO-DATE
> Task :sdks:java:fn-execution:jar
> Task :vendor:sdks-java-extensions-protobuf:shadowJar
> Task :runners:core-construction-java:jar
> Task :sdks:java:testing:test-utils:compileJava FROM-CACHE
> Task :sdks:java:testing:test-utils:classes UP-TO-DATE
> Task :sdks:java:testing:test-utils:jar
> Task :sdks:java:testing:test-utils:compileTestJava FROM-CACHE
> Task :sdks:java:testing:test-utils:testClasses UP-TO-DATE
> Task :sdks:java:testing:test-utils:testJar
> Task :runners:core-java:compileJava FROM-CACHE
> Task :runners:core-java:classes UP-TO-DATE
> Task :runners:core-java:jar
> Task :sdks:java:harness:compileJava FROM-CACHE
> Task :sdks:java:harness:classes UP-TO-DATE
> Task :sdks:java:extensions:protobuf:extractIncludeProto
> Task :sdks:java:extensions:protobuf:generateProto NO-SOURCE
> Task :sdks:java:harness:jar
> Task :sdks:java:extensions:protobuf:compileJava FROM-CACHE
> Task :sdks:java:extensions:protobuf:classes UP-TO-DATE
> Task :sdks:java:extensions:protobuf:jar
> Task :sdks:java:core:compileTestJava FROM-CACHE
> Task :sdks:java:core:testClasses
> Task :sdks:java:core:shadowTestJar
> Task :sdks:java:extensions:google-cloud-platform-core:compileTestJava FROM-CACHE
> Task :sdks:java:extensions:google-cloud-platform-core:testClasses UP-TO-DATE
> Task :sdks:java:extensions:google-cloud-platform-core:testJar
> Task :sdks:java:extensions:google-cloud-platform-core:integrationTestKms
> Task :sdks:java:extensions:google-cloud-platform-core:postCommit
> Task :sdks:java:harness:shadowJar
> Task :runners:java-fn-execution:compileJava FROM-CACHE
> Task :runners:java-fn-execution:classes UP-TO-DATE
> Task :runners:java-fn-execution:jar
> Task :sdks:java:expansion-service:compileJava FROM-CACHE
> Task :sdks:java:expansion-service:classes UP-TO-DATE
> Task :sdks:java:expansion-service:jar
> Task :runners:direct-java:compileJava FROM-CACHE
> Task :runners:direct-java:classes UP-TO-DATE
> Task :sdks:java:extensions:ml:compileJava FROM-CACHE
> Task :sdks:java:extensions:ml:classes UP-TO-DATE
> Task :sdks:java:extensions:ml:jar
> Task :sdks:java:io:google-cloud-platform:compileJava FROM-CACHE
> Task :sdks:java:io:google-cloud-platform:classes UP-TO-DATE
> Task :sdks:java:io:google-cloud-platform:jar
> Task :runners:direct-java:shadowJar
> Task :sdks:java:extensions:zetasketch:compileTestJava FROM-CACHE
> Task :sdks:java:extensions:zetasketch:testClasses UP-TO-DATE
> Task :examples:java:compileJava FROM-CACHE
> Task :examples:java:classes UP-TO-DATE
> Task :runners:google-cloud-dataflow-java:compileJava FROM-CACHE
> Task :runners:google-cloud-dataflow-java:classes
> Task :sdks:java:io:google-cloud-platform:compileTestJava FROM-CACHE
> Task :sdks:java:io:google-cloud-platform:testClasses
> Task :examples:java:jar
> Task :runners:google-cloud-dataflow-java:jar
> Task :sdks:java:io:google-cloud-platform:testJar
> Task :examples:java:compileTestJava FROM-CACHE
> Task :examples:java:testClasses
> Task :examples:java:testJar
> Task :runners:google-cloud-dataflow-java:worker:legacy-worker:compileJava FROM-CACHE
> Task :runners:google-cloud-dataflow-java:worker:legacy-worker:classes UP-TO-DATE
> Task :runners:google-cloud-dataflow-java:worker:legacy-worker:shadowJar
> Task :runners:google-cloud-dataflow-java:coreSDKJavaLegacyWorkerIntegrationTest NO-SOURCE
> Task :sdks:java:io:kinesis:integrationTest
> Task :sdks:java:io:google-cloud-platform:integrationTest
> Task :sdks:java:extensions:zetasketch:integrationTest
> Task :runners:google-cloud-dataflow-java:examplesJavaLegacyWorkerIntegrationTest

***********************************************************
***********************************************************
**********************Set Up Pubsub************************
The Pub/Sub topic has been set up for this example: projects/apache-beam-testing/topics/testpipeline-jenkins-0826060229-7af73149
The Pub/Sub subscription has been set up for this example: projects/apache-beam-testing/subscriptions/testpipeline-jenkins-0826060229-7af73149
******************Set Up Big Query Table*******************
The BigQuery table has been set up for this example: apache-beam-testing:traffic_routes_1598421735377.traffic_routes_table
*************************Tear Down*************************
The Pub/Sub topic has been deleted: projects/apache-beam-testing/topics/testpipeline-jenkins-0826060229-7af73149
The Pub/Sub subscription has been deleted: projects/apache-beam-testing/subscriptions/testpipeline-jenkins-0826060229-7af73149
The BigQuery table might contain the example's output, and it is not deleted automatically: apache-beam-testing:traffic_routes_1598421735377.traffic_routes_table
Please go to the Developers Console to delete it manually. Otherwise, you may be charged for its usage.
***********************************************************
***********************************************************

> Task :sdks:java:extensions:zetasketch:integrationTest

org.apache.beam.sdk.extensions.zetasketch.BigQueryHllSketchCompatibilityIT > testWriteNonEmptySketchToBigQuery FAILED
    java.lang.RuntimeException at BigQueryHllSketchCompatibilityIT.java:257

> Task :sdks:java:io:google-cloud-platform:integrationTestKms

> Task :runners:google-cloud-dataflow-java:examplesJavaLegacyWorkerIntegrationTest

***********************************************************
***********************************************************
**********************Set Up Pubsub************************
The Pub/Sub topic has been set up for this example: projects/apache-beam-testing/topics/testpipeline-jenkins-0826060803-dda5c09a
The Pub/Sub subscription has been set up for this example: projects/apache-beam-testing/subscriptions/testpipeline-jenkins-0826060803-dda5c09a
******************Set Up Big Query Table*******************
The BigQuery table has been set up for this example: apache-beam-testing:traffic_max_lane_flow_1598422082976.traffic_max_lane_flow_table
*************************Tear Down*************************
The Pub/Sub topic has been deleted: projects/apache-beam-testing/topics/testpipeline-jenkins-0826060803-dda5c09a
The Pub/Sub subscription has been deleted: projects/apache-beam-testing/subscriptions/testpipeline-jenkins-0826060803-dda5c09a
The BigQuery table might contain the example's output, and it is not deleted automatically: apache-beam-testing:traffic_max_lane_flow_1598422082976.traffic_max_lane_flow_table
Please go to the Developers Console to delete it manually. Otherwise, you may be charged for its usage.
***********************************************************
***********************************************************

> Task :sdks:java:extensions:zetasketch:integrationTest

org.apache.beam.sdk.extensions.zetasketch.BigQueryHllSketchCompatibilityIT > testWriteEmptySketchToBigQuery FAILED
    java.lang.RuntimeException at BigQueryHllSketchCompatibilityIT.java:257

4 tests completed, 2 failed

> Task :sdks:java:extensions:zetasketch:integrationTest FAILED
> Task :sdks:java:io:google-cloud-platform:postCommit

> Task :runners:google-cloud-dataflow-java:examplesJavaLegacyWorkerIntegrationTest

***********************************************************
***********************************************************
*************************Tear Down*************************
The Pub/Sub topic has been deleted: projects/apache-beam-testing/topics/testpipeline-jenkins-0826062041-c648c640
The Pub/Sub subscription has been deleted: projects/apache-beam-testing/subscriptions/testpipeline-jenkins-0826062041-c648c640
The BigQuery table might contain the example's output, and it is not deleted automatically: apache-beam-testing:beam_examples.testpipeline_jenkins_0826062041_c648c640
Please go to the Developers Console to delete it manually. Otherwise, you may be charged for its usage.
***********************************************************
***********************************************************

> Task :runners:google-cloud-dataflow-java:googleCloudPlatformLegacyWorkerIntegrationTest
> Task :runners:google-cloud-dataflow-java:googleCloudPlatformLegacyWorkerKmsIntegrationTest
> Task :runners:google-cloud-dataflow-java:postCommit

FAILURE: Build failed with an exception.

* What went wrong:
Execution failed for task ':sdks:java:extensions:zetasketch:integrationTest'.
> There were failing tests. See the report at: file://<https://ci-beam.apache.org/job/beam_PostCommit_Java/ws/src/sdks/java/extensions/zetasketch/build/reports/tests/integrationTest/index.html>

* Try:
Run with --stacktrace option to get the stack trace. Run with --info or --debug option to get more log output. Run with --scan to get full insights.

* Get more help at https://help.gradle.org

Deprecated Gradle features were used in this build, making it incompatible with Gradle 6.0.
Use '--warning-mode all' to show the individual deprecation warnings.
See https://docs.gradle.org/5.2.1/userguide/command_line_interface.html#sec:command_line_warnings

BUILD FAILED in 1h 17m 25s
99 actionable tasks: 66 executed, 33 from cache

Publishing build scan...
https://gradle.com/s/57vvwnximtisa

Build step 'Invoke Gradle script' changed build result to FAILURE
Build step 'Invoke Gradle script' marked build as failure

---------------------------------------------------------------------
To unsubscribe, e-mail: builds-unsubscribe@beam.apache.org
For additional commands, e-mail: builds-help@beam.apache.org


Build failed in Jenkins: beam_PostCommit_Java #6517

Posted by Apache Jenkins Server <je...@builds.apache.org>.
See <https://ci-beam.apache.org/job/beam_PostCommit_Java/6517/display/redirect?page=changes>

Changes:

[rehmanmuradali0] Adding key in Spark

[kmjung] Update BigQuery storage API source to v1

[kmjung] Make stream progress reporting work with v1 API

[kmjung] Clean up some leftovers

[kmjung] Address code review feedback

[noreply] Dataframe set_index is not index preserving (#12676)


------------------------------------------
[...truncated 18.95 KB...]
> Task :runners:google-cloud-dataflow-java:worker:windmill:extractIncludeProto
> Task :model:pipeline:extractProto
> Task :runners:google-cloud-dataflow-java:worker:windmill:extractProto
> Task :runners:google-cloud-dataflow-java:worker:windmill:generateProto
> Task :model:pipeline:generateProto
> Task :runners:google-cloud-dataflow-java:worker:windmill:compileJava FROM-CACHE
> Task :runners:google-cloud-dataflow-java:worker:windmill:processResources
> Task :runners:google-cloud-dataflow-java:worker:windmill:classes
> Task :model:pipeline:compileJava FROM-CACHE
> Task :model:pipeline:processResources
> Task :model:pipeline:classes
> Task :model:pipeline:jar
> Task :model:job-management:extractIncludeProto
> Task :model:fn-execution:extractIncludeProto
> Task :model:job-management:generateProto
> Task :model:fn-execution:generateProto
> Task :model:job-management:compileJava FROM-CACHE
> Task :model:job-management:classes
> Task :model:fn-execution:compileJava FROM-CACHE
> Task :model:fn-execution:classes
> Task :runners:google-cloud-dataflow-java:worker:windmill:shadowJar
> Task :model:pipeline:shadowJar
> Task :model:job-management:shadowJar
> Task :model:fn-execution:shadowJar
> Task :sdks:java:core:compileJava FROM-CACHE
> Task :sdks:java:core:classes
> Task :sdks:java:core:shadowJar
> Task :sdks:java:extensions:zetasketch:compileJava FROM-CACHE
> Task :sdks:java:extensions:zetasketch:classes UP-TO-DATE
> Task :sdks:java:io:common:compileTestJava FROM-CACHE
> Task :sdks:java:io:common:testClasses UP-TO-DATE
> Task :sdks:java:io:common:testJar
> Task :runners:local-java:compileJava FROM-CACHE
> Task :runners:local-java:classes UP-TO-DATE
> Task :sdks:java:extensions:google-cloud-platform-core:compileJava FROM-CACHE
> Task :sdks:java:extensions:google-cloud-platform-core:classes UP-TO-DATE
> Task :vendor:sdks-java-extensions-protobuf:compileJava FROM-CACHE
> Task :vendor:sdks-java-extensions-protobuf:classes UP-TO-DATE
> Task :sdks:java:fn-execution:compileJava FROM-CACHE
> Task :sdks:java:fn-execution:classes UP-TO-DATE
> Task :runners:local-java:jar
> Task :runners:core-construction-java:compileJava FROM-CACHE
> Task :runners:core-construction-java:classes UP-TO-DATE
> Task :sdks:java:extensions:google-cloud-platform-core:jar
> Task :vendor:sdks-java-extensions-protobuf:shadowJar
> Task :sdks:java:fn-execution:jar
> Task :sdks:java:extensions:protobuf:extractIncludeProto
> Task :sdks:java:extensions:protobuf:generateProto NO-SOURCE
> Task :sdks:java:io:kinesis:compileJava FROM-CACHE
> Task :sdks:java:io:kinesis:classes UP-TO-DATE
> Task :sdks:java:extensions:protobuf:compileJava FROM-CACHE
> Task :sdks:java:extensions:protobuf:classes UP-TO-DATE
> Task :sdks:java:extensions:protobuf:jar
> Task :sdks:java:testing:test-utils:compileJava FROM-CACHE
> Task :sdks:java:testing:test-utils:classes UP-TO-DATE
> Task :sdks:java:testing:test-utils:jar
> Task :sdks:java:testing:test-utils:compileTestJava FROM-CACHE
> Task :sdks:java:testing:test-utils:testClasses UP-TO-DATE
> Task :sdks:java:testing:test-utils:testJar
> Task :runners:core-construction-java:jar
> Task :sdks:java:io:kinesis:compileTestJava FROM-CACHE
> Task :sdks:java:io:kinesis:testClasses UP-TO-DATE
> Task :runners:core-java:compileJava FROM-CACHE
> Task :runners:core-java:classes UP-TO-DATE
> Task :runners:core-java:jar
> Task :sdks:java:harness:compileJava FROM-CACHE
> Task :sdks:java:harness:classes UP-TO-DATE
> Task :sdks:java:harness:jar
> Task :sdks:java:core:compileTestJava FROM-CACHE
> Task :sdks:java:core:testClasses
> Task :sdks:java:core:shadowTestJar
> Task :sdks:java:extensions:google-cloud-platform-core:compileTestJava FROM-CACHE
> Task :sdks:java:extensions:google-cloud-platform-core:testClasses UP-TO-DATE
> Task :sdks:java:extensions:google-cloud-platform-core:testJar
> Task :sdks:java:harness:shadowJar
> Task :sdks:java:extensions:google-cloud-platform-core:integrationTestKms
> Task :sdks:java:extensions:google-cloud-platform-core:postCommit
> Task :runners:java-fn-execution:compileJava FROM-CACHE
> Task :runners:java-fn-execution:classes UP-TO-DATE
> Task :runners:java-fn-execution:jar
> Task :sdks:java:expansion-service:compileJava FROM-CACHE
> Task :sdks:java:expansion-service:classes UP-TO-DATE
> Task :sdks:java:expansion-service:jar
> Task :runners:direct-java:compileJava FROM-CACHE
> Task :runners:direct-java:classes UP-TO-DATE
> Task :sdks:java:extensions:ml:compileJava FROM-CACHE
> Task :sdks:java:extensions:ml:classes UP-TO-DATE
> Task :sdks:java:extensions:ml:jar
> Task :runners:direct-java:shadowJar
> Task :sdks:java:io:google-cloud-platform:compileJava
> Task :sdks:java:io:kinesis:integrationTest

> Task :sdks:java:io:google-cloud-platform:compileJava
Note: Some input files use or override a deprecated API.
Note: Recompile with -Xlint:deprecation for details.
Note: Some input files use unchecked or unsafe operations.
Note: Recompile with -Xlint:unchecked for details.

> Task :sdks:java:io:google-cloud-platform:classes
> Task :sdks:java:io:google-cloud-platform:jar

> Task :examples:java:compileJava
Note: Some input files use or override a deprecated API.
Note: Recompile with -Xlint:deprecation for details.
Note: <https://ci-beam.apache.org/job/beam_PostCommit_Java/ws/src/examples/java/src/main/java/org/apache/beam/examples/snippets/transforms/io/gcp/bigquery/BigQueryMyData.java> uses unchecked or unsafe operations.
Note: Recompile with -Xlint:unchecked for details.

> Task :examples:java:classes
> Task :examples:java:jar
> Task :runners:google-cloud-dataflow-java:compileJava
> Task :sdks:java:io:google-cloud-platform:compileTestJava
> Task :sdks:java:extensions:zetasketch:compileTestJava

> Task :examples:java:compileTestJava
Note: Some input files use or override a deprecated API.
Note: Recompile with -Xlint:deprecation for details.
Note: Some input files use unchecked or unsafe operations.
Note: Recompile with -Xlint:unchecked for details.

> Task :examples:java:testClasses
> Task :examples:java:testJar

> Task :runners:google-cloud-dataflow-java:compileJava
Note: Some input files use or override a deprecated API.
Note: Recompile with -Xlint:deprecation for details.
Note: Some input files use unchecked or unsafe operations.
Note: Recompile with -Xlint:unchecked for details.

> Task :runners:google-cloud-dataflow-java:classes
> Task :runners:google-cloud-dataflow-java:jar

> Task :sdks:java:extensions:zetasketch:compileTestJava
Note: <https://ci-beam.apache.org/job/beam_PostCommit_Java/ws/src/sdks/java/extensions/zetasketch/src/test/java/org/apache/beam/sdk/extensions/zetasketch/HllCountTest.java> uses or overrides a deprecated API.
Note: Recompile with -Xlint:deprecation for details.

> Task :sdks:java:extensions:zetasketch:testClasses

> Task :sdks:java:io:google-cloud-platform:compileTestJava
Note: Some input files use or override a deprecated API.
Note: Recompile with -Xlint:deprecation for details.
Note: Some input files use unchecked or unsafe operations.
Note: Recompile with -Xlint:unchecked for details.

> Task :sdks:java:io:google-cloud-platform:testClasses
> Task :sdks:java:io:google-cloud-platform:testJar

> Task :runners:google-cloud-dataflow-java:worker:legacy-worker:compileJava
Note: Some input files use or override a deprecated API.
Note: Recompile with -Xlint:deprecation for details.
Note: Some input files use unchecked or unsafe operations.
Note: Recompile with -Xlint:unchecked for details.

> Task :runners:google-cloud-dataflow-java:worker:legacy-worker:classes
> Task :runners:google-cloud-dataflow-java:worker:legacy-worker:shadowJar
> Task :runners:google-cloud-dataflow-java:coreSDKJavaLegacyWorkerIntegrationTest NO-SOURCE
> Task :sdks:java:io:google-cloud-platform:integrationTest
> Task :sdks:java:extensions:zetasketch:integrationTest
> Task :runners:google-cloud-dataflow-java:examplesJavaLegacyWorkerIntegrationTest

org.apache.beam.examples.complete.TfIdfIT > testE2ETfIdf FAILED
    java.lang.RuntimeException at TfIdfIT.java:70

org.apache.beam.examples.complete.TrafficRoutesIT > testE2ETrafficRoutes FAILED
    java.lang.RuntimeException at TrafficRoutesIT.java:74

org.apache.beam.examples.snippets.transforms.io.gcp.bigquery.BigQuerySamplesIT > testTableIO FAILED
    java.lang.RuntimeException at BigQuerySamplesIT.java:120

***********************************************************
***********************************************************
**********************Set Up Pubsub************************
The Pub/Sub topic has been set up for this example: projects/apache-beam-testing/topics/testpipeline-jenkins-0826000444-b587e8ab
The Pub/Sub subscription has been set up for this example: projects/apache-beam-testing/subscriptions/testpipeline-jenkins-0826000444-b587e8ab
******************Set Up Big Query Table*******************
The BigQuery table has been set up for this example: apache-beam-testing:traffic_max_lane_flow_1598400283795.traffic_max_lane_flow_table
*************************Tear Down*************************
The Pub/Sub topic has been deleted: projects/apache-beam-testing/topics/testpipeline-jenkins-0826000444-b587e8ab
The Pub/Sub subscription has been deleted: projects/apache-beam-testing/subscriptions/testpipeline-jenkins-0826000444-b587e8ab
The BigQuery table might contain the example's output, and it is not deleted automatically: apache-beam-testing:traffic_max_lane_flow_1598400283795.traffic_max_lane_flow_table
Please go to the Developers Console to delete it manually. Otherwise, you may be charged for its usage.
***********************************************************
***********************************************************

> Task :sdks:java:io:google-cloud-platform:integrationTestKms
> Task :sdks:java:io:google-cloud-platform:postCommit

> Task :sdks:java:extensions:zetasketch:integrationTest

org.apache.beam.sdk.extensions.zetasketch.BigQueryHllSketchCompatibilityIT > testWriteEmptySketchToBigQuery FAILED
    java.lang.RuntimeException at BigQueryHllSketchCompatibilityIT.java:257

4 tests completed, 1 failed

> Task :sdks:java:extensions:zetasketch:integrationTest FAILED

> Task :runners:google-cloud-dataflow-java:examplesJavaLegacyWorkerIntegrationTest

***********************************************************
***********************************************************
*************************Tear Down*************************
The Pub/Sub topic has been deleted: projects/apache-beam-testing/topics/testpipeline-jenkins-0826002235-d63fc1e4
The Pub/Sub subscription has been deleted: projects/apache-beam-testing/subscriptions/testpipeline-jenkins-0826002235-d63fc1e4
The BigQuery table might contain the example's output, and it is not deleted automatically: apache-beam-testing:beam_examples.testpipeline_jenkins_0826002235_d63fc1e4
Please go to the Developers Console to delete it manually. Otherwise, you may be charged for its usage.
***********************************************************
***********************************************************

10 tests completed, 3 failed

> Task :runners:google-cloud-dataflow-java:examplesJavaLegacyWorkerIntegrationTest FAILED
> Task :runners:google-cloud-dataflow-java:googleCloudPlatformLegacyWorkerIntegrationTest
> Task :runners:google-cloud-dataflow-java:googleCloudPlatformLegacyWorkerKmsIntegrationTest

FAILURE: Build completed with 2 failures.

1: Task failed with an exception.
-----------
* What went wrong:
Execution failed for task ':sdks:java:extensions:zetasketch:integrationTest'.
> There were failing tests. See the report at: file://<https://ci-beam.apache.org/job/beam_PostCommit_Java/ws/src/sdks/java/extensions/zetasketch/build/reports/tests/integrationTest/index.html>

* Try:
Run with --stacktrace option to get the stack trace. Run with --info or --debug option to get more log output. Run with --scan to get full insights.
==============================================================================

2: Task failed with an exception.
-----------
* What went wrong:
Execution failed for task ':runners:google-cloud-dataflow-java:examplesJavaLegacyWorkerIntegrationTest'.
> There were failing tests. See the report at: file://<https://ci-beam.apache.org/job/beam_PostCommit_Java/ws/src/runners/google-cloud-dataflow-java/build/reports/tests/examplesJavaLegacyWorkerIntegrationTest/index.html>

* Try:
Run with --stacktrace option to get the stack trace. Run with --info or --debug option to get more log output. Run with --scan to get full insights.
==============================================================================

* Get more help at https://help.gradle.org

Deprecated Gradle features were used in this build, making it incompatible with Gradle 6.0.
Use '--warning-mode all' to show the individual deprecation warnings.
See https://docs.gradle.org/5.2.1/userguide/command_line_interface.html#sec:command_line_warnings

BUILD FAILED in 1h 17m 47s
99 actionable tasks: 73 executed, 26 from cache

Publishing build scan...
https://gradle.com/s/bybtm7lplvwwa

Build step 'Invoke Gradle script' changed build result to FAILURE
Build step 'Invoke Gradle script' marked build as failure

---------------------------------------------------------------------
To unsubscribe, e-mail: builds-unsubscribe@beam.apache.org
For additional commands, e-mail: builds-help@beam.apache.org


Build failed in Jenkins: beam_PostCommit_Java #6516

Posted by Apache Jenkins Server <je...@builds.apache.org>.
See <https://ci-beam.apache.org/job/beam_PostCommit_Java/6516/display/redirect>

Changes:


------------------------------------------
[...truncated 7.53 KB...]
> Configure project :sdks:java:container
Found go 1.12 in /usr/bin/go, use it.

> Task :sdks:java:harness:processResources NO-SOURCE
> Task :sdks:java:extensions:google-cloud-platform-core:processResources NO-SOURCE
> Task :runners:core-java:processResources NO-SOURCE
> Task :runners:core-construction-java:processResources NO-SOURCE
> Task :runners:java-fn-execution:processResources NO-SOURCE
> Task :sdks:java:fn-execution:processResources NO-SOURCE
> Task :sdks:java:core:generateAvroProtocol NO-SOURCE
> Task :vendor:sdks-java-extensions-protobuf:processResources NO-SOURCE
> Task :sdks:java:core:generateAvroJava NO-SOURCE
> Task :examples:java:processResources NO-SOURCE
> Task :sdks:java:extensions:protobuf:extractProto
> Task :sdks:java:expansion-service:createCheckerFrameworkManifest
> Task :model:job-management:extractProto
> Task :model:fn-execution:extractProto
> Task :sdks:java:expansion-service:processResources NO-SOURCE
> Task :sdks:java:io:google-cloud-platform:processResources NO-SOURCE
> Task :runners:google-cloud-dataflow-java:worker:legacy-worker:processResources NO-SOURCE
> Task :runners:direct-java:processResources NO-SOURCE
> Task :sdks:java:extensions:ml:processResources NO-SOURCE
> Task :examples:java:processTestResources
> Task :sdks:java:extensions:google-cloud-platform-core:processTestResources NO-SOURCE
> Task :sdks:java:extensions:protobuf:processResources NO-SOURCE
> Task :runners:local-java:processResources NO-SOURCE
> Task :model:job-management:processResources
> Task :sdks:java:io:common:compileJava NO-SOURCE
> Task :sdks:java:testing:test-utils:processResources NO-SOURCE
> Task :sdks:java:io:common:processResources NO-SOURCE
> Task :sdks:java:io:common:classes UP-TO-DATE
> Task :sdks:java:testing:test-utils:processTestResources NO-SOURCE
> Task :model:fn-execution:processResources
> Task :sdks:java:extensions:zetasketch:createCheckerFrameworkManifest
> Task :sdks:java:extensions:zetasketch:processResources NO-SOURCE
> Task :sdks:java:io:common:jar
> Task :sdks:java:io:common:processTestResources NO-SOURCE
> Task :sdks:java:extensions:zetasketch:processTestResources NO-SOURCE
> Task :runners:google-cloud-dataflow-java:processResources
> Task :sdks:java:io:kinesis:processResources NO-SOURCE
> Task :sdks:java:io:google-cloud-platform:processTestResources
> Task :runners:google-cloud-dataflow-java:copyGoogleCloudPlatformTestResources
> Task :sdks:java:io:kinesis:processTestResources NO-SOURCE
> Task :sdks:java:core:generateGrammarSource FROM-CACHE
> Task :sdks:java:core:processResources
> Task :sdks:java:core:generateTestAvroProtocol NO-SOURCE
> Task :sdks:java:core:generateTestAvroJava
> Task :sdks:java:core:generateTestGrammarSource NO-SOURCE
> Task :sdks:java:core:processTestResources
> Task :model:pipeline:extractIncludeProto
> Task :runners:google-cloud-dataflow-java:worker:windmill:extractIncludeProto
> Task :runners:google-cloud-dataflow-java:worker:windmill:extractProto
> Task :model:pipeline:extractProto
> Task :runners:google-cloud-dataflow-java:worker:windmill:generateProto
> Task :model:pipeline:generateProto
> Task :runners:google-cloud-dataflow-java:worker:windmill:compileJava FROM-CACHE
> Task :model:pipeline:compileJava FROM-CACHE
> Task :runners:google-cloud-dataflow-java:worker:windmill:processResources
> Task :runners:google-cloud-dataflow-java:worker:windmill:classes
> Task :model:pipeline:processResources
> Task :model:pipeline:classes
> Task :model:pipeline:jar
> Task :model:fn-execution:extractIncludeProto
> Task :model:job-management:extractIncludeProto
> Task :model:job-management:generateProto
> Task :model:fn-execution:generateProto
> Task :model:job-management:compileJava FROM-CACHE
> Task :model:job-management:classes
> Task :model:fn-execution:compileJava FROM-CACHE
> Task :model:fn-execution:classes
> Task :runners:google-cloud-dataflow-java:worker:windmill:shadowJar
> Task :model:pipeline:shadowJar
> Task :model:job-management:shadowJar
> Task :model:fn-execution:shadowJar
> Task :sdks:java:core:compileJava FROM-CACHE
> Task :sdks:java:core:classes
> Task :sdks:java:core:shadowJar
> Task :runners:local-java:compileJava FROM-CACHE
> Task :runners:local-java:classes UP-TO-DATE
> Task :runners:local-java:jar
> Task :vendor:sdks-java-extensions-protobuf:compileJava FROM-CACHE
> Task :vendor:sdks-java-extensions-protobuf:classes UP-TO-DATE
> Task :sdks:java:io:kinesis:compileJava FROM-CACHE
> Task :sdks:java:io:kinesis:classes UP-TO-DATE
> Task :runners:core-construction-java:compileJava FROM-CACHE
> Task :runners:core-construction-java:classes UP-TO-DATE
> Task :sdks:java:extensions:protobuf:extractIncludeProto
> Task :sdks:java:extensions:protobuf:generateProto NO-SOURCE
> Task :sdks:java:io:common:compileTestJava FROM-CACHE
> Task :sdks:java:io:common:testClasses UP-TO-DATE
> Task :sdks:java:io:common:testJar
> Task :sdks:java:extensions:protobuf:compileJava FROM-CACHE
> Task :sdks:java:extensions:protobuf:classes UP-TO-DATE
> Task :sdks:java:extensions:protobuf:jar
> Task :sdks:java:extensions:google-cloud-platform-core:compileJava FROM-CACHE
> Task :sdks:java:extensions:google-cloud-platform-core:classes UP-TO-DATE
> Task :vendor:sdks-java-extensions-protobuf:shadowJar
> Task :runners:core-construction-java:jar
> Task :sdks:java:extensions:zetasketch:compileJava FROM-CACHE
> Task :sdks:java:extensions:zetasketch:classes UP-TO-DATE
> Task :sdks:java:extensions:google-cloud-platform-core:jar
> Task :sdks:java:fn-execution:compileJava FROM-CACHE
> Task :sdks:java:fn-execution:classes UP-TO-DATE
> Task :sdks:java:io:kinesis:compileTestJava FROM-CACHE
> Task :sdks:java:io:kinesis:testClasses UP-TO-DATE
> Task :sdks:java:fn-execution:jar
> Task :sdks:java:testing:test-utils:compileJava FROM-CACHE
> Task :sdks:java:testing:test-utils:classes UP-TO-DATE
> Task :sdks:java:testing:test-utils:jar
> Task :sdks:java:testing:test-utils:compileTestJava FROM-CACHE
> Task :sdks:java:testing:test-utils:testClasses UP-TO-DATE
> Task :sdks:java:testing:test-utils:testJar
> Task :runners:core-java:compileJava FROM-CACHE
> Task :runners:core-java:classes UP-TO-DATE
> Task :runners:core-java:jar
> Task :sdks:java:harness:compileJava FROM-CACHE
> Task :sdks:java:harness:classes UP-TO-DATE
> Task :sdks:java:harness:jar
> Task :sdks:java:core:compileTestJava FROM-CACHE
> Task :sdks:java:core:testClasses
> Task :sdks:java:core:shadowTestJar
> Task :sdks:java:extensions:google-cloud-platform-core:compileTestJava FROM-CACHE
> Task :sdks:java:extensions:google-cloud-platform-core:testClasses UP-TO-DATE
> Task :sdks:java:extensions:google-cloud-platform-core:testJar
> Task :sdks:java:extensions:google-cloud-platform-core:integrationTestKms
> Task :sdks:java:extensions:google-cloud-platform-core:postCommit
> Task :sdks:java:harness:shadowJar
> Task :runners:java-fn-execution:compileJava FROM-CACHE
> Task :runners:java-fn-execution:classes UP-TO-DATE
> Task :runners:java-fn-execution:jar
> Task :sdks:java:expansion-service:compileJava FROM-CACHE
> Task :sdks:java:expansion-service:classes UP-TO-DATE
> Task :sdks:java:expansion-service:jar
> Task :runners:direct-java:compileJava FROM-CACHE
> Task :runners:direct-java:classes UP-TO-DATE
> Task :sdks:java:extensions:ml:compileJava FROM-CACHE
> Task :sdks:java:extensions:ml:classes UP-TO-DATE
> Task :sdks:java:extensions:ml:jar
> Task :sdks:java:io:google-cloud-platform:compileJava FROM-CACHE
> Task :sdks:java:io:google-cloud-platform:classes UP-TO-DATE
> Task :sdks:java:io:google-cloud-platform:jar
> Task :sdks:java:extensions:zetasketch:compileTestJava FROM-CACHE
> Task :sdks:java:extensions:zetasketch:testClasses UP-TO-DATE
> Task :runners:google-cloud-dataflow-java:compileJava FROM-CACHE
> Task :runners:google-cloud-dataflow-java:classes
> Task :examples:java:compileJava FROM-CACHE
> Task :examples:java:classes UP-TO-DATE
> Task :runners:google-cloud-dataflow-java:jar
> Task :examples:java:jar
> Task :examples:java:compileTestJava FROM-CACHE
> Task :examples:java:testClasses
> Task :examples:java:testJar
> Task :runners:direct-java:shadowJar
> Task :runners:google-cloud-dataflow-java:worker:legacy-worker:compileJava FROM-CACHE
> Task :runners:google-cloud-dataflow-java:worker:legacy-worker:classes UP-TO-DATE
> Task :sdks:java:io:google-cloud-platform:compileTestJava FROM-CACHE
> Task :sdks:java:io:google-cloud-platform:testClasses
> Task :sdks:java:io:google-cloud-platform:testJar
> Task :runners:google-cloud-dataflow-java:worker:legacy-worker:shadowJar
> Task :runners:google-cloud-dataflow-java:coreSDKJavaLegacyWorkerIntegrationTest NO-SOURCE
> Task :sdks:java:io:kinesis:integrationTest
> Task :sdks:java:io:google-cloud-platform:integrationTest
> Task :sdks:java:extensions:zetasketch:integrationTest
> Task :runners:google-cloud-dataflow-java:examplesJavaLegacyWorkerIntegrationTest

org.apache.beam.examples.snippets.transforms.io.gcp.bigquery.BigQuerySamplesIT > testTableIO FAILED
    java.lang.RuntimeException at BigQuerySamplesIT.java:120

***********************************************************
***********************************************************
**********************Set Up Pubsub************************
The Pub/Sub topic has been set up for this example: projects/apache-beam-testing/topics/testpipeline-jenkins-0825180221-97d84ff6
The Pub/Sub subscription has been set up for this example: projects/apache-beam-testing/subscriptions/testpipeline-jenkins-0825180221-97d84ff6
******************Set Up Big Query Table*******************
The BigQuery table has been set up for this example: apache-beam-testing:traffic_routes_1598378527879.traffic_routes_table
*************************Tear Down*************************
The Pub/Sub topic has been deleted: projects/apache-beam-testing/topics/testpipeline-jenkins-0825180221-97d84ff6
The Pub/Sub subscription has been deleted: projects/apache-beam-testing/subscriptions/testpipeline-jenkins-0825180221-97d84ff6
The BigQuery table might contain the example's output, and it is not deleted automatically: apache-beam-testing:traffic_routes_1598378527879.traffic_routes_table
Please go to the Developers Console to delete it manually. Otherwise, you may be charged for its usage.
***********************************************************
***********************************************************

> Task :sdks:java:io:google-cloud-platform:integrationTestKms

> Task :runners:google-cloud-dataflow-java:examplesJavaLegacyWorkerIntegrationTest

***********************************************************
***********************************************************
**********************Set Up Pubsub************************
The Pub/Sub topic has been set up for this example: projects/apache-beam-testing/topics/testpipeline-jenkins-0825180732-d729198f
The Pub/Sub subscription has been set up for this example: projects/apache-beam-testing/subscriptions/testpipeline-jenkins-0825180732-d729198f
******************Set Up Big Query Table*******************
The BigQuery table has been set up for this example: apache-beam-testing:traffic_max_lane_flow_1598378852213.traffic_max_lane_flow_table
*************************Tear Down*************************
The Pub/Sub topic has been deleted: projects/apache-beam-testing/topics/testpipeline-jenkins-0825180732-d729198f
The Pub/Sub subscription has been deleted: projects/apache-beam-testing/subscriptions/testpipeline-jenkins-0825180732-d729198f
The BigQuery table might contain the example's output, and it is not deleted automatically: apache-beam-testing:traffic_max_lane_flow_1598378852213.traffic_max_lane_flow_table
Please go to the Developers Console to delete it manually. Otherwise, you may be charged for its usage.
***********************************************************
***********************************************************

> Task :sdks:java:io:google-cloud-platform:postCommit

> Task :runners:google-cloud-dataflow-java:examplesJavaLegacyWorkerIntegrationTest

org.apache.beam.examples.cookbook.BigQueryTornadoesIT > testE2eBigQueryTornadoesWithStorageApiUsingQuery FAILED
    java.lang.RuntimeException at BigQueryTornadoesIT.java:68

***********************************************************
***********************************************************
*************************Tear Down*************************
The Pub/Sub topic has been deleted: projects/apache-beam-testing/topics/testpipeline-jenkins-0825181450-d263d671
The Pub/Sub subscription has been deleted: projects/apache-beam-testing/subscriptions/testpipeline-jenkins-0825181450-d263d671
The BigQuery table might contain the example's output, and it is not deleted automatically: apache-beam-testing:beam_examples.testpipeline_jenkins_0825181450_d263d671
Please go to the Developers Console to delete it manually. Otherwise, you may be charged for its usage.
***********************************************************
***********************************************************

10 tests completed, 2 failed

> Task :runners:google-cloud-dataflow-java:examplesJavaLegacyWorkerIntegrationTest FAILED
> Task :runners:google-cloud-dataflow-java:googleCloudPlatformLegacyWorkerIntegrationTest
> Task :sdks:java:extensions:zetasketch:postCommit
> Task :runners:google-cloud-dataflow-java:googleCloudPlatformLegacyWorkerKmsIntegrationTest

FAILURE: Build failed with an exception.

* What went wrong:
Execution failed for task ':runners:google-cloud-dataflow-java:examplesJavaLegacyWorkerIntegrationTest'.
> There were failing tests. See the report at: file://<https://ci-beam.apache.org/job/beam_PostCommit_Java/ws/src/runners/google-cloud-dataflow-java/build/reports/tests/examplesJavaLegacyWorkerIntegrationTest/index.html>

* Try:
Run with --stacktrace option to get the stack trace. Run with --info or --debug option to get more log output. Run with --scan to get full insights.

* Get more help at https://help.gradle.org

Deprecated Gradle features were used in this build, making it incompatible with Gradle 6.0.
Use '--warning-mode all' to show the individual deprecation warnings.
See https://docs.gradle.org/5.2.1/userguide/command_line_interface.html#sec:command_line_warnings

BUILD FAILED in 1h 9m 9s
99 actionable tasks: 66 executed, 33 from cache

Publishing build scan...
https://gradle.com/s/db7hx7cdmdidg

Build step 'Invoke Gradle script' changed build result to FAILURE
Build step 'Invoke Gradle script' marked build as failure

---------------------------------------------------------------------
To unsubscribe, e-mail: builds-unsubscribe@beam.apache.org
For additional commands, e-mail: builds-help@beam.apache.org


Build failed in Jenkins: beam_PostCommit_Java #6515

Posted by Apache Jenkins Server <je...@builds.apache.org>.
See <https://ci-beam.apache.org/job/beam_PostCommit_Java/6515/display/redirect>

Changes:


------------------------------------------
[...truncated 5.41 KB...]
> Task :buildSrc:compileTestJava NO-SOURCE
> Task :buildSrc:compileTestGroovy NO-SOURCE
> Task :buildSrc:processTestResources NO-SOURCE
> Task :buildSrc:testClasses UP-TO-DATE
> Task :buildSrc:test NO-SOURCE
> Task :buildSrc:validateTaskProperties FROM-CACHE
> Task :buildSrc:check
> Task :buildSrc:build
Configuration on demand is an incubating feature.

> Configure project :sdks:java:container
Found go 1.12 in /usr/bin/go, use it.

> Task :sdks:java:core:generateAvroProtocol NO-SOURCE
> Task :sdks:java:harness:processResources NO-SOURCE
> Task :sdks:java:extensions:google-cloud-platform-core:processResources NO-SOURCE
> Task :sdks:java:core:generateAvroJava NO-SOURCE
> Task :runners:core-construction-java:processResources NO-SOURCE
> Task :runners:java-fn-execution:processResources NO-SOURCE
> Task :sdks:java:fn-execution:processResources NO-SOURCE
> Task :runners:core-java:processResources NO-SOURCE
> Task :vendor:sdks-java-extensions-protobuf:processResources NO-SOURCE
> Task :sdks:java:io:google-cloud-platform:processResources NO-SOURCE
> Task :model:job-management:extractProto
> Task :model:fn-execution:extractProto
> Task :sdks:java:extensions:protobuf:extractProto
> Task :runners:local-java:processResources NO-SOURCE
> Task :runners:google-cloud-dataflow-java:worker:legacy-worker:processResources NO-SOURCE
> Task :sdks:java:expansion-service:createCheckerFrameworkManifest
> Task :runners:direct-java:processResources NO-SOURCE
> Task :examples:java:processResources NO-SOURCE
> Task :sdks:java:extensions:ml:processResources NO-SOURCE
> Task :model:job-management:processResources
> Task :model:fn-execution:processResources
> Task :sdks:java:extensions:protobuf:processResources NO-SOURCE
> Task :sdks:java:extensions:google-cloud-platform-core:processTestResources NO-SOURCE
> Task :sdks:java:expansion-service:processResources NO-SOURCE
> Task :sdks:java:testing:test-utils:processResources NO-SOURCE
> Task :sdks:java:testing:test-utils:processTestResources NO-SOURCE
> Task :sdks:java:io:common:compileJava NO-SOURCE
> Task :sdks:java:extensions:zetasketch:createCheckerFrameworkManifest
> Task :sdks:java:io:common:processResources NO-SOURCE
> Task :examples:java:processTestResources
> Task :sdks:java:extensions:zetasketch:processResources NO-SOURCE
> Task :sdks:java:io:common:classes UP-TO-DATE
> Task :sdks:java:extensions:zetasketch:processTestResources NO-SOURCE
> Task :runners:google-cloud-dataflow-java:processResources
> Task :sdks:java:core:generateGrammarSource FROM-CACHE
> Task :sdks:java:core:processResources
> Task :sdks:java:io:common:jar
> Task :sdks:java:io:common:processTestResources NO-SOURCE
> Task :sdks:java:core:generateTestAvroProtocol NO-SOURCE
> Task :sdks:java:io:kinesis:processResources NO-SOURCE
> Task :sdks:java:io:kinesis:processTestResources NO-SOURCE
> Task :sdks:java:io:google-cloud-platform:processTestResources
> Task :runners:google-cloud-dataflow-java:copyGoogleCloudPlatformTestResources
> Task :sdks:java:core:generateTestAvroJava
> Task :sdks:java:core:generateTestGrammarSource NO-SOURCE
> Task :sdks:java:core:processTestResources
> Task :model:pipeline:extractIncludeProto
> Task :runners:google-cloud-dataflow-java:worker:windmill:extractIncludeProto
> Task :model:pipeline:extractProto
> Task :runners:google-cloud-dataflow-java:worker:windmill:extractProto
> Task :runners:google-cloud-dataflow-java:worker:windmill:generateProto
> Task :model:pipeline:generateProto
> Task :runners:google-cloud-dataflow-java:worker:windmill:compileJava FROM-CACHE
> Task :runners:google-cloud-dataflow-java:worker:windmill:processResources
> Task :runners:google-cloud-dataflow-java:worker:windmill:classes
> Task :model:pipeline:compileJava FROM-CACHE
> Task :model:pipeline:processResources
> Task :model:pipeline:classes
> Task :model:pipeline:jar
> Task :model:fn-execution:extractIncludeProto
> Task :model:job-management:extractIncludeProto
> Task :model:fn-execution:generateProto
> Task :model:job-management:generateProto
> Task :model:fn-execution:compileJava FROM-CACHE
> Task :model:fn-execution:classes
> Task :model:job-management:compileJava FROM-CACHE
> Task :model:job-management:classes
> Task :runners:google-cloud-dataflow-java:worker:windmill:shadowJar
> Task :model:pipeline:shadowJar
> Task :model:job-management:shadowJar
> Task :model:fn-execution:shadowJar
> Task :sdks:java:core:compileJava FROM-CACHE
> Task :sdks:java:core:classes
> Task :sdks:java:core:shadowJar
> Task :runners:local-java:compileJava FROM-CACHE
> Task :runners:local-java:classes UP-TO-DATE
> Task :sdks:java:fn-execution:compileJava FROM-CACHE
> Task :sdks:java:fn-execution:classes UP-TO-DATE
> Task :sdks:java:extensions:zetasketch:compileJava FROM-CACHE
> Task :sdks:java:extensions:zetasketch:classes UP-TO-DATE
> Task :sdks:java:io:kinesis:compileJava FROM-CACHE
> Task :sdks:java:io:kinesis:classes UP-TO-DATE
> Task :vendor:sdks-java-extensions-protobuf:compileJava FROM-CACHE
> Task :vendor:sdks-java-extensions-protobuf:classes UP-TO-DATE
> Task :sdks:java:extensions:protobuf:extractIncludeProto
> Task :sdks:java:extensions:protobuf:generateProto NO-SOURCE
> Task :sdks:java:extensions:google-cloud-platform-core:compileJava FROM-CACHE
> Task :runners:local-java:jar
> Task :sdks:java:extensions:google-cloud-platform-core:classes UP-TO-DATE
> Task :sdks:java:io:common:compileTestJava FROM-CACHE
> Task :sdks:java:io:common:testClasses UP-TO-DATE
> Task :sdks:java:fn-execution:jar
> Task :sdks:java:io:common:testJar
> Task :sdks:java:extensions:protobuf:compileJava FROM-CACHE
> Task :sdks:java:extensions:protobuf:classes UP-TO-DATE
> Task :sdks:java:extensions:google-cloud-platform-core:jar
> Task :runners:core-construction-java:compileJava FROM-CACHE
> Task :runners:core-construction-java:classes UP-TO-DATE
> Task :sdks:java:extensions:protobuf:jar
> Task :vendor:sdks-java-extensions-protobuf:shadowJar
> Task :runners:core-construction-java:jar
> Task :sdks:java:testing:test-utils:compileJava FROM-CACHE
> Task :sdks:java:testing:test-utils:classes UP-TO-DATE
> Task :sdks:java:io:kinesis:compileTestJava FROM-CACHE
> Task :sdks:java:io:kinesis:testClasses UP-TO-DATE
> Task :sdks:java:testing:test-utils:jar
> Task :sdks:java:testing:test-utils:compileTestJava FROM-CACHE
> Task :sdks:java:testing:test-utils:testClasses UP-TO-DATE
> Task :runners:core-java:compileJava FROM-CACHE
> Task :runners:core-java:classes UP-TO-DATE
> Task :sdks:java:testing:test-utils:testJar
> Task :runners:core-java:jar
> Task :sdks:java:harness:compileJava FROM-CACHE
> Task :sdks:java:harness:classes UP-TO-DATE
> Task :sdks:java:harness:jar
> Task :sdks:java:core:compileTestJava FROM-CACHE
> Task :sdks:java:core:testClasses
> Task :sdks:java:core:shadowTestJar
> Task :sdks:java:extensions:google-cloud-platform-core:compileTestJava FROM-CACHE
> Task :sdks:java:extensions:google-cloud-platform-core:testClasses UP-TO-DATE
> Task :sdks:java:extensions:google-cloud-platform-core:testJar
> Task :sdks:java:extensions:google-cloud-platform-core:integrationTestKms
> Task :sdks:java:extensions:google-cloud-platform-core:postCommit
> Task :sdks:java:harness:shadowJar
> Task :runners:java-fn-execution:compileJava FROM-CACHE
> Task :runners:java-fn-execution:classes UP-TO-DATE
> Task :runners:java-fn-execution:jar
> Task :sdks:java:expansion-service:compileJava FROM-CACHE
> Task :sdks:java:expansion-service:classes UP-TO-DATE
> Task :sdks:java:expansion-service:jar
> Task :runners:direct-java:compileJava FROM-CACHE
> Task :runners:direct-java:classes UP-TO-DATE
> Task :sdks:java:extensions:ml:compileJava FROM-CACHE
> Task :sdks:java:extensions:ml:classes UP-TO-DATE
> Task :sdks:java:extensions:ml:jar
> Task :sdks:java:io:google-cloud-platform:compileJava FROM-CACHE
> Task :sdks:java:io:google-cloud-platform:classes UP-TO-DATE
> Task :sdks:java:io:google-cloud-platform:jar
> Task :sdks:java:extensions:zetasketch:compileTestJava FROM-CACHE
> Task :sdks:java:extensions:zetasketch:testClasses UP-TO-DATE
> Task :examples:java:compileJava FROM-CACHE
> Task :examples:java:classes UP-TO-DATE
> Task :runners:google-cloud-dataflow-java:compileJava FROM-CACHE
> Task :runners:google-cloud-dataflow-java:classes
> Task :examples:java:jar
> Task :runners:google-cloud-dataflow-java:jar
> Task :examples:java:compileTestJava FROM-CACHE
> Task :examples:java:testClasses
> Task :examples:java:testJar
> Task :runners:direct-java:shadowJar
> Task :runners:google-cloud-dataflow-java:worker:legacy-worker:compileJava FROM-CACHE
> Task :runners:google-cloud-dataflow-java:worker:legacy-worker:classes UP-TO-DATE
> Task :sdks:java:io:google-cloud-platform:compileTestJava FROM-CACHE
> Task :sdks:java:io:google-cloud-platform:testClasses
> Task :sdks:java:io:google-cloud-platform:testJar
> Task :runners:google-cloud-dataflow-java:worker:legacy-worker:shadowJar
> Task :runners:google-cloud-dataflow-java:coreSDKJavaLegacyWorkerIntegrationTest NO-SOURCE
> Task :sdks:java:io:kinesis:integrationTest
> Task :sdks:java:io:google-cloud-platform:integrationTest
> Task :sdks:java:extensions:zetasketch:integrationTest
> Task :runners:google-cloud-dataflow-java:examplesJavaLegacyWorkerIntegrationTest

***********************************************************
***********************************************************
**********************Set Up Pubsub************************
The Pub/Sub topic has been set up for this example: projects/apache-beam-testing/topics/testpipeline-jenkins-0825120215-fe567ccb
The Pub/Sub subscription has been set up for this example: projects/apache-beam-testing/subscriptions/testpipeline-jenkins-0825120215-fe567ccb
******************Set Up Big Query Table*******************
The BigQuery table has been set up for this example: apache-beam-testing:traffic_routes_1598356921227.traffic_routes_table
*************************Tear Down*************************
The Pub/Sub topic has been deleted: projects/apache-beam-testing/topics/testpipeline-jenkins-0825120215-fe567ccb
The Pub/Sub subscription has been deleted: projects/apache-beam-testing/subscriptions/testpipeline-jenkins-0825120215-fe567ccb
The BigQuery table might contain the example's output, and it is not deleted automatically: apache-beam-testing:traffic_routes_1598356921227.traffic_routes_table
Please go to the Developers Console to delete it manually. Otherwise, you may be charged for its usage.
***********************************************************
***********************************************************

org.apache.beam.examples.snippets.transforms.io.gcp.bigquery.BigQuerySamplesIT > testTableIO FAILED
    java.lang.RuntimeException at BigQuerySamplesIT.java:124

> Task :sdks:java:io:google-cloud-platform:integrationTestKms

> Task :runners:google-cloud-dataflow-java:examplesJavaLegacyWorkerIntegrationTest

***********************************************************
***********************************************************
**********************Set Up Pubsub************************
The Pub/Sub topic has been set up for this example: projects/apache-beam-testing/topics/testpipeline-jenkins-0825120759-c7fc951e
The Pub/Sub subscription has been set up for this example: projects/apache-beam-testing/subscriptions/testpipeline-jenkins-0825120759-c7fc951e
******************Set Up Big Query Table*******************
The BigQuery table has been set up for this example: apache-beam-testing:traffic_max_lane_flow_1598357278785.traffic_max_lane_flow_table
*************************Tear Down*************************
The Pub/Sub topic has been deleted: projects/apache-beam-testing/topics/testpipeline-jenkins-0825120759-c7fc951e
The Pub/Sub subscription has been deleted: projects/apache-beam-testing/subscriptions/testpipeline-jenkins-0825120759-c7fc951e
The BigQuery table might contain the example's output, and it is not deleted automatically: apache-beam-testing:traffic_max_lane_flow_1598357278785.traffic_max_lane_flow_table
Please go to the Developers Console to delete it manually. Otherwise, you may be charged for its usage.
***********************************************************
***********************************************************

> Task :sdks:java:io:google-cloud-platform:postCommit
> Task :sdks:java:extensions:zetasketch:postCommit

> Task :runners:google-cloud-dataflow-java:examplesJavaLegacyWorkerIntegrationTest

org.apache.beam.examples.complete.AutoCompleteIT > testE2EAutoComplete FAILED
    java.lang.RuntimeException at AutoCompleteIT.java:57

10 tests completed, 2 failed

> Task :runners:google-cloud-dataflow-java:examplesJavaLegacyWorkerIntegrationTest FAILED
> Task :runners:google-cloud-dataflow-java:googleCloudPlatformLegacyWorkerIntegrationTest
> Task :runners:google-cloud-dataflow-java:googleCloudPlatformLegacyWorkerKmsIntegrationTest

FAILURE: Build failed with an exception.

* What went wrong:
Execution failed for task ':runners:google-cloud-dataflow-java:examplesJavaLegacyWorkerIntegrationTest'.
> There were failing tests. See the report at: file://<https://ci-beam.apache.org/job/beam_PostCommit_Java/ws/src/runners/google-cloud-dataflow-java/build/reports/tests/examplesJavaLegacyWorkerIntegrationTest/index.html>

* Try:
Run with --stacktrace option to get the stack trace. Run with --info or --debug option to get more log output. Run with --scan to get full insights.

* Get more help at https://help.gradle.org

Deprecated Gradle features were used in this build, making it incompatible with Gradle 6.0.
Use '--warning-mode all' to show the individual deprecation warnings.
See https://docs.gradle.org/5.2.1/userguide/command_line_interface.html#sec:command_line_warnings

BUILD FAILED in 1h 15m 38s
99 actionable tasks: 66 executed, 33 from cache

Publishing build scan...
https://gradle.com/s/wi4ypm4o3j7la

Build step 'Invoke Gradle script' changed build result to FAILURE
Build step 'Invoke Gradle script' marked build as failure

---------------------------------------------------------------------
To unsubscribe, e-mail: builds-unsubscribe@beam.apache.org
For additional commands, e-mail: builds-help@beam.apache.org


Build failed in Jenkins: beam_PostCommit_Java #6514

Posted by Apache Jenkins Server <je...@builds.apache.org>.
See <https://ci-beam.apache.org/job/beam_PostCommit_Java/6514/display/redirect?page=changes>

Changes:

[noreply] [BEAM-10777] Add two blog posts detailing changes to the type hints


------------------------------------------
[...truncated 16.78 KB...]
> Task :sdks:java:io:common:jar
> Task :sdks:java:core:generateTestAvroProtocol NO-SOURCE
> Task :sdks:java:io:common:processTestResources NO-SOURCE
> Task :runners:google-cloud-dataflow-java:copyGoogleCloudPlatformTestResources
> Task :sdks:java:io:google-cloud-platform:processTestResources
> Task :sdks:java:core:generateTestAvroJava
> Task :sdks:java:core:generateTestGrammarSource NO-SOURCE
> Task :sdks:java:core:processTestResources
> Task :model:pipeline:extractIncludeProto
> Task :runners:google-cloud-dataflow-java:worker:windmill:extractIncludeProto
> Task :model:pipeline:extractProto
> Task :runners:google-cloud-dataflow-java:worker:windmill:extractProto
> Task :runners:google-cloud-dataflow-java:worker:windmill:generateProto
> Task :model:pipeline:generateProto
> Task :runners:google-cloud-dataflow-java:worker:windmill:compileJava FROM-CACHE
> Task :runners:google-cloud-dataflow-java:worker:windmill:processResources
> Task :runners:google-cloud-dataflow-java:worker:windmill:classes
> Task :model:pipeline:compileJava FROM-CACHE
> Task :model:pipeline:processResources
> Task :model:pipeline:classes
> Task :model:pipeline:jar
> Task :model:fn-execution:extractIncludeProto
> Task :model:job-management:extractIncludeProto
> Task :model:job-management:generateProto
> Task :model:fn-execution:generateProto
> Task :runners:google-cloud-dataflow-java:worker:windmill:shadowJar
> Task :model:job-management:compileJava FROM-CACHE
> Task :model:job-management:classes
> Task :model:fn-execution:compileJava FROM-CACHE
> Task :model:fn-execution:classes
> Task :model:pipeline:shadowJar
> Task :model:job-management:shadowJar
> Task :model:fn-execution:shadowJar
> Task :sdks:java:core:compileJava FROM-CACHE
> Task :sdks:java:core:classes
> Task :sdks:java:core:shadowJar
> Task :vendor:sdks-java-extensions-protobuf:compileJava FROM-CACHE
> Task :vendor:sdks-java-extensions-protobuf:classes UP-TO-DATE
> Task :sdks:java:extensions:zetasketch:compileJava FROM-CACHE
> Task :sdks:java:extensions:zetasketch:classes UP-TO-DATE
> Task :vendor:sdks-java-extensions-protobuf:shadowJar
> Task :sdks:java:io:common:compileTestJava FROM-CACHE
> Task :sdks:java:io:common:testClasses UP-TO-DATE
> Task :runners:local-java:compileJava FROM-CACHE
> Task :runners:local-java:classes UP-TO-DATE
> Task :sdks:java:extensions:google-cloud-platform-core:compileJava FROM-CACHE
> Task :sdks:java:extensions:google-cloud-platform-core:classes UP-TO-DATE
> Task :runners:local-java:jar
> Task :sdks:java:fn-execution:compileJava FROM-CACHE
> Task :sdks:java:fn-execution:classes UP-TO-DATE
> Task :sdks:java:io:common:testJar
> Task :sdks:java:extensions:google-cloud-platform-core:jar
> Task :runners:core-construction-java:compileJava FROM-CACHE
> Task :runners:core-construction-java:classes UP-TO-DATE
> Task :sdks:java:fn-execution:jar
> Task :sdks:java:io:kinesis:compileJava FROM-CACHE
> Task :sdks:java:io:kinesis:classes UP-TO-DATE
> Task :sdks:java:testing:test-utils:compileJava FROM-CACHE
> Task :sdks:java:testing:test-utils:classes UP-TO-DATE
> Task :sdks:java:testing:test-utils:jar
> Task :runners:core-construction-java:jar
> Task :sdks:java:extensions:protobuf:extractIncludeProto
> Task :sdks:java:extensions:protobuf:generateProto NO-SOURCE
> Task :sdks:java:extensions:protobuf:compileJava FROM-CACHE
> Task :sdks:java:extensions:protobuf:classes UP-TO-DATE
> Task :sdks:java:testing:test-utils:compileTestJava FROM-CACHE
> Task :sdks:java:testing:test-utils:testClasses UP-TO-DATE
> Task :sdks:java:testing:test-utils:testJar
> Task :sdks:java:extensions:protobuf:jar
> Task :runners:core-java:compileJava FROM-CACHE
> Task :runners:core-java:classes UP-TO-DATE
> Task :sdks:java:io:kinesis:compileTestJava FROM-CACHE
> Task :sdks:java:io:kinesis:testClasses UP-TO-DATE
> Task :runners:core-java:jar
> Task :sdks:java:harness:compileJava FROM-CACHE
> Task :sdks:java:harness:classes UP-TO-DATE
> Task :sdks:java:harness:jar
> Task :sdks:java:core:compileTestJava FROM-CACHE
> Task :sdks:java:core:testClasses
> Task :sdks:java:core:shadowTestJar
> Task :sdks:java:extensions:google-cloud-platform-core:compileTestJava FROM-CACHE
> Task :sdks:java:extensions:google-cloud-platform-core:testClasses UP-TO-DATE
> Task :sdks:java:extensions:google-cloud-platform-core:testJar
> Task :sdks:java:extensions:google-cloud-platform-core:integrationTestKms
> Task :sdks:java:extensions:google-cloud-platform-core:postCommit
> Task :sdks:java:harness:shadowJar
> Task :runners:java-fn-execution:compileJava FROM-CACHE
> Task :runners:java-fn-execution:classes UP-TO-DATE
> Task :runners:java-fn-execution:jar
> Task :sdks:java:expansion-service:compileJava FROM-CACHE
> Task :sdks:java:expansion-service:classes UP-TO-DATE
> Task :sdks:java:expansion-service:jar
> Task :runners:direct-java:compileJava FROM-CACHE
> Task :runners:direct-java:classes UP-TO-DATE
> Task :sdks:java:extensions:ml:compileJava FROM-CACHE
> Task :sdks:java:extensions:ml:classes UP-TO-DATE
> Task :sdks:java:extensions:ml:jar
> Task :sdks:java:io:google-cloud-platform:compileJava FROM-CACHE
> Task :sdks:java:io:google-cloud-platform:classes UP-TO-DATE
> Task :sdks:java:io:google-cloud-platform:jar
> Task :sdks:java:extensions:zetasketch:compileTestJava FROM-CACHE
> Task :sdks:java:extensions:zetasketch:testClasses UP-TO-DATE
> Task :runners:google-cloud-dataflow-java:compileJava FROM-CACHE
> Task :runners:google-cloud-dataflow-java:classes
> Task :examples:java:compileJava FROM-CACHE
> Task :examples:java:classes UP-TO-DATE
> Task :examples:java:jar
> Task :runners:google-cloud-dataflow-java:jar
> Task :examples:java:compileTestJava FROM-CACHE
> Task :examples:java:testClasses
> Task :examples:java:testJar
> Task :runners:google-cloud-dataflow-java:worker:legacy-worker:compileJava FROM-CACHE
> Task :runners:google-cloud-dataflow-java:worker:legacy-worker:classes UP-TO-DATE
> Task :runners:direct-java:shadowJar
> Task :sdks:java:io:google-cloud-platform:compileTestJava FROM-CACHE
> Task :sdks:java:io:google-cloud-platform:testClasses
> Task :sdks:java:io:google-cloud-platform:testJar
> Task :runners:google-cloud-dataflow-java:worker:legacy-worker:shadowJar
> Task :runners:google-cloud-dataflow-java:coreSDKJavaLegacyWorkerIntegrationTest NO-SOURCE
> Task :sdks:java:io:kinesis:integrationTest
> Task :sdks:java:io:google-cloud-platform:integrationTest
> Task :sdks:java:extensions:zetasketch:integrationTest
> Task :runners:google-cloud-dataflow-java:examplesJavaLegacyWorkerIntegrationTest

***********************************************************
***********************************************************
**********************Set Up Pubsub************************
The Pub/Sub topic has been set up for this example: projects/apache-beam-testing/topics/testpipeline-jenkins-0825060211-44ca0a49
The Pub/Sub subscription has been set up for this example: projects/apache-beam-testing/subscriptions/testpipeline-jenkins-0825060211-44ca0a49
******************Set Up Big Query Table*******************
The BigQuery table has been set up for this example: apache-beam-testing:traffic_routes_1598335319652.traffic_routes_table
*************************Tear Down*************************
The Pub/Sub topic has been deleted: projects/apache-beam-testing/topics/testpipeline-jenkins-0825060211-44ca0a49
The Pub/Sub subscription has been deleted: projects/apache-beam-testing/subscriptions/testpipeline-jenkins-0825060211-44ca0a49
The BigQuery table might contain the example's output, and it is not deleted automatically: apache-beam-testing:traffic_routes_1598335319652.traffic_routes_table
Please go to the Developers Console to delete it manually. Otherwise, you may be charged for its usage.
***********************************************************
***********************************************************

org.apache.beam.examples.snippets.transforms.io.gcp.bigquery.BigQuerySamplesIT > testTableIO FAILED
    java.lang.RuntimeException at BigQuerySamplesIT.java:120

org.apache.beam.examples.cookbook.BigQueryTornadoesIT > testE2EBigQueryTornadoesWithExport FAILED
    java.lang.RuntimeException at BigQueryTornadoesIT.java:68

> Task :sdks:java:io:google-cloud-platform:integrationTestKms

> Task :sdks:java:extensions:zetasketch:integrationTest

org.apache.beam.sdk.extensions.zetasketch.BigQueryHllSketchCompatibilityIT > testReadNonEmptySketchFromBigQuery FAILED
    java.lang.RuntimeException at BigQueryHllSketchCompatibilityIT.java:201

> Task :runners:google-cloud-dataflow-java:examplesJavaLegacyWorkerIntegrationTest

***********************************************************
***********************************************************
**********************Set Up Pubsub************************
The Pub/Sub topic has been set up for this example: projects/apache-beam-testing/topics/testpipeline-jenkins-0825060800-2956fe92
The Pub/Sub subscription has been set up for this example: projects/apache-beam-testing/subscriptions/testpipeline-jenkins-0825060800-2956fe92
******************Set Up Big Query Table*******************
The BigQuery table has been set up for this example: apache-beam-testing:traffic_max_lane_flow_1598335679624.traffic_max_lane_flow_table
*************************Tear Down*************************
The Pub/Sub topic has been deleted: projects/apache-beam-testing/topics/testpipeline-jenkins-0825060800-2956fe92
The Pub/Sub subscription has been deleted: projects/apache-beam-testing/subscriptions/testpipeline-jenkins-0825060800-2956fe92
The BigQuery table might contain the example's output, and it is not deleted automatically: apache-beam-testing:traffic_max_lane_flow_1598335679624.traffic_max_lane_flow_table
Please go to the Developers Console to delete it manually. Otherwise, you may be charged for its usage.
***********************************************************
***********************************************************

> Task :sdks:java:extensions:zetasketch:integrationTest FAILED

org.apache.beam.sdk.extensions.zetasketch.BigQueryHllSketchCompatibilityIT > testWriteEmptySketchToBigQuery FAILED
    java.lang.RuntimeException at BigQueryHllSketchCompatibilityIT.java:257

4 tests completed, 2 failed

> Task :sdks:java:io:google-cloud-platform:postCommit

> Task :runners:google-cloud-dataflow-java:examplesJavaLegacyWorkerIntegrationTest

***********************************************************
***********************************************************
*************************Tear Down*************************
The Pub/Sub topic has been deleted: projects/apache-beam-testing/topics/testpipeline-jenkins-0825061604-7593fb0d
The Pub/Sub subscription has been deleted: projects/apache-beam-testing/subscriptions/testpipeline-jenkins-0825061604-7593fb0d
The BigQuery table might contain the example's output, and it is not deleted automatically: apache-beam-testing:beam_examples.testpipeline_jenkins_0825061604_7593fb0d
Please go to the Developers Console to delete it manually. Otherwise, you may be charged for its usage.
***********************************************************
***********************************************************

10 tests completed, 2 failed

> Task :runners:google-cloud-dataflow-java:examplesJavaLegacyWorkerIntegrationTest FAILED
> Task :runners:google-cloud-dataflow-java:googleCloudPlatformLegacyWorkerIntegrationTest

org.apache.beam.sdk.io.gcp.datastore.V1ReadIT > testE2EV1ReadWithGQLQueryWithLimit FAILED
    java.lang.RuntimeException at V1ReadIT.java:135

39 tests completed, 1 failed

> Task :runners:google-cloud-dataflow-java:googleCloudPlatformLegacyWorkerIntegrationTest FAILED
> Task :runners:google-cloud-dataflow-java:googleCloudPlatformLegacyWorkerKmsIntegrationTest

FAILURE: Build completed with 3 failures.

1: Task failed with an exception.
-----------
* What went wrong:
Execution failed for task ':sdks:java:extensions:zetasketch:integrationTest'.
> There were failing tests. See the report at: file://<https://ci-beam.apache.org/job/beam_PostCommit_Java/ws/src/sdks/java/extensions/zetasketch/build/reports/tests/integrationTest/index.html>

* Try:
Run with --stacktrace option to get the stack trace. Run with --info or --debug option to get more log output. Run with --scan to get full insights.
==============================================================================

2: Task failed with an exception.
-----------
* What went wrong:
Execution failed for task ':runners:google-cloud-dataflow-java:examplesJavaLegacyWorkerIntegrationTest'.
> There were failing tests. See the report at: file://<https://ci-beam.apache.org/job/beam_PostCommit_Java/ws/src/runners/google-cloud-dataflow-java/build/reports/tests/examplesJavaLegacyWorkerIntegrationTest/index.html>

* Try:
Run with --stacktrace option to get the stack trace. Run with --info or --debug option to get more log output. Run with --scan to get full insights.
==============================================================================

3: Task failed with an exception.
-----------
* What went wrong:
Execution failed for task ':runners:google-cloud-dataflow-java:googleCloudPlatformLegacyWorkerIntegrationTest'.
> There were failing tests. See the report at: file://<https://ci-beam.apache.org/job/beam_PostCommit_Java/ws/src/runners/google-cloud-dataflow-java/build/reports/tests/googleCloudPlatformLegacyWorkerIntegrationTest/index.html>

* Try:
Run with --stacktrace option to get the stack trace. Run with --info or --debug option to get more log output. Run with --scan to get full insights.
==============================================================================

* Get more help at https://help.gradle.org

Deprecated Gradle features were used in this build, making it incompatible with Gradle 6.0.
Use '--warning-mode all' to show the individual deprecation warnings.
See https://docs.gradle.org/5.2.1/userguide/command_line_interface.html#sec:command_line_warnings

BUILD FAILED in 1h 12m 17s
99 actionable tasks: 66 executed, 33 from cache

Publishing build scan...
https://gradle.com/s/yhuhfkgot4l5e

Build step 'Invoke Gradle script' changed build result to FAILURE
Build step 'Invoke Gradle script' marked build as failure

---------------------------------------------------------------------
To unsubscribe, e-mail: builds-unsubscribe@beam.apache.org
For additional commands, e-mail: builds-help@beam.apache.org


Build failed in Jenkins: beam_PostCommit_Java #6513

Posted by Apache Jenkins Server <je...@builds.apache.org>.
See <https://ci-beam.apache.org/job/beam_PostCommit_Java/6513/display/redirect?page=changes>

Changes:

[Robin Qiu] Propagate BigQuery streaming insert throttled time to Dataflow worker in

[Kamil Wasilewski] [BEAM-10524] JSON decoder for ReadFromBigQuery supports repeatable

[noreply] Merge pull request #12415 from [BEAM-10603] Add the RecordingManager and


------------------------------------------
[...truncated 7.64 KB...]
> Task :vendor:sdks-java-extensions-protobuf:processResources NO-SOURCE
> Task :sdks:java:fn-execution:processResources NO-SOURCE
> Task :sdks:java:extensions:google-cloud-platform-core:processResources NO-SOURCE
> Task :sdks:java:harness:processResources NO-SOURCE
> Task :runners:core-java:processResources NO-SOURCE
> Task :sdks:java:core:generateAvroJava NO-SOURCE
> Task :runners:java-fn-execution:processResources NO-SOURCE
> Task :runners:core-construction-java:processResources NO-SOURCE
> Task :sdks:java:io:google-cloud-platform:processResources NO-SOURCE
> Task :sdks:java:extensions:protobuf:extractProto
> Task :model:job-management:extractProto
> Task :sdks:java:expansion-service:createCheckerFrameworkManifest
> Task :sdks:java:extensions:protobuf:processResources NO-SOURCE
> Task :sdks:java:expansion-service:processResources NO-SOURCE
> Task :runners:local-java:processResources NO-SOURCE
> Task :examples:java:processResources NO-SOURCE
> Task :runners:direct-java:processResources NO-SOURCE
> Task :sdks:java:io:common:compileJava NO-SOURCE
> Task :sdks:java:extensions:google-cloud-platform-core:processTestResources NO-SOURCE
> Task :model:fn-execution:extractProto
> Task :sdks:java:extensions:ml:processResources NO-SOURCE
> Task :sdks:java:testing:test-utils:processResources NO-SOURCE
> Task :sdks:java:io:common:processResources NO-SOURCE
> Task :sdks:java:io:common:classes UP-TO-DATE
> Task :runners:google-cloud-dataflow-java:worker:legacy-worker:processResources NO-SOURCE
> Task :sdks:java:testing:test-utils:processTestResources NO-SOURCE
> Task :sdks:java:extensions:zetasketch:createCheckerFrameworkManifest
> Task :sdks:java:io:common:jar
> Task :sdks:java:io:kinesis:processResources NO-SOURCE
> Task :sdks:java:io:common:processTestResources NO-SOURCE
> Task :sdks:java:extensions:zetasketch:processResources NO-SOURCE
> Task :sdks:java:extensions:zetasketch:processTestResources NO-SOURCE
> Task :examples:java:processTestResources
> Task :model:job-management:processResources
> Task :model:fn-execution:processResources
> Task :runners:google-cloud-dataflow-java:processResources
> Task :runners:google-cloud-dataflow-java:copyGoogleCloudPlatformTestResources
> Task :sdks:java:io:google-cloud-platform:processTestResources
> Task :sdks:java:io:kinesis:processTestResources NO-SOURCE
> Task :sdks:java:core:generateGrammarSource FROM-CACHE
> Task :sdks:java:core:processResources
> Task :sdks:java:core:generateTestAvroProtocol NO-SOURCE
> Task :sdks:java:core:generateTestAvroJava
> Task :sdks:java:core:generateTestGrammarSource NO-SOURCE
> Task :sdks:java:core:processTestResources
> Task :runners:google-cloud-dataflow-java:worker:windmill:extractIncludeProto
> Task :runners:google-cloud-dataflow-java:worker:windmill:extractProto
> Task :model:pipeline:extractIncludeProto
> Task :model:pipeline:extractProto
> Task :runners:google-cloud-dataflow-java:worker:windmill:generateProto
> Task :model:pipeline:generateProto
> Task :runners:google-cloud-dataflow-java:worker:windmill:compileJava FROM-CACHE
> Task :runners:google-cloud-dataflow-java:worker:windmill:processResources
> Task :runners:google-cloud-dataflow-java:worker:windmill:classes
> Task :model:pipeline:compileJava FROM-CACHE
> Task :model:pipeline:processResources
> Task :model:pipeline:classes
> Task :model:pipeline:jar
> Task :model:job-management:extractIncludeProto
> Task :model:fn-execution:extractIncludeProto
> Task :model:job-management:generateProto
> Task :model:fn-execution:generateProto
> Task :model:fn-execution:compileJava FROM-CACHE
> Task :model:fn-execution:classes
> Task :model:job-management:compileJava FROM-CACHE
> Task :model:job-management:classes
> Task :runners:google-cloud-dataflow-java:worker:windmill:shadowJar
> Task :model:pipeline:shadowJar
> Task :model:job-management:shadowJar
> Task :model:fn-execution:shadowJar
> Task :sdks:java:core:compileJava FROM-CACHE
> Task :sdks:java:core:classes
> Task :sdks:java:core:shadowJar
> Task :sdks:java:io:kinesis:compileJava FROM-CACHE
> Task :sdks:java:io:kinesis:classes UP-TO-DATE
> Task :sdks:java:io:common:compileTestJava FROM-CACHE
> Task :sdks:java:io:common:testClasses UP-TO-DATE
> Task :sdks:java:io:common:testJar
> Task :runners:local-java:compileJava FROM-CACHE
> Task :runners:local-java:classes UP-TO-DATE
> Task :sdks:java:fn-execution:compileJava FROM-CACHE
> Task :sdks:java:fn-execution:classes UP-TO-DATE
> Task :runners:local-java:jar
> Task :sdks:java:extensions:zetasketch:compileJava FROM-CACHE
> Task :sdks:java:extensions:zetasketch:classes UP-TO-DATE
> Task :sdks:java:extensions:protobuf:extractIncludeProto
> Task :sdks:java:extensions:protobuf:generateProto NO-SOURCE
> Task :sdks:java:fn-execution:jar
> Task :sdks:java:extensions:protobuf:compileJava FROM-CACHE
> Task :sdks:java:extensions:protobuf:classes UP-TO-DATE
> Task :vendor:sdks-java-extensions-protobuf:compileJava FROM-CACHE
> Task :vendor:sdks-java-extensions-protobuf:classes UP-TO-DATE
> Task :sdks:java:extensions:google-cloud-platform-core:compileJava FROM-CACHE
> Task :sdks:java:extensions:google-cloud-platform-core:classes UP-TO-DATE
> Task :sdks:java:extensions:google-cloud-platform-core:jar
> Task :sdks:java:extensions:protobuf:jar
> Task :runners:core-construction-java:compileJava FROM-CACHE
> Task :runners:core-construction-java:classes UP-TO-DATE
> Task :sdks:java:testing:test-utils:compileJava FROM-CACHE
> Task :sdks:java:testing:test-utils:classes UP-TO-DATE
> Task :sdks:java:io:kinesis:compileTestJava FROM-CACHE
> Task :sdks:java:io:kinesis:testClasses UP-TO-DATE
> Task :sdks:java:testing:test-utils:jar
> Task :vendor:sdks-java-extensions-protobuf:shadowJar
> Task :runners:core-construction-java:jar
> Task :sdks:java:testing:test-utils:compileTestJava FROM-CACHE
> Task :sdks:java:testing:test-utils:testClasses UP-TO-DATE
> Task :sdks:java:testing:test-utils:testJar
> Task :runners:core-java:compileJava FROM-CACHE
> Task :runners:core-java:classes UP-TO-DATE
> Task :runners:core-java:jar
> Task :sdks:java:harness:compileJava FROM-CACHE
> Task :sdks:java:harness:classes UP-TO-DATE
> Task :sdks:java:core:compileTestJava FROM-CACHE
> Task :sdks:java:core:testClasses
> Task :sdks:java:harness:jar
> Task :sdks:java:core:shadowTestJar
> Task :sdks:java:extensions:google-cloud-platform-core:compileTestJava FROM-CACHE
> Task :sdks:java:extensions:google-cloud-platform-core:testClasses UP-TO-DATE
> Task :sdks:java:extensions:google-cloud-platform-core:testJar
> Task :sdks:java:extensions:google-cloud-platform-core:integrationTestKms
> Task :sdks:java:extensions:google-cloud-platform-core:postCommit
> Task :sdks:java:harness:shadowJar
> Task :runners:java-fn-execution:compileJava FROM-CACHE
> Task :runners:java-fn-execution:classes UP-TO-DATE
> Task :runners:java-fn-execution:jar
> Task :sdks:java:expansion-service:compileJava FROM-CACHE
> Task :sdks:java:expansion-service:classes UP-TO-DATE
> Task :sdks:java:expansion-service:jar
> Task :runners:direct-java:compileJava FROM-CACHE
> Task :runners:direct-java:classes UP-TO-DATE
> Task :sdks:java:extensions:ml:compileJava FROM-CACHE
> Task :sdks:java:extensions:ml:classes UP-TO-DATE
> Task :sdks:java:extensions:ml:jar
> Task :sdks:java:io:google-cloud-platform:compileJava FROM-CACHE
> Task :sdks:java:io:google-cloud-platform:classes UP-TO-DATE
> Task :sdks:java:io:google-cloud-platform:jar
> Task :sdks:java:extensions:zetasketch:compileTestJava FROM-CACHE
> Task :sdks:java:extensions:zetasketch:testClasses UP-TO-DATE
> Task :runners:google-cloud-dataflow-java:compileJava FROM-CACHE
> Task :runners:google-cloud-dataflow-java:classes
> Task :runners:google-cloud-dataflow-java:jar
> Task :examples:java:compileJava FROM-CACHE
> Task :examples:java:classes UP-TO-DATE
> Task :runners:direct-java:shadowJar
> Task :examples:java:jar
> Task :examples:java:compileTestJava FROM-CACHE
> Task :examples:java:testClasses
> Task :examples:java:testJar
> Task :sdks:java:io:google-cloud-platform:compileTestJava FROM-CACHE
> Task :sdks:java:io:google-cloud-platform:testClasses
> Task :runners:google-cloud-dataflow-java:worker:legacy-worker:compileJava FROM-CACHE
> Task :runners:google-cloud-dataflow-java:worker:legacy-worker:classes UP-TO-DATE
> Task :sdks:java:io:google-cloud-platform:testJar
> Task :runners:google-cloud-dataflow-java:worker:legacy-worker:shadowJar
> Task :runners:google-cloud-dataflow-java:coreSDKJavaLegacyWorkerIntegrationTest NO-SOURCE
> Task :sdks:java:io:kinesis:integrationTest
> Task :sdks:java:io:google-cloud-platform:integrationTest
> Task :sdks:java:extensions:zetasketch:integrationTest
> Task :runners:google-cloud-dataflow-java:examplesJavaLegacyWorkerIntegrationTest

***********************************************************
***********************************************************
**********************Set Up Pubsub************************
The Pub/Sub topic has been set up for this example: projects/apache-beam-testing/topics/testpipeline-jenkins-0825000311-2b212295
The Pub/Sub subscription has been set up for this example: projects/apache-beam-testing/subscriptions/testpipeline-jenkins-0825000311-2b212295
******************Set Up Big Query Table*******************
The BigQuery table has been set up for this example: apache-beam-testing:traffic_routes_1598313765580.traffic_routes_table
*************************Tear Down*************************
The Pub/Sub topic has been deleted: projects/apache-beam-testing/topics/testpipeline-jenkins-0825000311-2b212295
The Pub/Sub subscription has been deleted: projects/apache-beam-testing/subscriptions/testpipeline-jenkins-0825000311-2b212295
The BigQuery table might contain the example's output, and it is not deleted automatically: apache-beam-testing:traffic_routes_1598313765580.traffic_routes_table
Please go to the Developers Console to delete it manually. Otherwise, you may be charged for its usage.
***********************************************************
***********************************************************

***********************************************************
***********************************************************
**********************Set Up Pubsub************************
The Pub/Sub topic has been set up for this example: projects/apache-beam-testing/topics/testpipeline-jenkins-0825000845-9f4b4e6d
The Pub/Sub subscription has been set up for this example: projects/apache-beam-testing/subscriptions/testpipeline-jenkins-0825000845-9f4b4e6d
******************Set Up Big Query Table*******************
The BigQuery table has been set up for this example: apache-beam-testing:traffic_max_lane_flow_1598314124894.traffic_max_lane_flow_table
*************************Tear Down*************************
The Pub/Sub topic has been deleted: projects/apache-beam-testing/topics/testpipeline-jenkins-0825000845-9f4b4e6d
The Pub/Sub subscription has been deleted: projects/apache-beam-testing/subscriptions/testpipeline-jenkins-0825000845-9f4b4e6d
The BigQuery table might contain the example's output, and it is not deleted automatically: apache-beam-testing:traffic_max_lane_flow_1598314124894.traffic_max_lane_flow_table
Please go to the Developers Console to delete it manually. Otherwise, you may be charged for its usage.
***********************************************************
***********************************************************

> Task :sdks:java:io:google-cloud-platform:integrationTestKms
> Task :sdks:java:io:google-cloud-platform:postCommit
> Task :sdks:java:extensions:zetasketch:postCommit

> Task :runners:google-cloud-dataflow-java:examplesJavaLegacyWorkerIntegrationTest

org.apache.beam.examples.complete.AutoCompleteIT > testE2EAutoComplete FAILED
    java.lang.RuntimeException at AutoCompleteIT.java:57

10 tests completed, 1 failed

> Task :runners:google-cloud-dataflow-java:examplesJavaLegacyWorkerIntegrationTest FAILED
> Task :runners:google-cloud-dataflow-java:googleCloudPlatformLegacyWorkerIntegrationTest

org.apache.beam.sdk.io.gcp.bigquery.BigQuerySchemaUpdateOptionsIT > testAllowFieldAddition FAILED
    java.lang.RuntimeException at BigQuerySchemaUpdateOptionsIT.java:154

39 tests completed, 1 failed

> Task :runners:google-cloud-dataflow-java:googleCloudPlatformLegacyWorkerIntegrationTest FAILED
> Task :runners:google-cloud-dataflow-java:googleCloudPlatformLegacyWorkerKmsIntegrationTest

FAILURE: Build completed with 2 failures.

1: Task failed with an exception.
-----------
* What went wrong:
Execution failed for task ':runners:google-cloud-dataflow-java:examplesJavaLegacyWorkerIntegrationTest'.
> There were failing tests. See the report at: file://<https://ci-beam.apache.org/job/beam_PostCommit_Java/ws/src/runners/google-cloud-dataflow-java/build/reports/tests/examplesJavaLegacyWorkerIntegrationTest/index.html>

* Try:
Run with --stacktrace option to get the stack trace. Run with --info or --debug option to get more log output. Run with --scan to get full insights.
==============================================================================

2: Task failed with an exception.
-----------
* What went wrong:
Execution failed for task ':runners:google-cloud-dataflow-java:googleCloudPlatformLegacyWorkerIntegrationTest'.
> There were failing tests. See the report at: file://<https://ci-beam.apache.org/job/beam_PostCommit_Java/ws/src/runners/google-cloud-dataflow-java/build/reports/tests/googleCloudPlatformLegacyWorkerIntegrationTest/index.html>

* Try:
Run with --stacktrace option to get the stack trace. Run with --info or --debug option to get more log output. Run with --scan to get full insights.
==============================================================================

* Get more help at https://help.gradle.org

Deprecated Gradle features were used in this build, making it incompatible with Gradle 6.0.
Use '--warning-mode all' to show the individual deprecation warnings.
See https://docs.gradle.org/5.2.1/userguide/command_line_interface.html#sec:command_line_warnings

BUILD FAILED in 1h 16m 7s
99 actionable tasks: 66 executed, 33 from cache

Publishing build scan...
https://gradle.com/s/5t4p5zmsmrhjy

Build step 'Invoke Gradle script' changed build result to FAILURE
Build step 'Invoke Gradle script' marked build as failure

---------------------------------------------------------------------
To unsubscribe, e-mail: builds-unsubscribe@beam.apache.org
For additional commands, e-mail: builds-help@beam.apache.org