You are viewing a plain text version of this content. The canonical link for it is here.
Posted to dev@geode.apache.org by Apache Jenkins Server <je...@builds.apache.org> on 2017/06/05 15:30:53 UTC
Build failed in Jenkins: Geode-nightly #857
See <https://builds.apache.org/job/Geode-nightly/857/display/redirect>
------------------------------------------
[...truncated 95.16 KB...]
:geode-core:checkMissedTests
:geode-core:spotlessJavaCheck
:geode-core:spotlessCheck
:geode-core:test
:geode-core:check
:geode-core:build
:geode-core:distributedTest
:geode-core:integrationTest
:geode-cq:assemble
:geode-cq:compileTestJavaNote: Some input files use or override a deprecated API.
Note: Recompile with -Xlint:deprecation for details.
Note: Some input files use unchecked or unsafe operations.
Note: Recompile with -Xlint:unchecked for details.
:geode-cq:processTestResources
:geode-cq:testClasses
:geode-cq:checkMissedTests
:geode-cq:spotlessJavaCheck
:geode-cq:spotlessCheck
:geode-cq:test
:geode-cq:check
:geode-cq:build
:geode-cq:distributedTest
:geode-cq:integrationTest
:geode-json:assemble
:geode-json:compileTestJava UP-TO-DATE
:geode-json:processTestResources
:geode-json:testClasses
:geode-json:checkMissedTests UP-TO-DATE
:geode-json:spotlessJavaCheck
:geode-json:spotlessCheck
:geode-json:test UP-TO-DATE
:geode-json:check
:geode-json:build
:geode-json:distributedTest UP-TO-DATE
:geode-json:integrationTest UP-TO-DATE
:geode-junit:javadoc
:geode-junit:javadocJar
:geode-junit:sourcesJar
:geode-junit:signArchives SKIPPED
:geode-junit:assemble
:geode-junit:compileTestJava
:geode-junit:processTestResources UP-TO-DATE
:geode-junit:testClasses
:geode-junit:checkMissedTests
:geode-junit:spotlessJavaCheck
:geode-junit:spotlessCheck
:geode-junit:test
:geode-junit:check
:geode-junit:build
:geode-junit:distributedTest
:geode-junit:integrationTest
:geode-lucene:assemble
:geode-lucene:compileTestJavaNote: Some input files use or override a deprecated API.
Note: Recompile with -Xlint:deprecation for details.
Note: Some input files use unchecked or unsafe operations.
Note: Recompile with -Xlint:unchecked for details.
:geode-lucene:processTestResources
:geode-lucene:testClasses
:geode-lucene:checkMissedTests
:geode-lucene:spotlessJavaCheck
:geode-lucene:spotlessCheck
:geode-lucene:test
:geode-lucene:check
:geode-lucene:build
:geode-lucene:distributedTest
:geode-lucene:integrationTest
:geode-old-client-support:assemble
:geode-old-client-support:compileTestJavaNote: <https://builds.apache.org/job/Geode-nightly/ws/geode-old-client-support/src/test/java/com/gemstone/gemfire/cache/execute/FunctionExceptionTest.java> uses or overrides a deprecated API.
Note: Recompile with -Xlint:deprecation for details.
:geode-old-client-support:processTestResources UP-TO-DATE
:geode-old-client-support:testClasses
:geode-old-client-support:checkMissedTests
:geode-old-client-support:spotlessJavaCheck
:geode-old-client-support:spotlessCheck
:geode-old-client-support:test
:geode-old-client-support:check
:geode-old-client-support:build
:geode-old-client-support:distributedTest
:geode-old-client-support:integrationTest
:geode-old-versions:javadoc UP-TO-DATE
:geode-old-versions:javadocJar
:geode-old-versions:sourcesJar
:geode-old-versions:signArchives SKIPPED
:geode-old-versions:assemble
:geode-old-versions:compileTestJava UP-TO-DATE
:geode-old-versions:processTestResources UP-TO-DATE
:geode-old-versions:testClasses UP-TO-DATE
:geode-old-versions:checkMissedTests UP-TO-DATE
:geode-old-versions:spotlessJavaCheck
:geode-old-versions:spotlessCheck
:geode-old-versions:test UP-TO-DATE
:geode-old-versions:check
:geode-old-versions:build
:geode-old-versions:distributedTest UP-TO-DATE
:geode-old-versions:integrationTest UP-TO-DATE
:geode-pulse:assemble
:geode-pulse:compileTestJavaNote: <https://builds.apache.org/job/Geode-nightly/ws/geode-pulse/src/test/java/org/apache/geode/tools/pulse/tests/ui/PulseBase.java> uses or overrides a deprecated API.
Note: Recompile with -Xlint:deprecation for details.
Note: <https://builds.apache.org/job/Geode-nightly/ws/geode-pulse/src/test/java/org/apache/geode/tools/pulse/controllers/PulseControllerJUnitTest.java> uses unchecked or unsafe operations.
Note: Recompile with -Xlint:unchecked for details.
:geode-pulse:processTestResources
:geode-pulse:testClasses
:geode-pulse:checkMissedTests
:geode-pulse:spotlessJavaCheck
:geode-pulse:spotlessCheck
:geode-pulse:test
:geode-pulse:check
:geode-pulse:build
:geode-pulse:distributedTest
:geode-pulse:integrationTest
:geode-rebalancer:assemble
:geode-rebalancer:compileTestJava
:geode-rebalancer:processTestResources UP-TO-DATE
:geode-rebalancer:testClasses
:geode-rebalancer:checkMissedTests
:geode-rebalancer:spotlessJavaCheck
:geode-rebalancer:spotlessCheck
:geode-rebalancer:test
:geode-rebalancer:check
:geode-rebalancer:build
:geode-rebalancer:distributedTest
:geode-rebalancer:integrationTest
:geode-wan:assemble
:geode-wan:compileTestJavaNote: Some input files use or override a deprecated API.
Note: Recompile with -Xlint:deprecation for details.
Note: Some input files use unchecked or unsafe operations.
Note: Recompile with -Xlint:unchecked for details.
:geode-wan:processTestResources
:geode-wan:testClasses
:geode-wan:checkMissedTests
:geode-wan:spotlessJavaCheck
:geode-wan:spotlessCheck
:geode-wan:test
:geode-wan:check
:geode-wan:build
:geode-wan:distributedTest
:geode-wan:integrationTest
:geode-web:assemble
:geode-web:compileTestJavaNote: Some input files use or override a deprecated API.
Note: Recompile with -Xlint:deprecation for details.
Note: Some input files use unchecked or unsafe operations.
Note: Recompile with -Xlint:unchecked for details.
:geode-web:processTestResources UP-TO-DATE
:geode-web:testClasses
:geode-web:checkMissedTests
:geode-web:spotlessJavaCheck
:geode-web:spotlessCheck
:geode-web:test
:geode-web:check
:geode-web:build
:geode-web:distributedTest
org.apache.geode.management.internal.cli.commands.CommandOverHttpDUnitTest > org.apache.geode.management.internal.cli.commands.MemberCommandsDUnitTest.testListMemberAll@org.apache.geode.management.internal.cli.commands.CommandOverHttpDUnitTest FAILED
java.lang.AssertionError: Suspicious strings were written to the log during this run.
Fix the strings or use IgnoredException.addIgnoredException to ignore.
-----------------------------------------------------------------------
Found suspect string in log4j at line 715
[fatal 2017/06/05 15:20:32.892 UTC <pool-108-thread-1> tid=0x790] (tid=1936 msgId=1470) No longer connected to GemFire Manager HTTP service @ http://asf902.gq1.ygridcore.net:22324/gemfire/v1.
113 tests completed, 1 failed, 5 skipped
:geode-web:distributedTest FAILED
:geode-web:integrationTest
:geode-web-api:assemble
:geode-web-api:compileTestJava
:geode-web-api:processTestResources UP-TO-DATE
:geode-web-api:testClasses
:geode-web-api:checkMissedTests
:geode-web-api:spotlessJavaCheck
:geode-web-api:spotlessCheck
:geode-web-api:test
:geode-web-api:check
:geode-web-api:build
:geode-web-api:distributedTest
:geode-web-api:integrationTest
:combineReports
All test reports at <https://builds.apache.org/job/Geode-nightly/ws/build/reports/combined>
:extensions/geode-modules:precheckin
:extensions/geode-modules-assembly:precheckin
:extensions/geode-modules-session:precheckin
:extensions/geode-modules-session-internal:precheckin
:extensions/geode-modules-tomcat7:precheckin
:extensions/geode-modules-tomcat8:precheckin
:geode-assembly:precheckin
:geode-benchmarks:precheckin
:geode-common:precheckin
:geode-core:precheckin
:geode-cq:precheckin
:geode-json:precheckin
:geode-junit:precheckin
:geode-lucene:precheckin
:geode-old-client-support:precheckin
:geode-old-versions:precheckin
:geode-pulse:precheckin
:geode-rebalancer:precheckin
:geode-wan:precheckin
:geode-web-api:precheckin
:compileJava UP-TO-DATE
:processResources UP-TO-DATE
:classes UP-TO-DATE
:jar
:uploadArchives
:extensions/geode-modules:uploadArchives
:extensions/geode-modules-assembly:uploadArchives SKIPPED
:extensions/geode-modules-session:uploadArchives
:extensions/geode-modules-session-internal:uploadArchives
:extensions/geode-modules-tomcat7:uploadArchives
:extensions/geode-modules-tomcat8:uploadArchives
:geode-assembly:uploadArchives SKIPPED
:geode-benchmarks:uploadArchives SKIPPED
:geode-common:uploadArchives
:geode-core:uploadArchives
:geode-cq:uploadArchives
:geode-json:uploadArchives
:geode-junit:uploadArchives
:geode-lucene:uploadArchives
:geode-old-client-support:uploadArchives
:geode-old-versions:uploadArchives SKIPPED
:geode-pulse:uploadArchives
:geode-rebalancer:uploadArchives
:geode-wan:uploadArchives
:geode-web:uploadArchives
:geode-web-api:uploadArchives
FAILURE: Build failed with an exception.
* What went wrong:
Execution failed for task ':geode-web:distributedTest'.
> There were failing tests. See the report at: file://<https://builds.apache.org/job/Geode-nightly/ws/geode-web/build/reports/distributedTest/index.html>
* Try:
Run with --stacktrace option to get the stack trace. Run with --info or --debug option to get more log output.
BUILD FAILED
Total time: 11 hrs 46 mins 21.142 secs
Build step 'Invoke Gradle script' changed build result to FAILURE
Build step 'Invoke Gradle script' marked build as failure
Archiving artifacts
Compressed 328.11 MB of artifacts by 50.2% relative to #853
Recording test results
Not sending mail to unregistered user eshu@pivotal.io
Not sending mail to unregistered user jiliao@pivotal.io
Re: Build failed in Jenkins: Geode-nightly #860
Posted by Kirk Lund <kl...@apache.org>.
We would have to exclude that machine (for now) and file an INFRA ticket to
fix that machine.
On Thu, Jun 8, 2017 at 9:42 AM, Jared Stewart <js...@pivotal.io> wrote:
> It looks like the most recent nightly build failed due to an invalid
> JAVA_HOME directory. Do we have any control over this, or should a ticket
> be filed with Apache Infra?
>
> Thanks,
> Jared
>
> > Begin forwarded message:
> >
> > From: Apache Jenkins Server <je...@builds.apache.org>
> > Subject: Build failed in Jenkins: Geode-nightly #860
> > Date: June 7, 2017 at 8:43:00 PM PDT
> > To: dev@geode.apache.org, kmiller@pivotal.io, lgallinat@pivotal.io,
> abaker@pivotal.io, dschneider@pivotal.io, jstewart@pivotal.io,
> dbarnes@pivotal.io, klund@pivotal.io, boglesby@pivotal.io, nnag@pivotal.io,
> bschuchardt@pivotal.io
> > Reply-To: dev@geode.apache.org
> >
> > See <https://builds.apache.org/job/Geode-nightly/860/display/
> redirect?page=changes>
> >
> > Changes:
> >
> > [bschuchardt] GEODE-3024 race condition between server locator preparing
> membership
> >
> > [boglesby] GEODE-3040: Compare gateway profile order policy against 9.0
> instead of
> >
> > [dbarnes] GEODE-3044: User Manual: Update Swagger example and screen
> shots -
> >
> > [dbarnes] GEODE-2555: Region Management docs page refers to the wrong
> field (id=
> >
> > [dschneider] GEODE-3027: add a simple PartitionResolver
> >
> > [abaker] GEODE-194: Remove spark connector
> >
> > [dbarnes] GEODE-3044: User Manual: Update Swagger example and screen
> shots -
> >
> > ------------------------------------------
> > Started by timer
> > [EnvInject] - Loading node environment variables.
> > Building remotely on mesos2 (mesos s390x) in workspace <
> https://builds.apache.org/job/Geode-nightly/ws/>
> >> git rev-parse --is-inside-work-tree # timeout=10
> > Fetching changes from the remote Git repository
> >> git config remote.origin.url https://git-wip-us.apache.org/
> repos/asf/geode.git # timeout=10
> > Fetching upstream changes from https://git-wip-us.apache.org/
> repos/asf/geode.git
> >> git --version # timeout=10
> >> git fetch --tags --progress https://git-wip-us.apache.org/
> repos/asf/geode.git +refs/heads/*:refs/remotes/origin/*
> >> git rev-parse refs/remotes/origin/develop^{commit} # timeout=10
> >> git rev-parse refs/remotes/origin/origin/develop^{commit} # timeout=10
> > Checking out Revision d73fa3ce289b2108ba352755a68aa8baf9e9b4ca
> (refs/remotes/origin/develop)
> >> git config core.sparsecheckout # timeout=10
> >> git checkout -f d73fa3ce289b2108ba352755a68aa8baf9e9b4ca
> >> git branch -a -v --no-abbrev # timeout=10
> >> git branch -D develop # timeout=10
> >> git checkout -b develop d73fa3ce289b2108ba352755a68aa8baf9e9b4ca
> >> git rev-list 7bad40f368e14182b3cbc88d56505858af3a0ddd # timeout=10
> > [Geode-nightly] $ /bin/bash -xe /tmp/hudson7488740573973842216.sh
> > + git clean -d -f gemfire-pulse/src/main/resources/
> > [Gradle] - Launching build.
> > [Geode-nightly] $ <https://builds.apache.org/
> job/Geode-nightly/ws/gradlew> --no-daemon clean precheckin distTar
> distZip uploadArchives -xflakyTest
> >
> > ERROR: JAVA_HOME is set to an invalid directory:
> /home/jenkins/tools/java/latest1.8
> >
> > Please set the JAVA_HOME variable in your environment to match the
> > location of your Java installation.
> >
> > Build step 'Invoke Gradle script' changed build result to FAILURE
> > Build step 'Invoke Gradle script' marked build as failure
> > Archiving artifacts
> > Recording test results
> > ERROR: Step ?Publish JUnit test result report? failed: No test report
> files were found. Configuration error?
> > Not sending mail to unregistered user eshu@pivotal.io
> > Not sending mail to unregistered user jiliao@pivotal.io
>
>
Fwd: Build failed in Jenkins: Geode-nightly #860
Posted by Jared Stewart <js...@pivotal.io>.
It looks like the most recent nightly build failed due to an invalid JAVA_HOME directory. Do we have any control over this, or should a ticket be filed with Apache Infra?
Thanks,
Jared
> Begin forwarded message:
>
> From: Apache Jenkins Server <je...@builds.apache.org>
> Subject: Build failed in Jenkins: Geode-nightly #860
> Date: June 7, 2017 at 8:43:00 PM PDT
> To: dev@geode.apache.org, kmiller@pivotal.io, lgallinat@pivotal.io, abaker@pivotal.io, dschneider@pivotal.io, jstewart@pivotal.io, dbarnes@pivotal.io, klund@pivotal.io, boglesby@pivotal.io, nnag@pivotal.io, bschuchardt@pivotal.io
> Reply-To: dev@geode.apache.org
>
> See <https://builds.apache.org/job/Geode-nightly/860/display/redirect?page=changes>
>
> Changes:
>
> [bschuchardt] GEODE-3024 race condition between server locator preparing membership
>
> [boglesby] GEODE-3040: Compare gateway profile order policy against 9.0 instead of
>
> [dbarnes] GEODE-3044: User Manual: Update Swagger example and screen shots -
>
> [dbarnes] GEODE-2555: Region Management docs page refers to the wrong field (id=
>
> [dschneider] GEODE-3027: add a simple PartitionResolver
>
> [abaker] GEODE-194: Remove spark connector
>
> [dbarnes] GEODE-3044: User Manual: Update Swagger example and screen shots -
>
> ------------------------------------------
> Started by timer
> [EnvInject] - Loading node environment variables.
> Building remotely on mesos2 (mesos s390x) in workspace <https://builds.apache.org/job/Geode-nightly/ws/>
>> git rev-parse --is-inside-work-tree # timeout=10
> Fetching changes from the remote Git repository
>> git config remote.origin.url https://git-wip-us.apache.org/repos/asf/geode.git # timeout=10
> Fetching upstream changes from https://git-wip-us.apache.org/repos/asf/geode.git
>> git --version # timeout=10
>> git fetch --tags --progress https://git-wip-us.apache.org/repos/asf/geode.git +refs/heads/*:refs/remotes/origin/*
>> git rev-parse refs/remotes/origin/develop^{commit} # timeout=10
>> git rev-parse refs/remotes/origin/origin/develop^{commit} # timeout=10
> Checking out Revision d73fa3ce289b2108ba352755a68aa8baf9e9b4ca (refs/remotes/origin/develop)
>> git config core.sparsecheckout # timeout=10
>> git checkout -f d73fa3ce289b2108ba352755a68aa8baf9e9b4ca
>> git branch -a -v --no-abbrev # timeout=10
>> git branch -D develop # timeout=10
>> git checkout -b develop d73fa3ce289b2108ba352755a68aa8baf9e9b4ca
>> git rev-list 7bad40f368e14182b3cbc88d56505858af3a0ddd # timeout=10
> [Geode-nightly] $ /bin/bash -xe /tmp/hudson7488740573973842216.sh
> + git clean -d -f gemfire-pulse/src/main/resources/
> [Gradle] - Launching build.
> [Geode-nightly] $ <https://builds.apache.org/job/Geode-nightly/ws/gradlew> --no-daemon clean precheckin distTar distZip uploadArchives -xflakyTest
>
> ERROR: JAVA_HOME is set to an invalid directory: /home/jenkins/tools/java/latest1.8
>
> Please set the JAVA_HOME variable in your environment to match the
> location of your Java installation.
>
> Build step 'Invoke Gradle script' changed build result to FAILURE
> Build step 'Invoke Gradle script' marked build as failure
> Archiving artifacts
> Recording test results
> ERROR: Step ?Publish JUnit test result report? failed: No test report files were found. Configuration error?
> Not sending mail to unregistered user eshu@pivotal.io
> Not sending mail to unregistered user jiliao@pivotal.io
Jenkins build is back to normal : Geode-nightly #861
Posted by Apache Jenkins Server <je...@builds.apache.org>.
See <https://builds.apache.org/job/Geode-nightly/861/display/redirect?page=changes>
Build failed in Jenkins: Geode-nightly #860
Posted by Apache Jenkins Server <je...@builds.apache.org>.
See <https://builds.apache.org/job/Geode-nightly/860/display/redirect?page=changes>
Changes:
[bschuchardt] GEODE-3024 race condition between server locator preparing membership
[boglesby] GEODE-3040: Compare gateway profile order policy against 9.0 instead of
[dbarnes] GEODE-3044: User Manual: Update Swagger example and screen shots -
[dbarnes] GEODE-2555: Region Management docs page refers to the wrong field (id=
[dschneider] GEODE-3027: add a simple PartitionResolver
[abaker] GEODE-194: Remove spark connector
[dbarnes] GEODE-3044: User Manual: Update Swagger example and screen shots -
------------------------------------------
Started by timer
[EnvInject] - Loading node environment variables.
Building remotely on mesos2 (mesos s390x) in workspace <https://builds.apache.org/job/Geode-nightly/ws/>
> git rev-parse --is-inside-work-tree # timeout=10
Fetching changes from the remote Git repository
> git config remote.origin.url https://git-wip-us.apache.org/repos/asf/geode.git # timeout=10
Fetching upstream changes from https://git-wip-us.apache.org/repos/asf/geode.git
> git --version # timeout=10
> git fetch --tags --progress https://git-wip-us.apache.org/repos/asf/geode.git +refs/heads/*:refs/remotes/origin/*
> git rev-parse refs/remotes/origin/develop^{commit} # timeout=10
> git rev-parse refs/remotes/origin/origin/develop^{commit} # timeout=10
Checking out Revision d73fa3ce289b2108ba352755a68aa8baf9e9b4ca (refs/remotes/origin/develop)
> git config core.sparsecheckout # timeout=10
> git checkout -f d73fa3ce289b2108ba352755a68aa8baf9e9b4ca
> git branch -a -v --no-abbrev # timeout=10
> git branch -D develop # timeout=10
> git checkout -b develop d73fa3ce289b2108ba352755a68aa8baf9e9b4ca
> git rev-list 7bad40f368e14182b3cbc88d56505858af3a0ddd # timeout=10
[Geode-nightly] $ /bin/bash -xe /tmp/hudson7488740573973842216.sh
+ git clean -d -f gemfire-pulse/src/main/resources/
[Gradle] - Launching build.
[Geode-nightly] $ <https://builds.apache.org/job/Geode-nightly/ws/gradlew> --no-daemon clean precheckin distTar distZip uploadArchives -xflakyTest
ERROR: JAVA_HOME is set to an invalid directory: /home/jenkins/tools/java/latest1.8
Please set the JAVA_HOME variable in your environment to match the
location of your Java installation.
Build step 'Invoke Gradle script' changed build result to FAILURE
Build step 'Invoke Gradle script' marked build as failure
Archiving artifacts
Recording test results
ERROR: Step ?Publish JUnit test result report? failed: No test report files were found. Configuration error?
Not sending mail to unregistered user eshu@pivotal.io
Not sending mail to unregistered user jiliao@pivotal.io
Build failed in Jenkins: Geode-nightly #859
Posted by Apache Jenkins Server <je...@builds.apache.org>.
See <https://builds.apache.org/job/Geode-nightly/859/display/redirect?page=changes>
Changes:
[jiliao] GEODE-3033: Fixing NPE when jarFileNames is null in
[jstewart] GEODE-2908: Adding the new tag as per swagger notification.
[dbarnes] GEODE-3044: User Manual: Update Swagger example and screen shots This
[bschuchardt] GEODE-3024 race condition between server locator preparing membership
[bschuchardt] GEODE-3034 exception on auto-reconnect attempt with multicast enabled
------------------------------------------
[...truncated 98.61 KB...]
Note: Recompile with -Xlint:unchecked for details.
:geode-cq:processTestResources
:geode-cq:testClasses
:geode-cq:checkMissedTests
:geode-cq:spotlessJavaCheck
:geode-cq:spotlessCheck
:geode-cq:test
:geode-cq:check
:geode-cq:build
:geode-cq:distributedTest
:geode-cq:integrationTest
:geode-json:assemble
:geode-json:compileTestJava UP-TO-DATE
:geode-json:processTestResources
:geode-json:testClasses
:geode-json:checkMissedTests UP-TO-DATE
:geode-json:spotlessJavaCheck
:geode-json:spotlessCheck
:geode-json:test UP-TO-DATE
:geode-json:check
:geode-json:build
:geode-json:distributedTest UP-TO-DATE
:geode-json:integrationTest UP-TO-DATE
:geode-junit:javadoc
:geode-junit:javadocJar
:geode-junit:sourcesJar
:geode-junit:signArchives SKIPPED
:geode-junit:assemble
:geode-junit:compileTestJava
:geode-junit:processTestResources UP-TO-DATE
:geode-junit:testClasses
:geode-junit:checkMissedTests
:geode-junit:spotlessJavaCheck
:geode-junit:spotlessCheck
:geode-junit:test
:geode-junit:check
:geode-junit:build
:geode-junit:distributedTest
:geode-junit:integrationTest
:geode-lucene:assemble
:geode-lucene:compileTestJavaNote: Some input files use or override a deprecated API.
Note: Recompile with -Xlint:deprecation for details.
Note: Some input files use unchecked or unsafe operations.
Note: Recompile with -Xlint:unchecked for details.
:geode-lucene:processTestResources
:geode-lucene:testClasses
:geode-lucene:checkMissedTests
:geode-lucene:spotlessJavaCheck
:geode-lucene:spotlessCheck
:geode-lucene:test
:geode-lucene:check
:geode-lucene:build
:geode-lucene:distributedTest
:geode-lucene:integrationTest
:geode-old-client-support:assemble
:geode-old-client-support:compileTestJavaNote: <https://builds.apache.org/job/Geode-nightly/ws/geode-old-client-support/src/test/java/com/gemstone/gemfire/cache/execute/FunctionExceptionTest.java> uses or overrides a deprecated API.
Note: Recompile with -Xlint:deprecation for details.
:geode-old-client-support:processTestResources UP-TO-DATE
:geode-old-client-support:testClasses
:geode-old-client-support:checkMissedTests
:geode-old-client-support:spotlessJavaCheck
:geode-old-client-support:spotlessCheck
:geode-old-client-support:test
:geode-old-client-support:check
:geode-old-client-support:build
:geode-old-client-support:distributedTest
:geode-old-client-support:integrationTest
:geode-old-versions:javadoc UP-TO-DATE
:geode-old-versions:javadocJar
:geode-old-versions:sourcesJar
:geode-old-versions:signArchives SKIPPED
:geode-old-versions:assemble
:geode-old-versions:compileTestJava UP-TO-DATE
:geode-old-versions:processTestResources UP-TO-DATE
:geode-old-versions:testClasses UP-TO-DATE
:geode-old-versions:checkMissedTests UP-TO-DATE
:geode-old-versions:spotlessJavaCheck
:geode-old-versions:spotlessCheck
:geode-old-versions:test UP-TO-DATE
:geode-old-versions:check
:geode-old-versions:build
:geode-old-versions:distributedTest UP-TO-DATE
:geode-old-versions:integrationTest UP-TO-DATE
:geode-pulse:assemble
:geode-pulse:compileTestJavaNote: <https://builds.apache.org/job/Geode-nightly/ws/geode-pulse/src/test/java/org/apache/geode/tools/pulse/tests/ui/PulseBase.java> uses or overrides a deprecated API.
Note: Recompile with -Xlint:deprecation for details.
Note: <https://builds.apache.org/job/Geode-nightly/ws/geode-pulse/src/test/java/org/apache/geode/tools/pulse/controllers/PulseControllerJUnitTest.java> uses unchecked or unsafe operations.
Note: Recompile with -Xlint:unchecked for details.
:geode-pulse:processTestResources
:geode-pulse:testClasses
:geode-pulse:checkMissedTests
:geode-pulse:spotlessJavaCheck
:geode-pulse:spotlessCheck
:geode-pulse:test
:geode-pulse:check
:geode-pulse:build
:geode-pulse:distributedTest
:geode-pulse:integrationTest
:geode-rebalancer:assemble
:geode-rebalancer:compileTestJava
:geode-rebalancer:processTestResources UP-TO-DATE
:geode-rebalancer:testClasses
:geode-rebalancer:checkMissedTests
:geode-rebalancer:spotlessJavaCheck
:geode-rebalancer:spotlessCheck
:geode-rebalancer:test
:geode-rebalancer:check
:geode-rebalancer:build
:geode-rebalancer:distributedTest
:geode-rebalancer:integrationTest
:geode-wan:assemble
:geode-wan:compileTestJavaNote: Some input files use or override a deprecated API.
Note: Recompile with -Xlint:deprecation for details.
Note: Some input files use unchecked or unsafe operations.
Note: Recompile with -Xlint:unchecked for details.
:geode-wan:processTestResources
:geode-wan:testClasses
:geode-wan:checkMissedTests
:geode-wan:spotlessJavaCheck
:geode-wan:spotlessCheck
:geode-wan:test
:geode-wan:check
:geode-wan:build
:geode-wan:distributedTest
:geode-wan:integrationTest
:geode-web:assemble
:geode-web:compileTestJavaNote: Some input files use or override a deprecated API.
Note: Recompile with -Xlint:deprecation for details.
Note: Some input files use unchecked or unsafe operations.
Note: Recompile with -Xlint:unchecked for details.
:geode-web:processTestResources UP-TO-DATE
:geode-web:testClasses
:geode-web:checkMissedTests
:geode-web:spotlessJavaCheck
:geode-web:spotlessCheck
:geode-web:test
:geode-web:check
:geode-web:build
:geode-web:distributedTest
org.apache.geode.management.internal.cli.commands.CommandOverHttpDUnitTest > org.apache.geode.management.internal.cli.commands.MemberCommandsDUnitTest.testListMemberAll@org.apache.geode.management.internal.cli.commands.CommandOverHttpDUnitTest FAILED
java.lang.AssertionError: Suspicious strings were written to the log during this run.
Fix the strings or use IgnoredException.addIgnoredException to ignore.
-----------------------------------------------------------------------
Found suspect string in log4j at line 725
[fatal 2017/06/07 15:43:48.755 UTC <pool-108-thread-1> tid=0x791] (tid=1937 msgId=1466) No longer connected to GemFire Manager HTTP service @ http://asf902.gq1.ygridcore.net:29880/gemfire/v1.
113 tests completed, 1 failed, 5 skipped
:geode-web:distributedTest FAILED
:geode-web:integrationTest
:geode-web-api:assemble
:geode-web-api:compileTestJava
:geode-web-api:processTestResources UP-TO-DATE
:geode-web-api:testClasses
:geode-web-api:checkMissedTests
:geode-web-api:spotlessJavaCheck
:geode-web-api:spotlessCheck
:geode-web-api:test
:geode-web-api:check
:geode-web-api:build
:geode-web-api:distributedTest
:geode-web-api:integrationTest
:combineReports
All test reports at <https://builds.apache.org/job/Geode-nightly/ws/build/reports/combined>
:extensions/geode-modules:precheckin
:extensions/geode-modules-assembly:precheckin
:extensions/geode-modules-session:precheckin
:extensions/geode-modules-session-internal:precheckin
:extensions/geode-modules-tomcat7:precheckin
:extensions/geode-modules-tomcat8:precheckin
:geode-assembly:precheckin
:geode-benchmarks:precheckin
:geode-common:precheckin
:geode-cq:precheckin
:geode-json:precheckin
:geode-junit:precheckin
:geode-lucene:precheckin
:geode-old-client-support:precheckin
:geode-old-versions:precheckin
:geode-pulse:precheckin
:geode-rebalancer:precheckin
:geode-wan:precheckin
:geode-web-api:precheckin
:compileJava UP-TO-DATE
:processResources UP-TO-DATE
:classes UP-TO-DATE
:jar
:uploadArchives
:extensions/geode-modules:uploadArchives
:extensions/geode-modules-assembly:uploadArchives SKIPPED
:extensions/geode-modules-session:uploadArchives
:extensions/geode-modules-session-internal:uploadArchives
:extensions/geode-modules-tomcat7:uploadArchives
:extensions/geode-modules-tomcat8:uploadArchives
:geode-assembly:uploadArchives SKIPPED
:geode-benchmarks:uploadArchives SKIPPED
:geode-common:uploadArchives
:geode-core:uploadArchives
:geode-cq:uploadArchives
:geode-json:uploadArchives
:geode-junit:uploadArchives
:geode-lucene:uploadArchives
:geode-old-client-support:uploadArchives
:geode-old-versions:uploadArchives SKIPPED
:geode-pulse:uploadArchives
:geode-rebalancer:uploadArchives
:geode-wan:uploadArchives
:geode-web:uploadArchives
:geode-web-api:uploadArchives
FAILURE: Build completed with 2 failures.
1: Task failed with an exception.
-----------
* What went wrong:
Execution failed for task ':geode-core:integrationTest'.
> There were failing tests. See the report at: file://<https://builds.apache.org/job/Geode-nightly/ws/geode-core/build/reports/integrationTest/index.html>
* Try:
Run with --stacktrace option to get the stack trace. Run with --info or --debug option to get more log output.
==============================================================================
2: Task failed with an exception.
-----------
* What went wrong:
Execution failed for task ':geode-web:distributedTest'.
> There were failing tests. See the report at: file://<https://builds.apache.org/job/Geode-nightly/ws/geode-web/build/reports/distributedTest/index.html>
* Try:
Run with --stacktrace option to get the stack trace. Run with --info or --debug option to get more log output.
==============================================================================
BUILD FAILED
Total time: 12 hrs 10 mins 11.905 secs
Build step 'Invoke Gradle script' changed build result to FAILURE
Build step 'Invoke Gradle script' marked build as failure
Archiving artifacts
Compressed 327.64 MB of artifacts by 43.4% relative to #853
Recording test results
Not sending mail to unregistered user eshu@pivotal.io
Not sending mail to unregistered user jiliao@pivotal.io
Build failed in Jenkins: Geode-nightly #858
Posted by Apache Jenkins Server <je...@builds.apache.org>.
See <https://builds.apache.org/job/Geode-nightly/858/display/redirect?page=changes>
Changes:
[jiliao] GEODE-2981: Fix the line feed code of the test expected value
[nnag] GEODE-265 : Removing deprecated API's from Execution interface. In
[nnag] GEODE-265 : Removing implementation of methods which are deprecated and
[nnag] GEODE-269 : Fixing RollingUpgrade2DUnitTest. After removing deprecated
[nnag] GEODE-269 : SpotlessApply changes.
[nnag] GEODE-265 : Reverting removal deprecation of withArgs from Execution
[dbarnes] GEODE-1672: When amount of overflowed persisted data exceeds heap size
[dbarnes] GEODE-1672: When amount of overflowed persisted data exceeds heap size
------------------------------------------
Started by timer
[EnvInject] - Loading node environment variables.
Building remotely on mesos2 (mesos s390x) in workspace <https://builds.apache.org/job/Geode-nightly/ws/>
Cloning the remote Git repository
Cloning repository https://git-wip-us.apache.org/repos/asf/geode.git
> git init <https://builds.apache.org/job/Geode-nightly/ws/> # timeout=10
Fetching upstream changes from https://git-wip-us.apache.org/repos/asf/geode.git
> git --version # timeout=10
> git fetch --tags --progress https://git-wip-us.apache.org/repos/asf/geode.git +refs/heads/*:refs/remotes/origin/*
> git config remote.origin.url https://git-wip-us.apache.org/repos/asf/geode.git # timeout=10
> git config --add remote.origin.fetch +refs/heads/*:refs/remotes/origin/* # timeout=10
> git config remote.origin.url https://git-wip-us.apache.org/repos/asf/geode.git # timeout=10
Fetching upstream changes from https://git-wip-us.apache.org/repos/asf/geode.git
> git fetch --tags --progress https://git-wip-us.apache.org/repos/asf/geode.git +refs/heads/*:refs/remotes/origin/*
> git rev-parse refs/remotes/origin/develop^{commit} # timeout=10
> git rev-parse refs/remotes/origin/origin/develop^{commit} # timeout=10
Checking out Revision 1e11c5cc96c22123988e8d3480c0ebb2f2c2df6a (refs/remotes/origin/develop)
> git config core.sparsecheckout # timeout=10
> git checkout -f 1e11c5cc96c22123988e8d3480c0ebb2f2c2df6a
> git branch -a -v --no-abbrev # timeout=10
> git checkout -b develop 1e11c5cc96c22123988e8d3480c0ebb2f2c2df6a
> git rev-list 74c7bbcd07a70e85b14956fa27d0c50c023a7a05 # timeout=10
[Geode-nightly] $ /bin/bash -xe /tmp/hudson5782909569138838446.sh
+ git clean -d -f gemfire-pulse/src/main/resources/
[Gradle] - Launching build.
[Geode-nightly] $ <https://builds.apache.org/job/Geode-nightly/ws/gradlew> --no-daemon clean precheckin distTar distZip uploadArchives -xflakyTest
ERROR: JAVA_HOME is set to an invalid directory: /home/jenkins/tools/java/latest1.8
Please set the JAVA_HOME variable in your environment to match the
location of your Java installation.
Build step 'Invoke Gradle script' changed build result to FAILURE
Build step 'Invoke Gradle script' marked build as failure
Archiving artifacts
Recording test results
ERROR: Step ?Publish JUnit test result report? failed: No test report files were found. Configuration error?
Not sending mail to unregistered user eshu@pivotal.io
Not sending mail to unregistered user jiliao@pivotal.io
Re: Build failed in Jenkins: Geode-nightly #857
Posted by Dan Smith <ds...@pivotal.io>.
This CommandOverHttpDUnitTest seems to be failing pretty consistently in
jenkins. Is anyone looking into this failure?
-Dan
On Mon, Jun 5, 2017 at 8:30 AM, Apache Jenkins Server <
jenkins@builds.apache.org> wrote:
> See <https://builds.apache.org/job/Geode-nightly/857/display/redirect>
>
> ------------------------------------------
> [...truncated 95.16 KB...]
> :geode-core:checkMissedTests
> :geode-core:spotlessJavaCheck
> :geode-core:spotlessCheck
> :geode-core:test
> :geode-core:check
> :geode-core:build
> :geode-core:distributedTest
> :geode-core:integrationTest
> :geode-cq:assemble
> :geode-cq:compileTestJavaNote: Some input files use or override a
> deprecated API.
> Note: Recompile with -Xlint:deprecation for details.
> Note: Some input files use unchecked or unsafe operations.
> Note: Recompile with -Xlint:unchecked for details.
>
> :geode-cq:processTestResources
> :geode-cq:testClasses
> :geode-cq:checkMissedTests
> :geode-cq:spotlessJavaCheck
> :geode-cq:spotlessCheck
> :geode-cq:test
> :geode-cq:check
> :geode-cq:build
> :geode-cq:distributedTest
> :geode-cq:integrationTest
> :geode-json:assemble
> :geode-json:compileTestJava UP-TO-DATE
> :geode-json:processTestResources
> :geode-json:testClasses
> :geode-json:checkMissedTests UP-TO-DATE
> :geode-json:spotlessJavaCheck
> :geode-json:spotlessCheck
> :geode-json:test UP-TO-DATE
> :geode-json:check
> :geode-json:build
> :geode-json:distributedTest UP-TO-DATE
> :geode-json:integrationTest UP-TO-DATE
> :geode-junit:javadoc
> :geode-junit:javadocJar
> :geode-junit:sourcesJar
> :geode-junit:signArchives SKIPPED
> :geode-junit:assemble
> :geode-junit:compileTestJava
> :geode-junit:processTestResources UP-TO-DATE
> :geode-junit:testClasses
> :geode-junit:checkMissedTests
> :geode-junit:spotlessJavaCheck
> :geode-junit:spotlessCheck
> :geode-junit:test
> :geode-junit:check
> :geode-junit:build
> :geode-junit:distributedTest
> :geode-junit:integrationTest
> :geode-lucene:assemble
> :geode-lucene:compileTestJavaNote: Some input files use or override a
> deprecated API.
> Note: Recompile with -Xlint:deprecation for details.
> Note: Some input files use unchecked or unsafe operations.
> Note: Recompile with -Xlint:unchecked for details.
>
> :geode-lucene:processTestResources
> :geode-lucene:testClasses
> :geode-lucene:checkMissedTests
> :geode-lucene:spotlessJavaCheck
> :geode-lucene:spotlessCheck
> :geode-lucene:test
> :geode-lucene:check
> :geode-lucene:build
> :geode-lucene:distributedTest
> :geode-lucene:integrationTest
> :geode-old-client-support:assemble
> :geode-old-client-support:compileTestJavaNote: <https://builds.apache.org/
> job/Geode-nightly/ws/geode-old-client-support/src/test/
> java/com/gemstone/gemfire/cache/execute/FunctionExceptionTest.java> uses
> or overrides a deprecated API.
> Note: Recompile with -Xlint:deprecation for details.
>
> :geode-old-client-support:processTestResources UP-TO-DATE
> :geode-old-client-support:testClasses
> :geode-old-client-support:checkMissedTests
> :geode-old-client-support:spotlessJavaCheck
> :geode-old-client-support:spotlessCheck
> :geode-old-client-support:test
> :geode-old-client-support:check
> :geode-old-client-support:build
> :geode-old-client-support:distributedTest
> :geode-old-client-support:integrationTest
> :geode-old-versions:javadoc UP-TO-DATE
> :geode-old-versions:javadocJar
> :geode-old-versions:sourcesJar
> :geode-old-versions:signArchives SKIPPED
> :geode-old-versions:assemble
> :geode-old-versions:compileTestJava UP-TO-DATE
> :geode-old-versions:processTestResources UP-TO-DATE
> :geode-old-versions:testClasses UP-TO-DATE
> :geode-old-versions:checkMissedTests UP-TO-DATE
> :geode-old-versions:spotlessJavaCheck
> :geode-old-versions:spotlessCheck
> :geode-old-versions:test UP-TO-DATE
> :geode-old-versions:check
> :geode-old-versions:build
> :geode-old-versions:distributedTest UP-TO-DATE
> :geode-old-versions:integrationTest UP-TO-DATE
> :geode-pulse:assemble
> :geode-pulse:compileTestJavaNote: <https://builds.apache.org/
> job/Geode-nightly/ws/geode-pulse/src/test/java/org/
> apache/geode/tools/pulse/tests/ui/PulseBase.java> uses or overrides a
> deprecated API.
> Note: Recompile with -Xlint:deprecation for details.
> Note: <https://builds.apache.org/job/Geode-nightly/ws/geode-
> pulse/src/test/java/org/apache/geode/tools/pulse/controllers/
> PulseControllerJUnitTest.java> uses unchecked or unsafe operations.
> Note: Recompile with -Xlint:unchecked for details.
>
> :geode-pulse:processTestResources
> :geode-pulse:testClasses
> :geode-pulse:checkMissedTests
> :geode-pulse:spotlessJavaCheck
> :geode-pulse:spotlessCheck
> :geode-pulse:test
> :geode-pulse:check
> :geode-pulse:build
> :geode-pulse:distributedTest
> :geode-pulse:integrationTest
> :geode-rebalancer:assemble
> :geode-rebalancer:compileTestJava
> :geode-rebalancer:processTestResources UP-TO-DATE
> :geode-rebalancer:testClasses
> :geode-rebalancer:checkMissedTests
> :geode-rebalancer:spotlessJavaCheck
> :geode-rebalancer:spotlessCheck
> :geode-rebalancer:test
> :geode-rebalancer:check
> :geode-rebalancer:build
> :geode-rebalancer:distributedTest
> :geode-rebalancer:integrationTest
> :geode-wan:assemble
> :geode-wan:compileTestJavaNote: Some input files use or override a
> deprecated API.
> Note: Recompile with -Xlint:deprecation for details.
> Note: Some input files use unchecked or unsafe operations.
> Note: Recompile with -Xlint:unchecked for details.
>
> :geode-wan:processTestResources
> :geode-wan:testClasses
> :geode-wan:checkMissedTests
> :geode-wan:spotlessJavaCheck
> :geode-wan:spotlessCheck
> :geode-wan:test
> :geode-wan:check
> :geode-wan:build
> :geode-wan:distributedTest
> :geode-wan:integrationTest
> :geode-web:assemble
> :geode-web:compileTestJavaNote: Some input files use or override a
> deprecated API.
> Note: Recompile with -Xlint:deprecation for details.
> Note: Some input files use unchecked or unsafe operations.
> Note: Recompile with -Xlint:unchecked for details.
>
> :geode-web:processTestResources UP-TO-DATE
> :geode-web:testClasses
> :geode-web:checkMissedTests
> :geode-web:spotlessJavaCheck
> :geode-web:spotlessCheck
> :geode-web:test
> :geode-web:check
> :geode-web:build
> :geode-web:distributedTest
>
> org.apache.geode.management.internal.cli.commands.CommandOverHttpDUnitTest
> > org.apache.geode.management.internal.cli.commands.
> MemberCommandsDUnitTest.testListMemberAll@org.apache.
> geode.management.internal.cli.commands.CommandOverHttpDUnitTest FAILED
> java.lang.AssertionError: Suspicious strings were written to the log
> during this run.
> Fix the strings or use IgnoredException.addIgnoredException to ignore.
> ------------------------------------------------------------
> -----------
> Found suspect string in log4j at line 715
>
> [fatal 2017/06/05 15:20:32.892 UTC <pool-108-thread-1> tid=0x790]
> (tid=1936 msgId=1470) No longer connected to GemFire Manager HTTP service @
> http://asf902.gq1.ygridcore.net:22324/gemfire/v1.
>
> 113 tests completed, 1 failed, 5 skipped
> :geode-web:distributedTest FAILED
> :geode-web:integrationTest
> :geode-web-api:assemble
> :geode-web-api:compileTestJava
> :geode-web-api:processTestResources UP-TO-DATE
> :geode-web-api:testClasses
> :geode-web-api:checkMissedTests
> :geode-web-api:spotlessJavaCheck
> :geode-web-api:spotlessCheck
> :geode-web-api:test
> :geode-web-api:check
> :geode-web-api:build
> :geode-web-api:distributedTest
> :geode-web-api:integrationTest
> :combineReports
> All test reports at <https://builds.apache.org/job/Geode-nightly/ws/build/
> reports/combined>
> :extensions/geode-modules:precheckin
> :extensions/geode-modules-assembly:precheckin
> :extensions/geode-modules-session:precheckin
> :extensions/geode-modules-session-internal:precheckin
> :extensions/geode-modules-tomcat7:precheckin
> :extensions/geode-modules-tomcat8:precheckin
> :geode-assembly:precheckin
> :geode-benchmarks:precheckin
> :geode-common:precheckin
> :geode-core:precheckin
> :geode-cq:precheckin
> :geode-json:precheckin
> :geode-junit:precheckin
> :geode-lucene:precheckin
> :geode-old-client-support:precheckin
> :geode-old-versions:precheckin
> :geode-pulse:precheckin
> :geode-rebalancer:precheckin
> :geode-wan:precheckin
> :geode-web-api:precheckin
> :compileJava UP-TO-DATE
> :processResources UP-TO-DATE
> :classes UP-TO-DATE
> :jar
> :uploadArchives
> :extensions/geode-modules:uploadArchives
> :extensions/geode-modules-assembly:uploadArchives SKIPPED
> :extensions/geode-modules-session:uploadArchives
> :extensions/geode-modules-session-internal:uploadArchives
> :extensions/geode-modules-tomcat7:uploadArchives
> :extensions/geode-modules-tomcat8:uploadArchives
> :geode-assembly:uploadArchives SKIPPED
> :geode-benchmarks:uploadArchives SKIPPED
> :geode-common:uploadArchives
> :geode-core:uploadArchives
> :geode-cq:uploadArchives
> :geode-json:uploadArchives
> :geode-junit:uploadArchives
> :geode-lucene:uploadArchives
> :geode-old-client-support:uploadArchives
> :geode-old-versions:uploadArchives SKIPPED
> :geode-pulse:uploadArchives
> :geode-rebalancer:uploadArchives
> :geode-wan:uploadArchives
> :geode-web:uploadArchives
> :geode-web-api:uploadArchives
>
> FAILURE: Build failed with an exception.
>
> * What went wrong:
> Execution failed for task ':geode-web:distributedTest'.
> > There were failing tests. See the report at: file://<
> https://builds.apache.org/job/Geode-nightly/ws/geode-web/build/reports/
> distributedTest/index.html>
>
> * Try:
> Run with --stacktrace option to get the stack trace. Run with --info or
> --debug option to get more log output.
>
> BUILD FAILED
>
> Total time: 11 hrs 46 mins 21.142 secs
> Build step 'Invoke Gradle script' changed build result to FAILURE
> Build step 'Invoke Gradle script' marked build as failure
> Archiving artifacts
> Compressed 328.11 MB of artifacts by 50.2% relative to #853
> Recording test results
> Not sending mail to unregistered user eshu@pivotal.io
> Not sending mail to unregistered user jiliao@pivotal.io
>