You are viewing a plain text version of this content. The canonical link for it is here.
Posted to builds@beam.apache.org by Apache Jenkins Server <je...@builds.apache.org> on 2022/08/03 06:50:37 UTC
Build failed in Jenkins: beam_PostCommit_Go_VR_Flink #6476
See <https://ci-beam.apache.org/job/beam_PostCommit_Go_VR_Flink/6476/display/redirect>
Changes:
------------------------------------------
[...truncated 48.26 KB...]
> Task :release:go-licenses:go:docker
f3efab82b0e6: Verifying Checksum
f3efab82b0e6: Download complete
> Task :runners:core-java:compileJava FROM-CACHE
> Task :runners:core-java:classes UP-TO-DATE
> Task :runners:core-java:jar
> Task :sdks:java:extensions:google-cloud-platform-core:compileJava FROM-CACHE
> Task :sdks:java:extensions:google-cloud-platform-core:classes UP-TO-DATE
> Task :sdks:java:extensions:google-cloud-platform-core:jar
> Task :sdks:java:harness:compileJava FROM-CACHE
> Task :sdks:java:harness:classes UP-TO-DATE
> Task :sdks:java:container:generateLicenseReport
> Task :sdks:java:harness:jar
> Task :runners:java-fn-execution:compileJava FROM-CACHE
> Task :runners:java-fn-execution:classes UP-TO-DATE
> Task :runners:java-fn-execution:jar
> Task :sdks:java:expansion-service:compileJava FROM-CACHE
> Task :sdks:java:expansion-service:classes UP-TO-DATE
> Task :sdks:java:expansion-service:jar
> Task :runners:java-job-service:compileJava FROM-CACHE
> Task :runners:java-job-service:classes UP-TO-DATE
> Task :sdks:java:testing:expansion-service:compileTestJava FROM-CACHE
> Task :sdks:java:testing:expansion-service:testClasses
> Task :runners:java-job-service:jar
> Task :sdks:java:io:kafka:compileJava FROM-CACHE
> Task :sdks:java:io:kafka:classes UP-TO-DATE
> Task :runners:direct-java:compileJava FROM-CACHE
> Task :runners:direct-java:classes UP-TO-DATE
> Task :sdks:java:io:kafka:jar
> Task :runners:direct-java:shadowJar FROM-CACHE
> Task :runners:flink:1.15:compileJava FROM-CACHE
> Task :runners:flink:1.15:classes
> Task :runners:flink:1.15:jar
> Task :runners:flink:1.15:job-server:compileJava NO-SOURCE
> Task :runners:flink:1.15:job-server:classes UP-TO-DATE
> Task :sdks:java:io:google-cloud-platform:compileJava FROM-CACHE
> Task :sdks:java:io:google-cloud-platform:classes UP-TO-DATE
> Task :sdks:java:io:google-cloud-platform:jar
> Task :sdks:java:container:pullLicenses
Copying already-fetched licenses from <https://ci-beam.apache.org/job/beam_PostCommit_Go_VR_Flink/ws/src/sdks/java/container/build/reports/dependency-license> to <https://ci-beam.apache.org/job/beam_PostCommit_Go_VR_Flink/ws/src/sdks/java/container/build/target/java_third_party_licenses>
> Task :sdks:java:extensions:sql:compileJava FROM-CACHE
> Task :sdks:java:extensions:sql:classes
> Task :sdks:java:extensions:sql:jar
> Task :sdks:java:harness:shadowJar FROM-CACHE
> Task :sdks:java:extensions:sql:zetasql:compileJava FROM-CACHE
> Task :sdks:java:extensions:sql:zetasql:classes UP-TO-DATE
> Task :sdks:java:extensions:sql:zetasql:jar
> Task :sdks:java:extensions:sql:expansion-service:compileJava FROM-CACHE
> Task :sdks:java:extensions:sql:expansion-service:classes UP-TO-DATE
> Task :sdks:java:extensions:sql:expansion-service:jar
> Task :sdks:java:testing:expansion-service:buildTestExpansionServiceJar FROM-CACHE
> Task :sdks:java:container:java8:copyDockerfileDependencies
> Task :sdks:java:container:java11:copyDockerfileDependencies
> Task :release:go-licenses:go:docker
6b3e8fc138ed: Pull complete
f3efab82b0e6: Pull complete
Digest: sha256:8f95339b8311546977214f4a8cafe93abca5e6153d91122cd83bd5b3e1379f75
Status: Downloaded newer image for golang:1.18-bullseye
---> 2d952adaec1e
Step 2/8 : WORKDIR /usr/src/app
> Task :sdks:java:extensions:sql:expansion-service:shadowJar FROM-CACHE
> Task :sdks:java:container:pullLicenses
Collecting pip
Using cached pip-22.2.1-py3-none-any.whl (2.0 MB)
Collecting setuptools
Using cached setuptools-63.4.0-py3-none-any.whl (1.2 MB)
Collecting wheel
Using cached wheel-0.37.1-py2.py3-none-any.whl (35 kB)
Installing collected packages: pip, setuptools, wheel
Attempting uninstall: pip
Found existing installation: pip 20.0.2
Uninstalling pip-20.0.2:
Successfully uninstalled pip-20.0.2
Attempting uninstall: setuptools
Found existing installation: setuptools 44.0.0
Uninstalling setuptools-44.0.0:
Successfully uninstalled setuptools-44.0.0
Successfully installed pip-22.2.1 setuptools-63.4.0 wheel-0.37.1
Collecting beautifulsoup4<5.0,>=4.9.0
Using cached beautifulsoup4-4.11.1-py3-none-any.whl (128 kB)
Collecting pyyaml<6.0.0,>=3.12
Using cached PyYAML-5.4.1-cp38-cp38-manylinux1_x86_64.whl (662 kB)
Collecting tenacity<6.0,>=5.0.2
Using cached tenacity-5.1.5-py2.py3-none-any.whl (34 kB)
Collecting soupsieve>1.2
Using cached soupsieve-2.3.2.post1-py3-none-any.whl (37 kB)
Collecting six>=1.9.0
Using cached six-1.16.0-py2.py3-none-any.whl (11 kB)
Installing collected packages: soupsieve, six, pyyaml, tenacity, beautifulsoup4
Successfully installed beautifulsoup4-4.11.1 pyyaml-5.4.1 six-1.16.0 soupsieve-2.3.2.post1 tenacity-5.1.5
Executing python <https://ci-beam.apache.org/job/beam_PostCommit_Go_VR_Flink/ws/src/sdks/java/container/license_scripts/pull_licenses_java.py> --license_index=<https://ci-beam.apache.org/job/beam_PostCommit_Go_VR_Flink/ws/src/sdks/java/container/build/reports/dependency-license/index.json> --output_dir=<https://ci-beam.apache.org/job/beam_PostCommit_Go_VR_Flink/ws/src/sdks/java/container/build/target/java_third_party_licenses> --dep_url_yaml=<https://ci-beam.apache.org/job/beam_PostCommit_Go_VR_Flink/ws/src/sdks/java/container/license_scripts/dep_urls_java.yaml> --manual_license_path=<https://ci-beam.apache.org/job/beam_PostCommit_Go_VR_Flink/ws/src/sdks/java/container/license_scripts/manual_licenses>
INFO:root:Pulling license for 240 dependencies using 16 threads.
INFO:root:Replaced local file URL with file://<https://ci-beam.apache.org/job/beam_PostCommit_Go_VR_Flink/ws/src/sdks/java/container/license_scripts/manual_licenses/xz/COPYING> for xz-1.5
INFO:root:pull_licenses_java.py succeed. It took 7.531456 seconds with 16 threads.
Copying licenses from <https://ci-beam.apache.org/job/beam_PostCommit_Go_VR_Flink/ws/src/sdks/java/container/build/target/java_third_party_licenses> to <https://ci-beam.apache.org/job/beam_PostCommit_Go_VR_Flink/ws/src/sdks/java/container/build/target/third_party_licenses.>
Finished license_scripts.sh
> Task :sdks:java:container:goPrepare UP-TO-DATE
> Task :release:go-licenses:go:docker
---> Running in b5d83a8c83e1
Removing intermediate container b5d83a8c83e1
---> d55cd60a320d
Step 3/8 : COPY go.mod ./
---> 8ad5a94dbe8e
Step 4/8 : RUN go install github.com/google/go-licenses@latest
---> Running in 4508c5009fc1
[91mgo: downloading github.com/google/go-licenses v1.2.1
[0m
> Task :sdks:java:container:java8:copyJavaThirdPartyLicenses
> Task :sdks:java:container:java11:copyJavaThirdPartyLicenses
> Task :runners:flink:1.15:job-server:shadowJar FROM-CACHE
> Task :sdks:java:container:goBuild
/home/jenkins/go/bin/go1.18.1 build -o ./build/target/linux_amd64/boot boot.go boot_test.go
> Task :release:go-licenses:go:docker
[91mgo: downloading github.com/spf13/cobra v1.4.0
[0m[91mgo: downloading github.com/golang/glog v0.0.0-20160126235308-23def4e6c14b
[0m[91mgo: downloading github.com/google/licenseclassifier v0.0.0-20210722185704-3043a050f148
[0m[91mgo: downloading golang.org/x/tools v0.1.10
[0m[91mgo: downloading gopkg.in/src-d/go-git.v4 v4.13.1
[0m[91mgo: downloading go.opencensus.io v0.23.0
[0m[91mgo: downloading golang.org/x/net v0.0.0-20211112202133-69e39bad7dc2
go: downloading github.com/otiai10/copy v1.6.0
go: downloading golang.org/x/mod v0.6.0-dev.0.20220106191415-9b9b3d81d5e3
[0m[91mgo: downloading github.com/spf13/pflag v1.0.5
[0m[91mgo: downloading github.com/golang/groupcache v0.0.0-20210331224755-41bb18bfe9da
[0m[91mgo: downloading gopkg.in/src-d/go-billy.v4 v4.3.2
[0m[91mgo: downloading golang.org/x/crypto v0.0.0-20220112180741-5e0467b6c7ce
[0m[91mgo: downloading github.com/sergi/go-diff v1.2.0
[0m[91mgo: downloading github.com/emirpasic/gods v1.12.0
[0m[91mgo: downloading github.com/jbenet/go-context v0.0.0-20150711004518-d14ea06fba99
[0m[91mgo: downloading github.com/src-d/gcfg v1.4.0
[0m[91mgo: downloading github.com/kevinburke/ssh_config v0.0.0-20190725054713-01f96b0aa0cd
go: downloading github.com/mitchellh/go-homedir v1.1.0
go: downloading github.com/xanzy/ssh-agent v0.2.1
[0m[91mgo: downloading golang.org/x/sys v0.0.0-20220111092808-5a964db01320
[0m[91mgo: downloading gopkg.in/warnings.v0 v0.1.2
[0m[91mgo: downloading golang.org/x/xerrors v0.0.0-20200804184101-5ec99f83aff1
[0m
> Task :sdks:java:container:java8:copySdkHarnessLauncher
Execution optimizations have been disabled for task ':sdks:java:container:java8:copySdkHarnessLauncher' to ensure correctness due to the following reasons:
- Gradle detected a problem with the following location: '<https://ci-beam.apache.org/job/beam_PostCommit_Go_VR_Flink/ws/src/sdks/java/container/build/target'.> Reason: Task ':sdks:java:container:java8:copySdkHarnessLauncher' uses this output of task ':sdks:java:container:downloadCloudProfilerAgent' without declaring an explicit or implicit dependency. This can lead to incorrect results being produced, depending on what order the tasks are executed. Please refer to https://docs.gradle.org/7.4/userguide/validation_problems.html#implicit_dependency for more details about this problem.
- Gradle detected a problem with the following location: '<https://ci-beam.apache.org/job/beam_PostCommit_Go_VR_Flink/ws/src/sdks/java/container/build/target'.> Reason: Task ':sdks:java:container:java8:copySdkHarnessLauncher' uses this output of task ':sdks:java:container:pullLicenses' without declaring an explicit or implicit dependency. This can lead to incorrect results being produced, depending on what order the tasks are executed. Please refer to https://docs.gradle.org/7.4/userguide/validation_problems.html#implicit_dependency for more details about this problem.
> Task :sdks:java:container:java11:copySdkHarnessLauncher
Execution optimizations have been disabled for task ':sdks:java:container:java11:copySdkHarnessLauncher' to ensure correctness due to the following reasons:
- Gradle detected a problem with the following location: '<https://ci-beam.apache.org/job/beam_PostCommit_Go_VR_Flink/ws/src/sdks/java/container/build/target'.> Reason: Task ':sdks:java:container:java11:copySdkHarnessLauncher' uses this output of task ':sdks:java:container:downloadCloudProfilerAgent' without declaring an explicit or implicit dependency. This can lead to incorrect results being produced, depending on what order the tasks are executed. Please refer to https://docs.gradle.org/7.4/userguide/validation_problems.html#implicit_dependency for more details about this problem.
- Gradle detected a problem with the following location: '<https://ci-beam.apache.org/job/beam_PostCommit_Go_VR_Flink/ws/src/sdks/java/container/build/target'.> Reason: Task ':sdks:java:container:java11:copySdkHarnessLauncher' uses this output of task ':sdks:java:container:pullLicenses' without declaring an explicit or implicit dependency. This can lead to incorrect results being produced, depending on what order the tasks are executed. Please refer to https://docs.gradle.org/7.4/userguide/validation_problems.html#implicit_dependency for more details about this problem.
> Task :release:go-licenses:go:docker
Removing intermediate container 4508c5009fc1
---> eff628605d1b
Step 5/8 : COPY get-licenses.sh /opt/apache/beam/
---> cb200d639d57
Step 6/8 : ARG sdk_location
---> Running in ee30a214ab4b
Removing intermediate container ee30a214ab4b
---> 7e1c8193f345
Step 7/8 : ENV sdk_location=$sdk_location
---> Running in b8e430aa32b0
Removing intermediate container b8e430aa32b0
---> e88dd2a9f56b
Step 8/8 : ENTRYPOINT /opt/apache/beam/get-licenses.sh
---> Running in 16b172e994f5
Removing intermediate container 16b172e994f5
---> 8726980126fb
Successfully built 8726980126fb
Successfully tagged golicenses-go:latest
> Task :release:go-licenses:go:dockerRun
+ rm -rf '/output/*'
+ go get github.com/apache/beam/sdks/v2/go/container
go: downloading github.com/apache/beam/sdks/v2 v2.40.0
go: downloading github.com/apache/beam v2.40.0+incompatible
go: downloading github.com/golang/protobuf v1.5.2
go: downloading google.golang.org/grpc v1.47.0
go: downloading google.golang.org/protobuf v1.28.0
go: downloading google.golang.org/genproto v0.0.0-20220602131408-e326c6e8e9c8
go: downloading golang.org/x/net v0.0.0-20220607020251-c690dde0001d
go: downloading golang.org/x/sys v0.0.0-20220520151302-bc2c85ada10a
go: downloading golang.org/x/text v0.3.7
go: added github.com/apache/beam/sdks/v2 v2.40.0
go: added github.com/golang/protobuf v1.5.2
go: added golang.org/x/net v0.0.0-20220607020251-c690dde0001d
go: added golang.org/x/sys v0.0.0-20220520151302-bc2c85ada10a
go: added golang.org/x/text v0.3.7
go: added google.golang.org/genproto v0.0.0-20220602131408-e326c6e8e9c8
go: added google.golang.org/grpc v1.47.0
go: added google.golang.org/protobuf v1.28.0
+ go-licenses save github.com/apache/beam/sdks/v2/go/container --save_path=/output/licenses
W0803 06:50:11.637323 27 library.go:94] "golang.org/x/sys/unix" contains non-Go code that can't be inspected for further dependencies:
/go/pkg/mod/golang.org/x/sys@v0.0.0-20220520151302-bc2c85ada10a/unix/asm_linux_amd64.s
+ go-licenses csv github.com/apache/beam/sdks/v2/go/container
+ tee /output/licenses/list.csv
W0803 06:50:16.465226 171 library.go:94] "golang.org/x/sys/unix" contains non-Go code that can't be inspected for further dependencies:
/go/pkg/mod/golang.org/x/sys@v0.0.0-20220520151302-bc2c85ada10a/unix/asm_linux_amd64.s
github.com/apache/beam/sdks/v2/go,https://github.com/apache/beam/blob/sdks/v2.40.0/sdks/go/README.md,Apache-2.0
github.com/golang/protobuf,https://github.com/golang/protobuf/blob/v1.5.2/LICENSE,BSD-3-Clause
golang.org/x/net,https://cs.opensource.google/go/x/net/+/c690dde0:LICENSE,BSD-3-Clause
golang.org/x/sys,https://cs.opensource.google/go/x/sys/+/bc2c85ad:LICENSE,BSD-3-Clause
golang.org/x/text,https://cs.opensource.google/go/x/text/+/v0.3.7:LICENSE,BSD-3-Clause
google.golang.org/genproto/googleapis/rpc/status,https://github.com/googleapis/go-genproto/blob/e326c6e8e9c8/LICENSE,Apache-2.0
google.golang.org/grpc,https://github.com/grpc/grpc-go/blob/v1.47.0/LICENSE,Apache-2.0
google.golang.org/protobuf,https://github.com/protocolbuffers/protobuf-go/blob/v1.28.0/LICENSE,BSD-3-Clause
+ chmod -R a+w /output/licenses
> Task :release:go-licenses:go:createLicenses
> Task :sdks:go:container:copyGolangLicenses
> Task :sdks:go:container:dockerPrepare
> Task :sdks:go:container:docker
FAILURE: Build failed with an exception.
* What went wrong:
Execution failed for task ':release:go-licenses:java:docker'.
> Process 'command 'docker'' finished with non-zero exit value 1
* Try:
> Run with --stacktrace option to get the stack trace.
> Run with --info or --debug option to get more log output.
> Run with --scan to get full insights.
* Get more help at https://help.gradle.org
Deprecated Gradle features were used in this build, making it incompatible with Gradle 8.0.
You can use '--warning-mode all' to show the individual deprecation warnings and determine if they come from your own scripts or plugins.
See https://docs.gradle.org/7.4/userguide/command_line_interface.html#sec:command_line_warnings
Execution optimizations have been disabled for 2 invalid unit(s) of work during this build to ensure correctness.
Please consult deprecation warnings for more details.
BUILD FAILED in 2m 8s
161 actionable tasks: 107 executed, 47 from cache, 7 up-to-date
Publishing build scan...
https://gradle.com/s/ctdmtj3nkjb4o
Build step 'Invoke Gradle script' changed build result to FAILURE
Build step 'Invoke Gradle script' marked build as failure
---------------------------------------------------------------------
To unsubscribe, e-mail: builds-unsubscribe@beam.apache.org
For additional commands, e-mail: builds-help@beam.apache.org
Jenkins build is back to normal : beam_PostCommit_Go_VR_Flink #6477
Posted by Apache Jenkins Server <je...@builds.apache.org>.
See <https://ci-beam.apache.org/job/beam_PostCommit_Go_VR_Flink/6477/display/redirect?page=changes>
---------------------------------------------------------------------
To unsubscribe, e-mail: builds-unsubscribe@beam.apache.org
For additional commands, e-mail: builds-help@beam.apache.org