You are viewing a plain text version of this content. The canonical link for it is here.
Posted to builds@cassandra.apache.org by Apache Jenkins Server <je...@builds.apache.org> on 2023/08/29 15:24:45 UTC
Build complete: Cassandra-4.0 #639 [UNSTABLE] 6ffa43f68b8d10ca84d4a00bf81269527b4e14df
-------------------------------------------------------------------------------
Build Cassandra-4.0 #639 Still Unstable
URL: https://ci-cassandra.apache.org/job/Cassandra-4.0/639/
-------------------------------------------------------------------------------
Changes:
[Jon Meredith] Support Dynamic Port Allocation for in-jvm dtest framework
-------------------------------------------------------------------------------
Failed Tests:
8 tests failed.
FAILED: dtest-upgrade.upgrade_tests.upgrade_through_versions_test.TestProtoV4Upgrade_AllVersions_RandomPartitioner_EndsAt_Trunk_HEAD.test_parallel_upgrade_with_internode_ssl
FAILED: dtest-upgrade.upgrade_tests.upgrade_through_versions_test.TestUpgrade_indev_3_11_x_To_indev_4_0_x.test_bootstrap_multidc
FAILED: dtest-upgrade.upgrade_tests.cql_tests.TestCQLNodes3RF3_Upgrade_indev_3_0_x_To_indev_4_0_x.test_multiordering
FAILED: dtest-upgrade.upgrade_tests.cql_tests.TestCQLNodes3RF3_Upgrade_current_4_0_x_To_indev_4_0_x.test_no_clustering
FAILED: org.apache.cassandra.metrics.TableMetricsTest.testLoggedPartitionsPerBatch-cdc
FAILED: org.apache.cassandra.distributed.upgrade.MixedModeReadTest.mixedModeReadColumnSubsetDigestCheck
FAILED: org.apache.cassandra.distributed.test.FailingRepairTest.testFailingMessage[VALIDATION_REQ/parallel/true]
FAILED: org.apache.cassandra.distributed.test.FailingRepairTest.testFailingMessage[VALIDATION_REQ/parallel/true]
-------------------------------------------------------------------------------
For complete test report and logs see https://nightlies.apache.org/cassandra/Cassandra-4.0/639/