You are viewing a plain text version of this content. The canonical link for it is here.
Posted to notifications@cxf.apache.org by Apache Hudson Server <hu...@hudson.apache.org> on 2011/02/21 21:01:58 UTC
Build failed in Hudson: CXF-Trunk-JDK15 #1762
See <https://hudson.apache.org/hudson/job/CXF-Trunk-JDK15/1762/changes>
Changes:
[dkulp] Fix test failure in SequenceTest
[dkulp] Squashed commit of the following:
commit 9cb8f3e8fc4a21d8d57c0c73038886b2c237b92c
Merge: efaea0e efe9bf6
Author: Daniel Kulp <dk...@apache.org>
Date: Fri Sep 17 15:36:04 2010 -0400
Merge branch 'trunk' of git://git.apache.org/cxf into jibx
commit efaea0e37f7b075fff311238591df602c03a373a
Author: Daniel Kulp <dk...@apache.org>
Date: Wed Aug 18 15:00:45 2010 -0400
grab jibx jars
commit adfb07451db13b26304f70068347f29a6968c2e6
Merge: bd7729a 3172a8a
Author: Daniel Kulp <dk...@apache.org>
Date: Wed Aug 18 14:02:49 2010 -0400
Merge branch 'trunk' of git://git.apache.org/cxf into jibx
commit bd7729ada7b2b949ed4f1faad8b8baced246601b
Author: Daniel Kulp <dk...@apache.org>
Date: Wed Aug 18 12:20:43 2010 -0400
Squashed commit of the following:
commit efd6029a449cb7f1d5fe2cb2afb04aa389d17c62
Author: Nilupa Bandara <nilupa@sanka-laptop.(none)>
Date: Wed Aug 18 18:04:13 2010 +0530
Added the tests
commit e5bf4b67d0a49619a9e5abd42f3acc15cf74a5e5
Author: Nilupa Bandara <nilupa@sanka-laptop.(none)>
Date: Wed Aug 18 16:19:24 2010 +0530
Fixed
commit 717778b23a9f7d14004e62f0fb2c1327475bdb81
Author: Nilupa Bandara <nilupa@sanka-laptop.(none)>
Date: Wed Aug 18 16:02:06 2010 +0530
Renaming
commit 357add787c75a7ed640b2cdfea03624f587b018d
Author: Nilupa Bandara <nilupa@sanka-laptop.(none)>
Date: Mon Aug 16 00:17:18 2010 +0530
Fixed few SchemaResolver issues
commit 2dc03f87f57537d6e211426af6428e6f9458a02e
Author: Nilupa Bandara <nilupa@sanka-laptop.(none)>
Date: Thu Aug 12 19:24:00 2010 +0530
Added tools-plugin.xml
commit 66d36d8070e22805a1ed2511db48225da1f9fc5e
Author: Nilupa Bandara <nilupa@sanka-laptop.(none)>
Date: Thu Aug 12 17:30:26 2010 +0530
deleted
commit 1c46f05d4a9c7f007fed0d035326b87f78c32cac
Author: Nilupa Bandara <nilupa@sanka-laptop.(none)>
Date: Thu Aug 12 17:29:46 2010 +0530
deleted
commit f7052c619c91cb438ec3b5918143e30264219c63
Author: Nilupa Bandara <nilupa@sanka-laptop.(none)>
Date: Thu Aug 12 17:27:47 2010 +0530
deleted the tests
commit aa93873781775d21959794943628fb38633226e7
Author: Nilupa Bandara <nilupa@sanka-laptop.(none)>
Date: Thu Aug 12 14:34:15 2010 +0530
Added
commit 09d166bf5aaeafa7db84975fc1710b4591885dc0
Author: Nilupa Bandara <nilupa@sanka-laptop.(none)>
Date: Wed Aug 11 19:31:09 2010 +0530
Deleted
commit 78b7f080f679a0957fbf05bb611e8eb20f14ca44
Author: Nilupa Bandara <nilupa@sanka-laptop.(none)>
Date: Wed Aug 11 18:52:17 2010 +0530
Removed
commit ce22d150032eb307106d78e9d3fa83989bea4ab4
Author: Nilupa Bandara <nilupa@sanka-laptop.(none)>
Date: Wed Aug 11 18:02:43 2010 +0530
Cleaning up
commit dbeb8839506fd9f655b3cf399800359176a499c6
Author: Nilupa Bandara <nilupa@sanka-laptop.(none)>
Date: Wed Aug 11 15:35:30 2010 +0530
Added javadoc comments
commit 26a5affd57ae073940e9be718bc8d09424d0246e
Author: Nilupa Bandara <nilupa@sanka-laptop.(none)>
Date: Wed Aug 11 02:42:25 2010 +0530
updating
commit 4fd2ea84dcefb002af15e3504232babf0f5c458b
Author: Nilupa Bandara <nilupa@sanka-laptop.(none)>
Date: Fri Jun 18 01:04:40 2010 +0200
Modified.
commit a72115fd136a34113f882e1d75ff14ceed9ba15c
Author: Nilupa Bandara <nilupa@sanka-laptop.(none)>
Date: Fri Jun 18 01:01:59 2010 +0200
Modified.
commit c9e9965563766c92c1e1f9686e1a25bff3b14e3e
Author: Nilupa Bandara <nilupa@sanka-laptop.(none)>
Date: Sat May 22 02:40:38 2010 +0200
Fixed a style error.
commit b73909e6cd759b8537b1ce61d2c2146c16856d23
Author: Nilupa Bandara <nilupa@sanka-laptop.(none)>
Date: Sat May 22 02:36:29 2010 +0200
Modified the poms.
commit b2f8ccd15e2101bb4f7b5ba1bb5f0109077de2fe
Author: Nilupa Bandara <nilupa@sanka-laptop.(none)>
Date: Sat May 22 02:31:20 2010 +0200
Fixed check style errors.
commit 60ae176c3a6ceaf974a257f266068956e22e2874
Author: Nilupa Bandara <nilupa@sanka-laptop.(none)>
Date: Sat May 22 02:27:56 2010 +0200
Fixed style check errors.
commit fd993f97da87c98deb7904eb946601527d8986a9
Author: Nilupa Bandara <nilupa@sanka-laptop.(none)>
Date: Mon May 17 00:31:33 2010 +0200
Adding the initial code
[sergeyb] Minor update to AbstractHTTPServlet for the redirection filter to report the request URI properly
------------------------------------------
Started by an SCM change
Started by an SCM change
Building remotely on ubuntu2
Updating http://svn.apache.org/repos/asf/cxf/trunk
U rt/transports/http/src/main/java/org/apache/cxf/transport/http/AbstractHTTPDestination.java
U rt/transports/http/src/main/java/org/apache/cxf/transport/servlet/AbstractHTTPServlet.java
A rt/databinding/jibx
A rt/databinding/jibx/src
A rt/databinding/jibx/src/test
A rt/databinding/jibx/src/test/java
A rt/databinding/jibx/src/test/java/org
A rt/databinding/jibx/src/test/java/org/apache
A rt/databinding/jibx/src/test/java/org/apache/cxf
A rt/databinding/jibx/src/test/java/org/apache/cxf/jibx
AU rt/databinding/jibx/src/test/java/org/apache/cxf/jibx/AbstractJibxTest.java
AU rt/databinding/jibx/src/test/java/org/apache/cxf/jibx/PrimitiveTypesTest.java
AU rt/databinding/jibx/src/test/java/org/apache/cxf/jibx/PrimitiveTypesService.java
A rt/databinding/jibx/src/test/java/resources
AU rt/databinding/jibx/src/test/java/resources/types.xsd
AU rt/databinding/jibx/src/test/java/resources/binding.xml
A rt/databinding/jibx/src/test/java/resources/com
A rt/databinding/jibx/src/test/java/resources/com/sosnoski
A rt/databinding/jibx/src/test/java/resources/com/sosnoski/ws
A rt/databinding/jibx/src/test/java/resources/com/sosnoski/ws/library
A rt/databinding/jibx/src/test/java/resources/com/sosnoski/ws/library/types
A rt/databinding/jibx/src/test/java/resources/com/sosnoski/ws/library/types/JiBX_bindingFactory.class
A rt/databinding/jibx/src/test/java/resources/com/sosnoski/ws/library/types/BookInformation.class
A rt/databinding/jibx/src/test/java/resources/com/sosnoski/ws/library/types/JiBX_bindingMungeAdapter.class
A rt/databinding/jibx/src/test/java/resources/com/sosnoski/ws/library/types/TypeInformation.class
A rt/databinding/jibx/src/test/java/resources/com/sosnoski/ws/library/types/JiBX_bindingBookInformation_access.class
A rt/databinding/jibx/src/test/java/resources/com/sosnoski/ws/library/types/JiBX_bindingBookInformation_access2.class
A rt/databinding/jibx/src/test/resources
AU rt/databinding/jibx/src/test/resources/types.xsd
AU rt/databinding/jibx/src/test/resources/binding.xml
A rt/databinding/jibx/src/test/resources/com
A rt/databinding/jibx/src/test/resources/com/sosnoski
A rt/databinding/jibx/src/test/resources/com/sosnoski/ws
A rt/databinding/jibx/src/test/resources/com/sosnoski/ws/library
A rt/databinding/jibx/src/test/resources/com/sosnoski/ws/library/types
A rt/databinding/jibx/src/test/resources/com/sosnoski/ws/library/types/JiBX_bindingFactory.class
A rt/databinding/jibx/src/test/resources/com/sosnoski/ws/library/types/BookInformation.class
A rt/databinding/jibx/src/test/resources/com/sosnoski/ws/library/types/JiBX_bindingMungeAdapter.class
A rt/databinding/jibx/src/test/resources/com/sosnoski/ws/library/types/TypeInformation.class
A rt/databinding/jibx/src/test/resources/com/sosnoski/ws/library/types/JiBX_bindingBookInformation_access.class
A rt/databinding/jibx/src/test/resources/com/sosnoski/ws/library/types/JiBX_bindingBookInformation_access2.class
A rt/databinding/jibx/src/main
A rt/databinding/jibx/src/main/java
A rt/databinding/jibx/src/main/java/org
A rt/databinding/jibx/src/main/java/org/apache
A rt/databinding/jibx/src/main/java/org/apache/cxf
A rt/databinding/jibx/src/main/java/org/apache/cxf/jibx
A rt/databinding/jibx/src/main/java/org/apache/cxf/jibx/tools
AU rt/databinding/jibx/src/main/java/org/apache/cxf/jibx/tools/JibxSchemaResolver.java
AU rt/databinding/jibx/src/main/java/org/apache/cxf/jibx/tools/JibxToolingProblemHandler.java
AU rt/databinding/jibx/src/main/java/org/apache/cxf/jibx/tools/JibxSchemaHelper.java
AU rt/databinding/jibx/src/main/java/org/apache/cxf/jibx/tools/JibxToolingDataBinding.java
AU rt/databinding/jibx/src/main/java/org/apache/cxf/jibx/JibxDataBinding.java
AU rt/databinding/jibx/src/main/java/org/apache/cxf/jibx/JibxSchemaInitializer.java
AU rt/databinding/jibx/src/main/java/org/apache/cxf/jibx/JibxDataWriter.java
AU rt/databinding/jibx/src/main/java/org/apache/cxf/jibx/JibxDataReader.java
AU rt/databinding/jibx/src/main/java/org/apache/cxf/jibx/JibxNullBindingFactory.java
AU rt/databinding/jibx/src/main/java/org/apache/cxf/jibx/JibxUtil.java
AU rt/databinding/jibx/src/main/java/org/apache/cxf/jibx/JibxSimpleTypes.java
AU rt/databinding/jibx/src/main/java/org/apache/cxf/jibx/JibxWrapperHelper.java
A rt/databinding/jibx/src/main/resources
A rt/databinding/jibx/src/main/resources/META-INF
AU rt/databinding/jibx/src/main/resources/META-INF/tools-plugin.xml
AU rt/databinding/jibx/pom.xml
U rt/ws/rm/src/main/java/org/apache/cxf/ws/rm/Proxy.java
U rt/pom.xml
U parent/pom.xml
U systests/ws-specs/src/test/java/org/apache/cxf/systest/ws/rm/SequenceTest.java
At revision 1073124
Found mavenVersion 2.2.1 from file jar:file:/home/hudson/tools/maven/apache-maven-2.2.1/lib/maven-2.2.1-uber.jar!/META-INF/maven/org.apache.maven/maven-core/pom.properties
[locks-and-latches] Checking to see if we really have the locks
[locks-and-latches] Have all the locks, build can start
Parsing POMs
Discovered a new module org.apache.cxf:cxf-rt-databinding-jibx Apache CXF Runtime JiBX DataBinding
[trunk] $ /home/hudson/tools/java/latest1.5/bin/java -ea -XX:MaxPermSize=192m -Xmx512M -cp /home/hudson/hudson-slave/maven-agent.jar:/home/hudson/hudson-slave/classworlds.jar hudson.maven.agent.Main /home/hudson/tools/maven/apache-maven-2.2.1 /home/hudson/hudson-slave/slave.jar /home/hudson/hudson-slave/maven-interceptor.jar 47074 /home/hudson/hudson-slave/maven2.1-interceptor.jar
<===[HUDSON REMOTING CAPACITY]===>channel started
Executing Maven: -B -f <https://hudson.apache.org/hudson/job/CXF-Trunk-JDK15/ws/trunk/pom.xml> -Dmaven.repo.local=<https://hudson.apache.org/hudson/job/CXF-Trunk-JDK15/ws/.repository> -U -cpu -B -e clean install+ Error stacktraces are turned on.
[INFO] Scanning for projects...
[INFO] ------------------------------------------------------------------------
[ERROR] FATAL ERROR
[INFO] ------------------------------------------------------------------------
[INFO] Error building POM (may not be this project's POM).
Project ID: org.apache.cxf:cxf-rt-databinding-jibx
POM Location: <https://hudson.apache.org/hudson/job/CXF-Trunk-JDK15/ws/trunk/rt/databinding/jibx/pom.xml>
Validation Messages:
[0] 'dependencies.dependency.artifactId' with value '${stax.impl.artifactId}' does not match a valid id pattern.
[1] 'dependencies.dependency.groupId' with value '${stax.impl.groupId}' does not match a valid id pattern.
[2] 'dependencies.dependency.version' is missing for ${stax.impl.groupId}:${stax.impl.artifactId}:jar
Reason: Failed to validate POM for project org.apache.cxf:cxf-rt-databinding-jibx at <https://hudson.apache.org/hudson/job/CXF-Trunk-JDK15/ws/trunk/rt/databinding/jibx/pom.xml>
[INFO] ------------------------------------------------------------------------
[INFO] Trace
org.apache.maven.reactor.MavenExecutionException: Failed to validate POM for project org.apache.cxf:cxf-rt-databinding-jibx at <https://hudson.apache.org/hudson/job/CXF-Trunk-JDK15/ws/trunk/rt/databinding/jibx/pom.xml>
at org.apache.maven.DefaultMaven.getProjects(DefaultMaven.java:404)
at org.apache.maven.DefaultMaven.doExecute(DefaultMaven.java:272)
at org.apache.maven.DefaultMaven.execute(DefaultMaven.java:138)
at org.apache.maven.cli.MavenCli.main(MavenCli.java:362)
at sun.reflect.NativeMethodAccessorImpl.invoke0(Native Method)
at sun.reflect.NativeMethodAccessorImpl.invoke(NativeMethodAccessorImpl.java:39)
at sun.reflect.DelegatingMethodAccessorImpl.invoke(DelegatingMethodAccessorImpl.java:25)
at java.lang.reflect.Method.invoke(Method.java:592)
at org.codehaus.classworlds.Launcher.launchEnhanced(Launcher.java:315)
at org.codehaus.classworlds.Launcher.launch(Launcher.java:255)
at hudson.maven.agent.Main.launch(Main.java:173)
at hudson.maven.MavenBuilder.call(MavenBuilder.java:164)
at hudson.maven.MavenModuleSetBuild$Builder.call(MavenModuleSetBuild.java:868)
at hudson.maven.MavenModuleSetBuild$Builder.call(MavenModuleSetBuild.java:799)
at hudson.remoting.UserRequest.perform(UserRequest.java:114)
at hudson.remoting.UserRequest.perform(UserRequest.java:48)
at hudson.remoting.Request$2.run(Request.java:270)
at java.util.concurrent.Executors$RunnableAdapter.call(Executors.java:417)
at java.util.concurrent.FutureTask$Sync.innerRun(FutureTask.java:269)
at java.util.concurrent.FutureTask.run(FutureTask.java:123)
at java.util.concurrent.ThreadPoolExecutor$Worker.runTask(ThreadPoolExecutor.java:651)
at java.util.concurrent.ThreadPoolExecutor$Worker.run(ThreadPoolExecutor.java:676)
at java.lang.Thread.run(Thread.java:595)
Caused by: org.apache.maven.project.InvalidProjectModelException: Failed to validate POM for project org.apache.cxf:cxf-rt-databinding-jibx at <https://hudson.apache.org/hudson/job/CXF-Trunk-JDK15/ws/trunk/rt/databinding/jibx/pom.xml>
at org.apache.maven.project.DefaultMavenProjectBuilder.processProjectLogic(DefaultMavenProjectBuilder.java:1077)
at org.apache.maven.project.DefaultMavenProjectBuilder.buildInternal(DefaultMavenProjectBuilder.java:880)
at org.apache.maven.project.DefaultMavenProjectBuilder.buildFromSourceFileInternal(DefaultMavenProjectBuilder.java:508)
at org.apache.maven.project.DefaultMavenProjectBuilder.build(DefaultMavenProjectBuilder.java:200)
at org.apache.maven.DefaultMaven.getProject(DefaultMaven.java:604)
at org.apache.maven.DefaultMaven.collectProjects(DefaultMaven.java:487)
at org.apache.maven.DefaultMaven.collectProjects(DefaultMaven.java:560)
at org.apache.maven.DefaultMaven.collectProjects(DefaultMaven.java:560)
at org.apache.maven.DefaultMaven.getProjects(DefaultMaven.java:391)
... 22 more
[INFO] ------------------------------------------------------------------------
[INFO] Total time: 1 second
[INFO] Finished at: Mon Feb 21 20:02:25 UTC 2011
[INFO] Final Memory: 6M/35M
[INFO] ------------------------------------------------------------------------
channel stopped
[locks-and-latches] Releasing all the locks
[locks-and-latches] All the locks released
Hudson build is back to stable : CXF-Trunk-JDK15 #1768
Posted by Apache Hudson Server <hu...@hudson.apache.org>.
See <https://hudson.apache.org/hudson/job/CXF-Trunk-JDK15/1768/changes>
Hudson build is unstable: CXF-Trunk-JDK15 #1767
Posted by Apache Hudson Server <hu...@hudson.apache.org>.
See <https://hudson.apache.org/hudson/job/CXF-Trunk-JDK15/1767/changes>
Build failed in Hudson: CXF-Trunk-JDK15 #1766
Posted by Apache Hudson Server <hu...@hudson.apache.org>.
See <https://hudson.apache.org/hudson/job/CXF-Trunk-JDK15/1766/changes>
Changes:
[sergeyb] [CXF-3357] Improving ServletController updateDests method for multiple endpoints sharing the same servlet path be supported
[sergeyb] JAX-RS: minimize the excessive logging in case of client models
------------------------------------------
Started by an SCM change
Building remotely on ubuntu1
Updating http://svn.apache.org/repos/asf/cxf/trunk
U rt/frontend/jaxrs/src/main/java/org/apache/cxf/jaxrs/interceptor/JAXRSOutInterceptor.java
U rt/frontend/jaxrs/src/main/java/org/apache/cxf/jaxrs/client/JAXRSClientFactory.java
U rt/transports/http/src/test/java/org/apache/cxf/transport/servlet/ServletControllerTest.java
U rt/transports/http/src/main/java/org/apache/cxf/transport/servlet/ServletController.java
U rt/transports/http/src/main/java/org/apache/cxf/transport/servlet/AbstractCXFServlet.java
U rt/transports/http/src/main/java/org/apache/cxf/transport/servlet/ServletTransportFactory.java
U rt/transports/http/src/main/java/org/apache/cxf/transport/servlet/AbstractServletController.java
U rt/transports/http-osgi/src/main/java/org/apache/cxf/transport/http_osgi/OsgiServletController.java
U rt/transports/http-osgi/src/main/resources/META-INF/spring/cxf-transport-osgi.xml
U systests/jaxrs/src/test/java/org/apache/cxf/systest/jaxrs/JAXRSAtomBookTest.java
U systests/jaxrs/src/test/java/org/apache/cxf/systest/jaxrs/resources/expected_atom_book_json3.txt
U systests/jaxrs/src/test/resources/jaxrs_atom/WEB-INF/beans.xml
At revision 1073433
Found mavenVersion 2.2.1 from file jar:file:/home/hudson/tools/maven/apache-maven-2.2.1/lib/maven-2.2.1-uber.jar!/META-INF/maven/org.apache.maven/maven-core/pom.properties
[locks-and-latches] Checking to see if we really have the locks
[locks-and-latches] Have all the locks, build can start
Parsing POMs
[trunk] $ /home/hudson/tools/java/latest1.5/bin/java -ea -XX:MaxPermSize=192m -Xmx512M -cp /home/hudson/hudson-slave/maven-agent.jar:/home/hudson/hudson-slave/classworlds.jar hudson.maven.agent.Main /home/hudson/tools/maven/apache-maven-2.2.1 /home/hudson/hudson-slave/slave.jar /home/hudson/hudson-slave/maven-interceptor.jar 54198 /home/hudson/hudson-slave/maven2.1-interceptor.jar
channel started
<===[HUDSON REMOTING CAPACITY]===> Executing Maven: -B -f <https://hudson.apache.org/hudson/job/CXF-Trunk-JDK15/ws/trunk/pom.xml> -Dmaven.repo.local=<https://hudson.apache.org/hudson/job/CXF-Trunk-JDK15/ws/.repository> -U -cpu -B -e clean install+ Error stacktraces are turned on.
[INFO] Scanning for projects...
[INFO] ------------------------------------------------------------------------
[ERROR] FATAL ERROR
[INFO] ------------------------------------------------------------------------
[INFO] Error building POM (may not be this project's POM).
Project ID: org.apache.cxf:cxf-rt-databinding-jibx
POM Location: <https://hudson.apache.org/hudson/job/CXF-Trunk-JDK15/ws/trunk/rt/databinding/jibx/pom.xml>
Validation Messages:
[0] 'dependencies.dependency.artifactId' with value '${stax.impl.artifactId}' does not match a valid id pattern.
[1] 'dependencies.dependency.groupId' with value '${stax.impl.groupId}' does not match a valid id pattern.
[2] 'dependencies.dependency.version' is missing for ${stax.impl.groupId}:${stax.impl.artifactId}:jar
Reason: Failed to validate POM for project org.apache.cxf:cxf-rt-databinding-jibx at <https://hudson.apache.org/hudson/job/CXF-Trunk-JDK15/ws/trunk/rt/databinding/jibx/pom.xml>
[INFO] ------------------------------------------------------------------------
[INFO] Trace
org.apache.maven.reactor.MavenExecutionException: Failed to validate POM for project org.apache.cxf:cxf-rt-databinding-jibx at <https://hudson.apache.org/hudson/job/CXF-Trunk-JDK15/ws/trunk/rt/databinding/jibx/pom.xml>
at org.apache.maven.DefaultMaven.getProjects(DefaultMaven.java:404)
at org.apache.maven.DefaultMaven.doExecute(DefaultMaven.java:272)
at org.apache.maven.DefaultMaven.execute(DefaultMaven.java:138)
at org.apache.maven.cli.MavenCli.main(MavenCli.java:362)
at sun.reflect.NativeMethodAccessorImpl.invoke0(Native Method)
at sun.reflect.NativeMethodAccessorImpl.invoke(NativeMethodAccessorImpl.java:39)
at sun.reflect.DelegatingMethodAccessorImpl.invoke(DelegatingMethodAccessorImpl.java:25)
at java.lang.reflect.Method.invoke(Method.java:592)
at org.codehaus.classworlds.Launcher.launchEnhanced(Launcher.java:315)
at org.codehaus.classworlds.Launcher.launch(Launcher.java:255)
at hudson.maven.agent.Main.launch(Main.java:173)
at hudson.maven.MavenBuilder.call(MavenBuilder.java:164)
at hudson.maven.MavenModuleSetBuild$Builder.call(MavenModuleSetBuild.java:868)
at hudson.maven.MavenModuleSetBuild$Builder.call(MavenModuleSetBuild.java:799)
at hudson.remoting.UserRequest.perform(UserRequest.java:114)
at hudson.remoting.UserRequest.perform(UserRequest.java:48)
at hudson.remoting.Request$2.run(Request.java:270)
at java.util.concurrent.Executors$RunnableAdapter.call(Executors.java:417)
at java.util.concurrent.FutureTask$Sync.innerRun(FutureTask.java:269)
at java.util.concurrent.FutureTask.run(FutureTask.java:123)
at java.util.concurrent.ThreadPoolExecutor$Worker.runTask(ThreadPoolExecutor.java:651)
at java.util.concurrent.ThreadPoolExecutor$Worker.run(ThreadPoolExecutor.java:676)
at java.lang.Thread.run(Thread.java:595)
Caused by: org.apache.maven.project.InvalidProjectModelException: Failed to validate POM for project org.apache.cxf:cxf-rt-databinding-jibx at <https://hudson.apache.org/hudson/job/CXF-Trunk-JDK15/ws/trunk/rt/databinding/jibx/pom.xml>
at org.apache.maven.project.DefaultMavenProjectBuilder.processProjectLogic(DefaultMavenProjectBuilder.java:1077)
at org.apache.maven.project.DefaultMavenProjectBuilder.buildInternal(DefaultMavenProjectBuilder.java:880)
at org.apache.maven.project.DefaultMavenProjectBuilder.buildFromSourceFileInternal(DefaultMavenProjectBuilder.java:508)
at org.apache.maven.project.DefaultMavenProjectBuilder.build(DefaultMavenProjectBuilder.java:200)
at org.apache.maven.DefaultMaven.getProject(DefaultMaven.java:604)
at org.apache.maven.DefaultMaven.collectProjects(DefaultMaven.java:487)
at org.apache.maven.DefaultMaven.collectProjects(DefaultMaven.java:560)
at org.apache.maven.DefaultMaven.collectProjects(DefaultMaven.java:560)
at org.apache.maven.DefaultMaven.getProjects(DefaultMaven.java:391)
... 22 more
[INFO] ------------------------------------------------------------------------
[INFO] Total time: 1 second
[INFO] Finished at: Tue Feb 22 09:48:40 GMT-08:00 2011
[INFO] Final Memory: 6M/23M
[INFO] ------------------------------------------------------------------------
channel stopped
[locks-and-latches] Releasing all the locks
[locks-and-latches] All the locks released
Build failed in Hudson: CXF-Trunk-JDK15 #1765
Posted by Apache Hudson Server <hu...@hudson.apache.org>.
See <https://hudson.apache.org/hudson/job/CXF-Trunk-JDK15/1765/changes>
Changes:
[ningjiang] CXF-3355 Exporting the properties of OSGi transport Servlet for configuring by the OSGi admin services
------------------------------------------
Started by an SCM change
Building remotely on ubuntu2
Updating http://svn.apache.org/repos/asf/cxf/trunk
U rt/transports/http/src/main/java/org/apache/cxf/transport/servlet/AbstractServletController.java
U rt/transports/http-osgi/src/main/resources/META-INF/spring/cxf-transport-osgi.xml
U tools/wsdlto/frontend/jaxws/src/main/java/org/apache/cxf/tools/wsdlto/frontend/jaxws/generators/FaultGenerator.java
U tools/wsdlto/frontend/jaxws/src/main/java/org/apache/cxf/tools/wsdlto/frontend/jaxws/template/impl.vm
U tools/wsdlto/test/src/test/java/org/apache/cxf/tools/wsdlto/jaxws/CodeGenBugTest.java
A tools/wsdlto/test/src/test/resources/wsdl2java_wsdl/cxf3353
A tools/wsdlto/test/src/test/resources/wsdl2java_wsdl/cxf3353/hello_world.wsdl
At revision 1073319
Found mavenVersion 2.2.1 from file jar:file:/home/hudson/tools/maven/apache-maven-2.2.1/lib/maven-2.2.1-uber.jar!/META-INF/maven/org.apache.maven/maven-core/pom.properties
[locks-and-latches] Checking to see if we really have the locks
[locks-and-latches] Have all the locks, build can start
Parsing POMs
[trunk] $ /home/hudson/tools/java/latest1.5/bin/java -ea -XX:MaxPermSize=192m -Xmx512M -cp /home/hudson/hudson-slave/maven-agent.jar:/home/hudson/hudson-slave/classworlds.jar hudson.maven.agent.Main /home/hudson/tools/maven/apache-maven-2.2.1 /home/hudson/hudson-slave/slave.jar /home/hudson/hudson-slave/maven-interceptor.jar 58822 /home/hudson/hudson-slave/maven2.1-interceptor.jar
<===[HUDSON REMOTING CAPACITY]===>channel started
Executing Maven: -B -f <https://hudson.apache.org/hudson/job/CXF-Trunk-JDK15/ws/trunk/pom.xml> -Dmaven.repo.local=<https://hudson.apache.org/hudson/job/CXF-Trunk-JDK15/ws/.repository> -U -cpu -B -e clean install+ Error stacktraces are turned on.
[INFO] Scanning for projects...
[INFO] ------------------------------------------------------------------------
[ERROR] FATAL ERROR
[INFO] ------------------------------------------------------------------------
[INFO] Error building POM (may not be this project's POM).
Project ID: org.apache.cxf:cxf-rt-databinding-jibx
POM Location: <https://hudson.apache.org/hudson/job/CXF-Trunk-JDK15/ws/trunk/rt/databinding/jibx/pom.xml>
Validation Messages:
[0] 'dependencies.dependency.artifactId' with value '${stax.impl.artifactId}' does not match a valid id pattern.
[1] 'dependencies.dependency.groupId' with value '${stax.impl.groupId}' does not match a valid id pattern.
[2] 'dependencies.dependency.version' is missing for ${stax.impl.groupId}:${stax.impl.artifactId}:jar
Reason: Failed to validate POM for project org.apache.cxf:cxf-rt-databinding-jibx at <https://hudson.apache.org/hudson/job/CXF-Trunk-JDK15/ws/trunk/rt/databinding/jibx/pom.xml>
[INFO] ------------------------------------------------------------------------
[INFO] Trace
org.apache.maven.reactor.MavenExecutionException: Failed to validate POM for project org.apache.cxf:cxf-rt-databinding-jibx at <https://hudson.apache.org/hudson/job/CXF-Trunk-JDK15/ws/trunk/rt/databinding/jibx/pom.xml>
at org.apache.maven.DefaultMaven.getProjects(DefaultMaven.java:404)
at org.apache.maven.DefaultMaven.doExecute(DefaultMaven.java:272)
at org.apache.maven.DefaultMaven.execute(DefaultMaven.java:138)
at org.apache.maven.cli.MavenCli.main(MavenCli.java:362)
at sun.reflect.NativeMethodAccessorImpl.invoke0(Native Method)
at sun.reflect.NativeMethodAccessorImpl.invoke(NativeMethodAccessorImpl.java:39)
at sun.reflect.DelegatingMethodAccessorImpl.invoke(DelegatingMethodAccessorImpl.java:25)
at java.lang.reflect.Method.invoke(Method.java:592)
at org.codehaus.classworlds.Launcher.launchEnhanced(Launcher.java:315)
at org.codehaus.classworlds.Launcher.launch(Launcher.java:255)
at hudson.maven.agent.Main.launch(Main.java:173)
at hudson.maven.MavenBuilder.call(MavenBuilder.java:164)
at hudson.maven.MavenModuleSetBuild$Builder.call(MavenModuleSetBuild.java:868)
at hudson.maven.MavenModuleSetBuild$Builder.call(MavenModuleSetBuild.java:799)
at hudson.remoting.UserRequest.perform(UserRequest.java:114)
at hudson.remoting.UserRequest.perform(UserRequest.java:48)
at hudson.remoting.Request$2.run(Request.java:270)
at java.util.concurrent.Executors$RunnableAdapter.call(Executors.java:417)
at java.util.concurrent.FutureTask$Sync.innerRun(FutureTask.java:269)
at java.util.concurrent.FutureTask.run(FutureTask.java:123)
at java.util.concurrent.ThreadPoolExecutor$Worker.runTask(ThreadPoolExecutor.java:651)
at java.util.concurrent.ThreadPoolExecutor$Worker.run(ThreadPoolExecutor.java:676)
at java.lang.Thread.run(Thread.java:595)
Caused by: org.apache.maven.project.InvalidProjectModelException: Failed to validate POM for project org.apache.cxf:cxf-rt-databinding-jibx at <https://hudson.apache.org/hudson/job/CXF-Trunk-JDK15/ws/trunk/rt/databinding/jibx/pom.xml>
at org.apache.maven.project.DefaultMavenProjectBuilder.processProjectLogic(DefaultMavenProjectBuilder.java:1077)
at org.apache.maven.project.DefaultMavenProjectBuilder.buildInternal(DefaultMavenProjectBuilder.java:880)
at org.apache.maven.project.DefaultMavenProjectBuilder.buildFromSourceFileInternal(DefaultMavenProjectBuilder.java:508)
at org.apache.maven.project.DefaultMavenProjectBuilder.build(DefaultMavenProjectBuilder.java:200)
at org.apache.maven.DefaultMaven.getProject(DefaultMaven.java:604)
at org.apache.maven.DefaultMaven.collectProjects(DefaultMaven.java:487)
at org.apache.maven.DefaultMaven.collectProjects(DefaultMaven.java:560)
at org.apache.maven.DefaultMaven.collectProjects(DefaultMaven.java:560)
at org.apache.maven.DefaultMaven.getProjects(DefaultMaven.java:391)
... 22 more
[INFO] ------------------------------------------------------------------------
[INFO] Total time: 1 second
[INFO] Finished at: Tue Feb 22 12:54:59 UTC 2011
[INFO] Final Memory: 6M/24M
[INFO] ------------------------------------------------------------------------
channel stopped
[locks-and-latches] Releasing all the locks
[locks-and-latches] All the locks released
Build failed in Hudson: CXF-Trunk-JDK15 #1764
Posted by Apache Hudson Server <hu...@hudson.apache.org>.
See <https://hudson.apache.org/hudson/job/CXF-Trunk-JDK15/1764/changes>
Changes:
[ffang] [CXF-3353]can't refer to java.lang.Exception in gererated fault code
------------------------------------------
Started by an SCM change
Building remotely on ubuntu1
Updating http://svn.apache.org/repos/asf/cxf/trunk
U rt/frontend/simple/src/test/java/org/apache/cxf/frontend/spring/ClientServerTest.java
U rt/transports/http/src/main/java/org/apache/cxf/transport/http/AbstractHTTPDestination.java
U rt/transports/http/src/main/java/org/apache/cxf/transport/servlet/AbstractHTTPServlet.java
U rt/transports/http-osgi/src/main/resources/META-INF/cxf/osgi/cxf-extension-osgi.xml
A rt/databinding/jibx
A rt/databinding/jibx/src
A rt/databinding/jibx/src/test
A rt/databinding/jibx/src/test/java
A rt/databinding/jibx/src/test/java/org
A rt/databinding/jibx/src/test/java/org/apache
A rt/databinding/jibx/src/test/java/org/apache/cxf
A rt/databinding/jibx/src/test/java/org/apache/cxf/jibx
AU rt/databinding/jibx/src/test/java/org/apache/cxf/jibx/AbstractJibxTest.java
AU rt/databinding/jibx/src/test/java/org/apache/cxf/jibx/PrimitiveTypesTest.java
AU rt/databinding/jibx/src/test/java/org/apache/cxf/jibx/PrimitiveTypesService.java
A rt/databinding/jibx/src/test/java/resources
AU rt/databinding/jibx/src/test/java/resources/types.xsd
AU rt/databinding/jibx/src/test/java/resources/binding.xml
A rt/databinding/jibx/src/test/java/resources/com
A rt/databinding/jibx/src/test/java/resources/com/sosnoski
A rt/databinding/jibx/src/test/java/resources/com/sosnoski/ws
A rt/databinding/jibx/src/test/java/resources/com/sosnoski/ws/library
A rt/databinding/jibx/src/test/java/resources/com/sosnoski/ws/library/types
A rt/databinding/jibx/src/test/java/resources/com/sosnoski/ws/library/types/JiBX_bindingFactory.class
A rt/databinding/jibx/src/test/java/resources/com/sosnoski/ws/library/types/BookInformation.class
A rt/databinding/jibx/src/test/java/resources/com/sosnoski/ws/library/types/JiBX_bindingMungeAdapter.class
A rt/databinding/jibx/src/test/java/resources/com/sosnoski/ws/library/types/TypeInformation.class
A rt/databinding/jibx/src/test/java/resources/com/sosnoski/ws/library/types/JiBX_bindingBookInformation_access.class
A rt/databinding/jibx/src/test/java/resources/com/sosnoski/ws/library/types/JiBX_bindingBookInformation_access2.class
A rt/databinding/jibx/src/test/resources
AU rt/databinding/jibx/src/test/resources/types.xsd
AU rt/databinding/jibx/src/test/resources/binding.xml
A rt/databinding/jibx/src/test/resources/com
A rt/databinding/jibx/src/test/resources/com/sosnoski
A rt/databinding/jibx/src/test/resources/com/sosnoski/ws
A rt/databinding/jibx/src/test/resources/com/sosnoski/ws/library
A rt/databinding/jibx/src/test/resources/com/sosnoski/ws/library/types
A rt/databinding/jibx/src/test/resources/com/sosnoski/ws/library/types/JiBX_bindingFactory.class
A rt/databinding/jibx/src/test/resources/com/sosnoski/ws/library/types/BookInformation.class
A rt/databinding/jibx/src/test/resources/com/sosnoski/ws/library/types/JiBX_bindingMungeAdapter.class
A rt/databinding/jibx/src/test/resources/com/sosnoski/ws/library/types/TypeInformation.class
A rt/databinding/jibx/src/test/resources/com/sosnoski/ws/library/types/JiBX_bindingBookInformation_access.class
A rt/databinding/jibx/src/test/resources/com/sosnoski/ws/library/types/JiBX_bindingBookInformation_access2.class
A rt/databinding/jibx/src/main
A rt/databinding/jibx/src/main/java
A rt/databinding/jibx/src/main/java/org
A rt/databinding/jibx/src/main/java/org/apache
A rt/databinding/jibx/src/main/java/org/apache/cxf
A rt/databinding/jibx/src/main/java/org/apache/cxf/jibx
A rt/databinding/jibx/src/main/java/org/apache/cxf/jibx/tools
AU rt/databinding/jibx/src/main/java/org/apache/cxf/jibx/tools/JibxSchemaResolver.java
AU rt/databinding/jibx/src/main/java/org/apache/cxf/jibx/tools/JibxToolingProblemHandler.java
AU rt/databinding/jibx/src/main/java/org/apache/cxf/jibx/tools/JibxSchemaHelper.java
AU rt/databinding/jibx/src/main/java/org/apache/cxf/jibx/tools/JibxToolingDataBinding.java
AU rt/databinding/jibx/src/main/java/org/apache/cxf/jibx/JibxDataBinding.java
AU rt/databinding/jibx/src/main/java/org/apache/cxf/jibx/JibxSchemaInitializer.java
AU rt/databinding/jibx/src/main/java/org/apache/cxf/jibx/JibxDataWriter.java
AU rt/databinding/jibx/src/main/java/org/apache/cxf/jibx/JibxDataReader.java
AU rt/databinding/jibx/src/main/java/org/apache/cxf/jibx/JibxNullBindingFactory.java
AU rt/databinding/jibx/src/main/java/org/apache/cxf/jibx/JibxUtil.java
AU rt/databinding/jibx/src/main/java/org/apache/cxf/jibx/JibxSimpleTypes.java
AU rt/databinding/jibx/src/main/java/org/apache/cxf/jibx/JibxWrapperHelper.java
A rt/databinding/jibx/src/main/resources
A rt/databinding/jibx/src/main/resources/META-INF
AU rt/databinding/jibx/src/main/resources/META-INF/tools-plugin.xml
AU rt/databinding/jibx/pom.xml
U rt/core/src/main/java/org/apache/cxf/endpoint/ClientImpl.java
U rt/core/src/main/java/org/apache/cxf/interceptor/transform/TransformOutInterceptor.java
U rt/ws/rm/src/main/java/org/apache/cxf/ws/rm/Destination.java
U rt/ws/rm/src/main/java/org/apache/cxf/ws/rm/RMInInterceptor.java
U rt/ws/rm/src/main/java/org/apache/cxf/ws/rm/Proxy.java
U rt/ws/rm/src/main/java/org/apache/cxf/ws/rm/soap/RMSoapInterceptor.java
U rt/ws/rm/src/main/java/org/apache/cxf/ws/rm/RMProperties.java
U rt/pom.xml
U parent/pom.xml
U tools/wsdlto/frontend/jaxws/src/main/java/org/apache/cxf/tools/wsdlto/frontend/jaxws/generators/FaultGenerator.java
U tools/wsdlto/frontend/jaxws/src/main/java/org/apache/cxf/tools/wsdlto/frontend/jaxws/template/impl.vm
U tools/wsdlto/test/src/test/java/org/apache/cxf/tools/wsdlto/jaxws/CodeGenBugTest.java
A tools/wsdlto/test/src/test/resources/wsdl2java_wsdl/cxf3353
A tools/wsdlto/test/src/test/resources/wsdl2java_wsdl/cxf3353/hello_world.wsdl
U systests/ws-specs/src/test/java/org/apache/cxf/systest/ws/rm/SequenceTest.java
At revision 1073306
Found mavenVersion 2.2.1 from file jar:file:/home/hudson/tools/maven/apache-maven-2.2.1/lib/maven-2.2.1-uber.jar!/META-INF/maven/org.apache.maven/maven-core/pom.properties
[locks-and-latches] Checking to see if we really have the locks
[locks-and-latches] Have all the locks, build can start
Parsing POMs
[trunk] $ /home/hudson/tools/java/latest1.5/bin/java -ea -XX:MaxPermSize=192m -Xmx512M -cp /home/hudson/hudson-slave/maven-agent.jar:/home/hudson/hudson-slave/classworlds.jar hudson.maven.agent.Main /home/hudson/tools/maven/apache-maven-2.2.1 /home/hudson/hudson-slave/slave.jar /home/hudson/hudson-slave/maven-interceptor.jar 39038 /home/hudson/hudson-slave/maven2.1-interceptor.jar
<===[HUDSON REMOTchannel started
ING CAPACITY]===> Executing Maven: -B -f <https://hudson.apache.org/hudson/job/CXF-Trunk-JDK15/ws/trunk/pom.xml> -Dmaven.repo.local=<https://hudson.apache.org/hudson/job/CXF-Trunk-JDK15/ws/.repository> -U -cpu -B -e clean install+ Error stacktraces are turned on.
[INFO] Scanning for projects...
[INFO] ------------------------------------------------------------------------
[ERROR] FATAL ERROR
[INFO] ------------------------------------------------------------------------
[INFO] Error building POM (may not be this project's POM).
Project ID: org.apache.cxf:cxf-rt-databinding-jibx
POM Location: <https://hudson.apache.org/hudson/job/CXF-Trunk-JDK15/ws/trunk/rt/databinding/jibx/pom.xml>
Validation Messages:
[0] 'dependencies.dependency.artifactId' with value '${stax.impl.artifactId}' does not match a valid id pattern.
[1] 'dependencies.dependency.groupId' with value '${stax.impl.groupId}' does not match a valid id pattern.
[2] 'dependencies.dependency.version' is missing for ${stax.impl.groupId}:${stax.impl.artifactId}:jar
Reason: Failed to validate POM for project org.apache.cxf:cxf-rt-databinding-jibx at <https://hudson.apache.org/hudson/job/CXF-Trunk-JDK15/ws/trunk/rt/databinding/jibx/pom.xml>
[INFO] ------------------------------------------------------------------------
[INFO] Trace
org.apache.maven.reactor.MavenExecutionException: Failed to validate POM for project org.apache.cxf:cxf-rt-databinding-jibx at <https://hudson.apache.org/hudson/job/CXF-Trunk-JDK15/ws/trunk/rt/databinding/jibx/pom.xml>
at org.apache.maven.DefaultMaven.getProjects(DefaultMaven.java:404)
at org.apache.maven.DefaultMaven.doExecute(DefaultMaven.java:272)
at org.apache.maven.DefaultMaven.execute(DefaultMaven.java:138)
at org.apache.maven.cli.MavenCli.main(MavenCli.java:362)
at sun.reflect.NativeMethodAccessorImpl.invoke0(Native Method)
at sun.reflect.NativeMethodAccessorImpl.invoke(NativeMethodAccessorImpl.java:39)
at sun.reflect.DelegatingMethodAccessorImpl.invoke(DelegatingMethodAccessorImpl.java:25)
at java.lang.reflect.Method.invoke(Method.java:592)
at org.codehaus.classworlds.Launcher.launchEnhanced(Launcher.java:315)
at org.codehaus.classworlds.Launcher.launch(Launcher.java:255)
at hudson.maven.agent.Main.launch(Main.java:173)
at hudson.maven.MavenBuilder.call(MavenBuilder.java:164)
at hudson.maven.MavenModuleSetBuild$Builder.call(MavenModuleSetBuild.java:868)
at hudson.maven.MavenModuleSetBuild$Builder.call(MavenModuleSetBuild.java:799)
at hudson.remoting.UserRequest.perform(UserRequest.java:114)
at hudson.remoting.UserRequest.perform(UserRequest.java:48)
at hudson.remoting.Request$2.run(Request.java:270)
at java.util.concurrent.Executors$RunnableAdapter.call(Executors.java:417)
at java.util.concurrent.FutureTask$Sync.innerRun(FutureTask.java:269)
at java.util.concurrent.FutureTask.run(FutureTask.java:123)
at java.util.concurrent.ThreadPoolExecutor$Worker.runTask(ThreadPoolExecutor.java:651)
at java.util.concurrent.ThreadPoolExecutor$Worker.run(ThreadPoolExecutor.java:676)
at java.lang.Thread.run(Thread.java:595)
Caused by: org.apache.maven.project.InvalidProjectModelException: Failed to validate POM for project org.apache.cxf:cxf-rt-databinding-jibx at <https://hudson.apache.org/hudson/job/CXF-Trunk-JDK15/ws/trunk/rt/databinding/jibx/pom.xml>
at org.apache.maven.project.DefaultMavenProjectBuilder.processProjectLogic(DefaultMavenProjectBuilder.java:1077)
at org.apache.maven.project.DefaultMavenProjectBuilder.buildInternal(DefaultMavenProjectBuilder.java:880)
at org.apache.maven.project.DefaultMavenProjectBuilder.buildFromSourceFileInternal(DefaultMavenProjectBuilder.java:508)
at org.apache.maven.project.DefaultMavenProjectBuilder.build(DefaultMavenProjectBuilder.java:200)
at org.apache.maven.DefaultMaven.getProject(DefaultMaven.java:604)
at org.apache.maven.DefaultMaven.collectProjects(DefaultMaven.java:487)
at org.apache.maven.DefaultMaven.collectProjects(DefaultMaven.java:560)
at org.apache.maven.DefaultMaven.collectProjects(DefaultMaven.java:560)
at org.apache.maven.DefaultMaven.getProjects(DefaultMaven.java:391)
... 22 more
[INFO] ------------------------------------------------------------------------
[INFO] Total time: 1 second
[INFO] Finished at: Tue Feb 22 04:09:49 GMT-08:00 2011
[INFO] Final Memory: 6M/18M
[INFO] ------------------------------------------------------------------------
channel stopped
[locks-and-latches] Releasing all the locks
[locks-and-latches] All the locks released
Build failed in Hudson: CXF-Trunk-JDK15 #1763
Posted by Apache Hudson Server <hu...@hudson.apache.org>.
See <https://hudson.apache.org/hudson/job/CXF-Trunk-JDK15/1763/changes>
Changes:
[dsosnoski] Eliminate need for synchronization blocks by converting to CopyOnWriteArrayList collections.
------------------------------------------
Started by an SCM change
Building remotely on ubuntu2
Updating http://svn.apache.org/repos/asf/cxf/trunk
U rt/ws/rm/src/main/java/org/apache/cxf/ws/rm/Destination.java
U rt/ws/rm/src/main/java/org/apache/cxf/ws/rm/RMInInterceptor.java
U rt/ws/rm/src/main/java/org/apache/cxf/ws/rm/soap/RMSoapInterceptor.java
U rt/ws/rm/src/main/java/org/apache/cxf/ws/rm/RMProperties.java
At revision 1073250
Found mavenVersion 2.2.1 from file jar:file:/home/hudson/tools/maven/apache-maven-2.2.1/lib/maven-2.2.1-uber.jar!/META-INF/maven/org.apache.maven/maven-core/pom.properties
[locks-and-latches] Checking to see if we really have the locks
[locks-and-latches] Have all the locks, build can start
Parsing POMs
[trunk] $ /home/hudson/tools/java/latest1.5/bin/java -ea -XX:MaxPermSize=192m -Xmx512M -cp /home/hudson/hudson-slave/maven-agent.jar:/home/hudson/hudson-slave/classworlds.jar hudson.maven.agent.Main /home/hudson/tools/maven/apache-maven-2.2.1 /home/hudson/hudson-slave/slave.jar /home/hudson/hudson-slave/maven-interceptor.jar 41621 /home/hudson/hudson-slave/maven2.1-interceptor.jar
<===[HUDSON REMOTING CAPACITY]===>channel started
Executing Maven: -B -f <https://hudson.apache.org/hudson/job/CXF-Trunk-JDK15/ws/trunk/pom.xml> -Dmaven.repo.local=<https://hudson.apache.org/hudson/job/CXF-Trunk-JDK15/ws/.repository> -U -cpu -B -e clean install+ Error stacktraces are turned on.
[INFO] Scanning for projects...
[INFO] ------------------------------------------------------------------------
[ERROR] FATAL ERROR
[INFO] ------------------------------------------------------------------------
[INFO] Error building POM (may not be this project's POM).
Project ID: org.apache.cxf:cxf-rt-databinding-jibx
POM Location: <https://hudson.apache.org/hudson/job/CXF-Trunk-JDK15/ws/trunk/rt/databinding/jibx/pom.xml>
Validation Messages:
[0] 'dependencies.dependency.artifactId' with value '${stax.impl.artifactId}' does not match a valid id pattern.
[1] 'dependencies.dependency.groupId' with value '${stax.impl.groupId}' does not match a valid id pattern.
[2] 'dependencies.dependency.version' is missing for ${stax.impl.groupId}:${stax.impl.artifactId}:jar
Reason: Failed to validate POM for project org.apache.cxf:cxf-rt-databinding-jibx at <https://hudson.apache.org/hudson/job/CXF-Trunk-JDK15/ws/trunk/rt/databinding/jibx/pom.xml>
[INFO] ------------------------------------------------------------------------
[INFO] Trace
org.apache.maven.reactor.MavenExecutionException: Failed to validate POM for project org.apache.cxf:cxf-rt-databinding-jibx at <https://hudson.apache.org/hudson/job/CXF-Trunk-JDK15/ws/trunk/rt/databinding/jibx/pom.xml>
at org.apache.maven.DefaultMaven.getProjects(DefaultMaven.java:404)
at org.apache.maven.DefaultMaven.doExecute(DefaultMaven.java:272)
at org.apache.maven.DefaultMaven.execute(DefaultMaven.java:138)
at org.apache.maven.cli.MavenCli.main(MavenCli.java:362)
at sun.reflect.NativeMethodAccessorImpl.invoke0(Native Method)
at sun.reflect.NativeMethodAccessorImpl.invoke(NativeMethodAccessorImpl.java:39)
at sun.reflect.DelegatingMethodAccessorImpl.invoke(DelegatingMethodAccessorImpl.java:25)
at java.lang.reflect.Method.invoke(Method.java:592)
at org.codehaus.classworlds.Launcher.launchEnhanced(Launcher.java:315)
at org.codehaus.classworlds.Launcher.launch(Launcher.java:255)
at hudson.maven.agent.Main.launch(Main.java:173)
at hudson.maven.MavenBuilder.call(MavenBuilder.java:164)
at hudson.maven.MavenModuleSetBuild$Builder.call(MavenModuleSetBuild.java:868)
at hudson.maven.MavenModuleSetBuild$Builder.call(MavenModuleSetBuild.java:799)
at hudson.remoting.UserRequest.perform(UserRequest.java:114)
at hudson.remoting.UserRequest.perform(UserRequest.java:48)
at hudson.remoting.Request$2.run(Request.java:270)
at java.util.concurrent.Executors$RunnableAdapter.call(Executors.java:417)
at java.util.concurrent.FutureTask$Sync.innerRun(FutureTask.java:269)
at java.util.concurrent.FutureTask.run(FutureTask.java:123)
at java.util.concurrent.ThreadPoolExecutor$Worker.runTask(ThreadPoolExecutor.java:651)
at java.util.concurrent.ThreadPoolExecutor$Worker.run(ThreadPoolExecutor.java:676)
at java.lang.Thread.run(Thread.java:595)
Caused by: org.apache.maven.project.InvalidProjectModelException: Failed to validate POM for project org.apache.cxf:cxf-rt-databinding-jibx at <https://hudson.apache.org/hudson/job/CXF-Trunk-JDK15/ws/trunk/rt/databinding/jibx/pom.xml>
at org.apache.maven.project.DefaultMavenProjectBuilder.processProjectLogic(DefaultMavenProjectBuilder.java:1077)
at org.apache.maven.project.DefaultMavenProjectBuilder.buildInternal(DefaultMavenProjectBuilder.java:880)
at org.apache.maven.project.DefaultMavenProjectBuilder.buildFromSourceFileInternal(DefaultMavenProjectBuilder.java:508)
at org.apache.maven.project.DefaultMavenProjectBuilder.build(DefaultMavenProjectBuilder.java:200)
at org.apache.maven.DefaultMaven.getProject(DefaultMaven.java:604)
at org.apache.maven.DefaultMaven.collectProjects(DefaultMaven.java:487)
at org.apache.maven.DefaultMaven.collectProjects(DefaultMaven.java:560)
at org.apache.maven.DefaultMaven.collectProjects(DefaultMaven.java:560)
at org.apache.maven.DefaultMaven.getProjects(DefaultMaven.java:391)
... 22 more
[INFO] ------------------------------------------------------------------------
[INFO] Total time: 1 second
[INFO] Finished at: Tue Feb 22 08:40:38 UTC 2011
[INFO] Final Memory: 6M/21M
[INFO] ------------------------------------------------------------------------
channel stopped
[locks-and-latches] Releasing all the locks
[locks-and-latches] All the locks released