You are viewing a plain text version of this content. The canonical link for it is here.
Posted to builds@hbase.apache.org by Apache Jenkins Server <je...@builds.apache.org> on 2017/10/29 21:42:34 UTC
Build failed in Jenkins: HBase-2.0 » JDK 1.8 (latest),Hadoop #768
See <https://builds.apache.org/job/HBase-2.0/jdk=JDK%201.8%20(latest),label=Hadoop/768/display/redirect>
------------------------------------------
[...truncated 648.36 KB...]
[INFO] Finished at: Sun Oct 29 21:41:32 UTC 2017
[INFO] Final Memory: 21M/724M
[INFO] ------------------------------------------------------------------------
[INFO] Archetype project created in <https://builds.apache.org/job/HBase-2.0/jdk=JDK%201.8%20(latest),label=Hadoop/ws/hbase-archetypes/hbase-client-project/target/build-archetype/target/generated-sources/archetype>
[INFO] ------------------------------------------------------------------------
[INFO] BUILD SUCCESS
[INFO] ------------------------------------------------------------------------
[INFO] Total time: 9.839s
[INFO] Finished at: Sun Oct 29 21:41:33 UTC 2017
[INFO] Final Memory: 21M/724M
[INFO] ------------------------------------------------------------------------
[INFO] Scanning for projects...
[INFO]
[INFO] ------------------------------------------------------------------------
[INFO] Building Apache HBase - Exemplar for hbase-shaded-client archetype 2.0.0-alpha4-SNAPSHOT
[INFO] ------------------------------------------------------------------------
[INFO]
[INFO] >>> maven-archetype-plugin:2.4:create-from-project (default-cli) @ hbase-shaded-client-project >>>
[INFO]
[INFO] <<< maven-archetype-plugin:2.4:create-from-project (default-cli) @ hbase-shaded-client-project <<<
[INFO]
[INFO] --- maven-archetype-plugin:2.4:create-from-project (default-cli) @ hbase-shaded-client-project ---
[INFO] Setting default groupId: org.apache.hbase
[INFO] Setting default artifactId: hbase-shaded-client-project
[INFO] Setting default version: 2.0.0-alpha4-SNAPSHOT
[INFO] Setting default package: org.apache.hbase.archetypes.exemplars.shaded_client
[INFO] Scanning for projects...
[INFO]
[INFO] ------------------------------------------------------------------------
[INFO] Building hbase-shaded-client-project-archetype 2.0.0-alpha4-SNAPSHOT
[INFO] ------------------------------------------------------------------------
[INFO]
[INFO] --- maven-resources-plugin:3.0.1:resources (default-resources) @ hbase-shaded-client-project-archetype ---
[WARNING] Using platform encoding (ISO-8859-1 actually) to copy filtered resources, i.e. build is platform dependent!
[INFO] Copying 6 resources
[INFO]
[INFO] --- maven-resources-plugin:3.0.1:testResources (default-testResources) @ hbase-shaded-client-project-archetype ---
[WARNING] Using platform encoding (ISO-8859-1 actually) to copy filtered resources, i.e. build is platform dependent!
[INFO] Copying 2 resources
[INFO]
[INFO] --- maven-archetype-plugin:2.4:jar (default-jar) @ hbase-shaded-client-project-archetype ---
[INFO] Building archetype jar: <https://builds.apache.org/job/HBase-2.0/jdk=JDK%201.8%20(latest),label=Hadoop/ws/hbase-archetypes/hbase-shaded-client-project/target/build-archetype/target/generated-sources/archetype/target/hbase-shaded-client-project-archetype-2.0.0-alpha4-SNAPSHOT>
[INFO] ------------------------------------------------------------------------
[INFO] BUILD SUCCESS
[INFO] ------------------------------------------------------------------------
[INFO] Total time: 4.754s
[INFO] Finished at: Sun Oct 29 21:41:49 UTC 2017
[INFO] Final Memory: 21M/724M
[INFO] ------------------------------------------------------------------------
[INFO] Archetype project created in <https://builds.apache.org/job/HBase-2.0/jdk=JDK%201.8%20(latest),label=Hadoop/ws/hbase-archetypes/hbase-shaded-client-project/target/build-archetype/target/generated-sources/archetype>
[INFO] ------------------------------------------------------------------------
[INFO] BUILD SUCCESS
[INFO] ------------------------------------------------------------------------
[INFO] Total time: 12.498s
[INFO] Finished at: Sun Oct 29 21:41:50 UTC 2017
[INFO] Final Memory: 21M/724M
[INFO] ------------------------------------------------------------------------
[INFO]
[INFO] --- maven-resources-plugin:2.7:copy-resources (hbase-client-ARCHETYPE__copy-pom-to-temp-for-xslt-processing) @ hbase-archetype-builder ---
[INFO] Using 'UTF-8' encoding to copy filtered resources.
[INFO] Copying 1 resource
[INFO]
[INFO] --- maven-resources-plugin:2.7:copy-resources (hbase-shaded-client-ARCHETYPE__copy-pom-to-temp-for-xslt-processing) @ hbase-archetype-builder ---
[INFO] Using 'UTF-8' encoding to copy filtered resources.
[INFO] Copying 1 resource
[INFO]
[INFO] --- xml-maven-plugin:1.0.1:transform (modify-archetype-pom-files-via-xslt) @ hbase-archetype-builder ---
[INFO] Transforming file: <https://builds.apache.org/job/HBase-2.0/jdk=JDK%201.8%20(latest),label=Hadoop/768/artifact/hbase-archetypes/hbase-archetype-builder/../hbase-client-project/target/temp-arch/pom.xml>
[INFO] Transformed 1 file(s).
[INFO] Transforming file: <https://builds.apache.org/job/HBase-2.0/jdk=JDK%201.8%20(latest),label=Hadoop/768/artifact/hbase-archetypes/hbase-archetype-builder/../hbase-shaded-client-project/target/temp-arch/pom.xml>
[INFO] Transformed 1 file(s).
[INFO]
[INFO] --- maven-install-plugin:2.5.2:install (default-install) @ hbase-archetype-builder ---
[INFO] Installing <https://builds.apache.org/job/HBase-2.0/jdk=JDK%201.8%20(latest),label=Hadoop/768/artifact/hbase-archetypes/hbase-archetype-builder/pom.xml> to /home/jenkins/.m2/repository/org/apache/hbase/hbase-archetype-builder/2.0.0-alpha4-SNAPSHOT/hbase-archetype-builder-2.0.0-alpha4-SNAPSHOT.pom
[INFO]
[INFO] --- exec-maven-plugin:1.6.0:exec (run-installArchetypes-script) @ hbase-archetype-builder ---
[INFO] Scanning for projects...
[INFO]
[INFO] ------------------------------------------------------------------------
[INFO] Building hbase-client-project-archetype 2.0.0-alpha4-SNAPSHOT
[INFO] ------------------------------------------------------------------------
[INFO]
[INFO] --- maven-resources-plugin:3.0.1:resources (default-resources) @ hbase-client-project-archetype ---
[INFO] Using 'UTF-8' encoding to copy filtered resources.
[INFO] Copying 6 resources
[INFO]
[INFO] --- maven-resources-plugin:3.0.1:testResources (default-testResources) @ hbase-client-project-archetype ---
[INFO] Using 'UTF-8' encoding to copy filtered resources.
[INFO] Copying 2 resources
[INFO]
[INFO] --- maven-archetype-plugin:2.4:jar (default-jar) @ hbase-client-project-archetype ---
[INFO] Building archetype jar: <https://builds.apache.org/job/HBase-2.0/jdk=JDK%201.8%20(latest),label=Hadoop/ws/hbase-archetypes/hbase-client-project/target/build-archetype/target/generated-sources/archetype/target/hbase-client-project-archetype-2.0.0-alpha4-SNAPSHOT>
[INFO]
[INFO] --- maven-archetype-plugin:2.4:integration-test (default-integration-test) @ hbase-client-project-archetype ---
[INFO] Processing Archetype IT project: basic
[INFO] ----------------------------------------------------------------------------
[INFO] Using following parameters for creating project from Archetype: hbase-client-project-archetype:2.0.0-alpha4-SNAPSHOT
[INFO] ----------------------------------------------------------------------------
[INFO] Parameter: groupId, Value: archetype.it
[INFO] Parameter: artifactId, Value: basic
[INFO] Parameter: version, Value: 0.1-SNAPSHOT
[INFO] Parameter: package, Value: it.pkg
[INFO] Parameter: packageInPathFormat, Value: it/pkg
[INFO] Parameter: version, Value: 0.1-SNAPSHOT
[INFO] Parameter: package, Value: it.pkg
[INFO] Parameter: groupId, Value: archetype.it
[INFO] Parameter: artifactId, Value: basic
[INFO] project created from Archetype in dir: <https://builds.apache.org/job/HBase-2.0/jdk=JDK%201.8%20(latest),label=Hadoop/ws/hbase-archetypes/hbase-client-project/target/build-archetype/target/generated-sources/archetype/target/test-classes/projects/basic/project/basic>
[INFO]
[INFO] --- maven-install-plugin:2.5.2:install (default-install) @ hbase-client-project-archetype ---
[INFO] Installing <https://builds.apache.org/job/HBase-2.0/jdk=JDK%201.8%20(latest),label=Hadoop/ws/hbase-archetypes/hbase-client-project/target/build-archetype/target/generated-sources/archetype/target/hbase-client-project-archetype-2.0.0-alpha4-SNAPSHOT.jar> to /home/jenkins/.m2/repository/org/apache/hbase/hbase-client-project-archetype/2.0.0-alpha4-SNAPSHOT/hbase-client-project-archetype-2.0.0-alpha4-SNAPSHOT.jar
[INFO] Installing <https://builds.apache.org/job/HBase-2.0/jdk=JDK%201.8%20(latest),label=Hadoop/768/artifact/hbase-archetypes/hbase-client-project/target/build-archetype/target/generated-sources/archetype/pom.xml> to /home/jenkins/.m2/repository/org/apache/hbase/hbase-client-project-archetype/2.0.0-alpha4-SNAPSHOT/hbase-client-project-archetype-2.0.0-alpha4-SNAPSHOT.pom
[INFO]
[INFO] --- maven-archetype-plugin:2.4:update-local-catalog (default-update-local-catalog) @ hbase-client-project-archetype ---
[INFO] ------------------------------------------------------------------------
[INFO] BUILD SUCCESS
[INFO] ------------------------------------------------------------------------
[INFO] Total time: 4.151s
[INFO] Finished at: Sun Oct 29 21:41:58 UTC 2017
[INFO] Final Memory: 21M/724M
[INFO] ------------------------------------------------------------------------
[INFO] Scanning for projects...
[INFO]
[INFO] ------------------------------------------------------------------------
[INFO] Building hbase-shaded-client-project-archetype 2.0.0-alpha4-SNAPSHOT
[INFO] ------------------------------------------------------------------------
[INFO]
[INFO] --- maven-resources-plugin:3.0.1:resources (default-resources) @ hbase-shaded-client-project-archetype ---
[INFO] Using 'UTF-8' encoding to copy filtered resources.
[INFO] Copying 6 resources
[INFO]
[INFO] --- maven-resources-plugin:3.0.1:testResources (default-testResources) @ hbase-shaded-client-project-archetype ---
[INFO] Using 'UTF-8' encoding to copy filtered resources.
[INFO] Copying 2 resources
[INFO]
[INFO] --- maven-archetype-plugin:2.4:jar (default-jar) @ hbase-shaded-client-project-archetype ---
[INFO] Building archetype jar: <https://builds.apache.org/job/HBase-2.0/jdk=JDK%201.8%20(latest),label=Hadoop/ws/hbase-archetypes/hbase-shaded-client-project/target/build-archetype/target/generated-sources/archetype/target/hbase-shaded-client-project-archetype-2.0.0-alpha4-SNAPSHOT>
[INFO]
[INFO] --- maven-archetype-plugin:2.4:integration-test (default-integration-test) @ hbase-shaded-client-project-archetype ---
[INFO] Processing Archetype IT project: basic
[INFO] ----------------------------------------------------------------------------
[INFO] Using following parameters for creating project from Archetype: hbase-shaded-client-project-archetype:2.0.0-alpha4-SNAPSHOT
[INFO] ----------------------------------------------------------------------------
[INFO] Parameter: groupId, Value: archetype.it
[INFO] Parameter: artifactId, Value: basic
[INFO] Parameter: version, Value: 0.1-SNAPSHOT
[INFO] Parameter: package, Value: it.pkg
[INFO] Parameter: packageInPathFormat, Value: it/pkg
[INFO] Parameter: version, Value: 0.1-SNAPSHOT
[INFO] Parameter: package, Value: it.pkg
[INFO] Parameter: groupId, Value: archetype.it
[INFO] Parameter: artifactId, Value: basic
[INFO] project created from Archetype in dir: <https://builds.apache.org/job/HBase-2.0/jdk=JDK%201.8%20(latest),label=Hadoop/ws/hbase-archetypes/hbase-shaded-client-project/target/build-archetype/target/generated-sources/archetype/target/test-classes/projects/basic/project/basic>
[INFO]
[INFO] --- maven-install-plugin:2.5.2:install (default-install) @ hbase-shaded-client-project-archetype ---
[INFO] Installing <https://builds.apache.org/job/HBase-2.0/jdk=JDK%201.8%20(latest),label=Hadoop/ws/hbase-archetypes/hbase-shaded-client-project/target/build-archetype/target/generated-sources/archetype/target/hbase-shaded-client-project-archetype-2.0.0-alpha4-SNAPSHOT.jar> to /home/jenkins/.m2/repository/org/apache/hbase/hbase-shaded-client-project-archetype/2.0.0-alpha4-SNAPSHOT/hbase-shaded-client-project-archetype-2.0.0-alpha4-SNAPSHOT.jar
[INFO] Installing <https://builds.apache.org/job/HBase-2.0/jdk=JDK%201.8%20(latest),label=Hadoop/768/artifact/hbase-archetypes/hbase-shaded-client-project/target/build-archetype/target/generated-sources/archetype/pom.xml> to /home/jenkins/.m2/repository/org/apache/hbase/hbase-shaded-client-project-archetype/2.0.0-alpha4-SNAPSHOT/hbase-shaded-client-project-archetype-2.0.0-alpha4-SNAPSHOT.pom
[INFO]
[INFO] --- maven-archetype-plugin:2.4:update-local-catalog (default-update-local-catalog) @ hbase-shaded-client-project-archetype ---
[INFO] ------------------------------------------------------------------------
[INFO] BUILD SUCCESS
[INFO] ------------------------------------------------------------------------
[INFO] Total time: 4.962s
[INFO] Finished at: Sun Oct 29 21:42:07 UTC 2017
[INFO] Final Memory: 21M/724M
[INFO] ------------------------------------------------------------------------
[INFO] ------------------------------------------------------------------------
[INFO] Reactor Summary:
[INFO]
[INFO] Apache HBase ...................................... SUCCESS [5.960s]
[INFO] Apache HBase - Checkstyle ......................... SUCCESS [3.355s]
[INFO] Apache HBase - Annotations ........................ SUCCESS [1.631s]
[INFO] Apache HBase - Build Configuration ................ SUCCESS [0.206s]
[INFO] Apache HBase - Shaded Protocol .................... SUCCESS [49.394s]
[INFO] Apache HBase - Common ............................. FAILURE [3:54.582s]
[INFO] Apache HBase - Metrics API ........................ SKIPPED
[INFO] Apache HBase - Hadoop Compatibility ............... SKIPPED
[INFO] Apache HBase - Metrics Implementation ............. SKIPPED
[INFO] Apache HBase - Hadoop Two Compatibility ........... SKIPPED
[INFO] Apache HBase - Protocol ........................... SUCCESS [2.673s]
[INFO] Apache HBase - Client ............................. SKIPPED
[INFO] Apache HBase - Replication ........................ SKIPPED
[INFO] Apache HBase - Prefix Tree ........................ SKIPPED
[INFO] Apache HBase - Resource Bundle .................... SUCCESS [1.324s]
[INFO] Apache HBase - HTTP ............................... SKIPPED
[INFO] Apache HBase - Procedure .......................... SKIPPED
[INFO] Apache HBase - Server ............................. SKIPPED
[INFO] Apache HBase - MapReduce .......................... SKIPPED
[INFO] Apache HBase - Testing Util ....................... SKIPPED
[INFO] Apache HBase - Thrift ............................. SKIPPED
[INFO] Apache HBase - RSGroup ............................ SKIPPED
[INFO] Apache HBase - Shell .............................. SKIPPED
[INFO] Apache HBase - Coprocessor Endpoint ............... SKIPPED
[INFO] Apache HBase - Backup ............................. SKIPPED
[INFO] Apache HBase - Integration Tests .................. SKIPPED
[INFO] Apache HBase - Examples ........................... SKIPPED
[INFO] Apache HBase - Rest ............................... SKIPPED
[INFO] Apache HBase - External Block Cache ............... SKIPPED
[INFO] Apache HBase - Spark .............................. SKIPPED
[INFO] Apache HBase - Spark Integration Tests ............ SKIPPED
[INFO] Apache HBase - Assembly ........................... SKIPPED
[INFO] Apache HBase - Shaded ............................. SUCCESS [0.737s]
[INFO] Apache HBase - Shaded - Client .................... SKIPPED
[INFO] Apache HBase - Shaded - MapReduce ................. SKIPPED
[INFO] Apache HBase Shaded Packaging Invariants .......... SKIPPED
[INFO] Apache HBase - Archetypes ......................... SUCCESS [0.157s]
[INFO] Apache HBase - Exemplar for hbase-client archetype SKIPPED
[INFO] Apache HBase - Exemplar for hbase-shaded-client archetype SKIPPED
[INFO] Apache HBase - Archetype builder .................. SUCCESS [49.403s]
[INFO] ------------------------------------------------------------------------
[INFO] BUILD FAILURE
[INFO] ------------------------------------------------------------------------
[INFO] Total time: 5:54.220s
[INFO] Finished at: Sun Oct 29 21:42:08 UTC 2017
[INFO] Final Memory: 101M/4071M
[INFO] ------------------------------------------------------------------------
[ERROR] Failed to execute goal org.apache.maven.plugins:maven-surefire-plugin:2.20.1:test (default-test) on project hbase-common: There are test failures.
[ERROR]
[ERROR] Please refer to <https://builds.apache.org/job/HBase-2.0/jdk=JDK%201.8%20(latest),label=Hadoop/ws/hbase-common/target/surefire-reports> for the individual test results.
[ERROR] Please refer to dump files (if any exist) [date]-jvmRun[N].dump, [date].dumpstream and [date]-jvmRun[N].dumpstream.
[ERROR] -> [Help 1]
[ERROR]
[ERROR] To see the full stack trace of the errors, re-run Maven with the -e switch.
[ERROR] Re-run Maven using the -X switch to enable full debug logging.
[ERROR]
[ERROR] For more information about the errors and possible solutions, please read the following articles:
[ERROR] [Help 1] http://cwiki.apache.org/confluence/display/MAVEN/MojoFailureException
[ERROR]
[ERROR] After correcting the problems, you can resume the build with the command
[ERROR] mvn <goals> -rf :hbase-common
Build step 'Invoke top-level Maven targets' marked build as failure
Performing Post build task...
Match found for :.* : True
Logical operation result is TRUE
Running script : # Run zombie detector script
./dev-support/zombie-detector.sh --jenkins ${BUILD_ID}
[a3159d73] $ /bin/bash -xe /tmp/jenkins1620663354763162236.sh
+ ./dev-support/zombie-detector.sh --jenkins 768
Sun Oct 29 21:42:11 UTC 2017 We're ok: there is no zombie test
{color:green}+1 zombies{color}. No zombie tests found running at the end of the build.
POST BUILD TASK : SUCCESS
END OF POST BUILD TASK : 0
Archiving artifacts
[Fast Archiver] Compressed 5.84 MB of artifacts by 41.7% relative to #767
Recording test results
[FINDBUGS] Skipping publisher since build result is FAILURE
[CHECKSTYLE] Skipping publisher since build result is FAILURE
Build failed in Jenkins: HBase-2.0 » JDK 1.8 (latest),Hadoop #769
Posted by Apache Jenkins Server <je...@builds.apache.org>.
See <https://builds.apache.org/job/HBase-2.0/jdk=JDK%201.8%20(latest),label=Hadoop/769/display/redirect>
------------------------------------------
[...truncated 1.51 MB...]
[INFO] ------------------------------------------------------------------------
[INFO] Total time: 1.223s
[INFO] Finished at: Mon Oct 30 00:31:37 UTC 2017
[INFO] Final Memory: 21M/724M
[INFO] ------------------------------------------------------------------------
[INFO] Archetype project created in <https://builds.apache.org/job/HBase-2.0/jdk=JDK%201.8%20(latest),label=Hadoop/ws/hbase-archetypes/hbase-shaded-client-project/target/build-archetype/target/generated-sources/archetype>
[INFO] ------------------------------------------------------------------------
[INFO] BUILD SUCCESS
[INFO] ------------------------------------------------------------------------
[INFO] Total time: 3.651s
[INFO] Finished at: Mon Oct 30 00:31:37 UTC 2017
[INFO] Final Memory: 21M/724M
[INFO] ------------------------------------------------------------------------
[INFO]
[INFO] --- maven-resources-plugin:2.7:copy-resources (hbase-client-ARCHETYPE__copy-pom-to-temp-for-xslt-processing) @ hbase-archetype-builder ---
[INFO] Using 'UTF-8' encoding to copy filtered resources.
[INFO] Copying 1 resource
[INFO]
[INFO] --- maven-resources-plugin:2.7:copy-resources (hbase-shaded-client-ARCHETYPE__copy-pom-to-temp-for-xslt-processing) @ hbase-archetype-builder ---
[INFO] Using 'UTF-8' encoding to copy filtered resources.
[INFO] Copying 1 resource
[INFO]
[INFO] --- xml-maven-plugin:1.0.1:transform (modify-archetype-pom-files-via-xslt) @ hbase-archetype-builder ---
[INFO] Transforming file: <https://builds.apache.org/job/HBase-2.0/jdk=JDK%201.8%20(latest),label=Hadoop/769/artifact/hbase-archetypes/hbase-archetype-builder/../hbase-client-project/target/temp-arch/pom.xml>
[INFO] Transformed 1 file(s).
[INFO] Transforming file: <https://builds.apache.org/job/HBase-2.0/jdk=JDK%201.8%20(latest),label=Hadoop/769/artifact/hbase-archetypes/hbase-archetype-builder/../hbase-shaded-client-project/target/temp-arch/pom.xml>
[INFO] Transformed 1 file(s).
[INFO]
[INFO] --- maven-checkstyle-plugin:2.17:checkstyle (default-cli) @ hbase-archetype-builder ---
[INFO] ------------------------------------------------------------------------
[INFO] Reactor Summary:
[INFO]
[INFO] Apache HBase ...................................... SUCCESS [4.070s]
[INFO] Apache HBase - Checkstyle ......................... SUCCESS [1.144s]
[INFO] Apache HBase - Annotations ........................ SUCCESS [1.369s]
[INFO] Apache HBase - Build Configuration ................ SUCCESS [0.372s]
[INFO] Apache HBase - Shaded Protocol .................... SUCCESS [3:13.445s]
[INFO] Apache HBase - Common ............................. SUCCESS [15.234s]
[INFO] Apache HBase - Metrics API ........................ SUCCESS [1.130s]
[INFO] Apache HBase - Hadoop Compatibility ............... SUCCESS [1.409s]
[INFO] Apache HBase - Metrics Implementation ............. SUCCESS [1.079s]
[INFO] Apache HBase - Hadoop Two Compatibility ........... SUCCESS [1.930s]
[INFO] Apache HBase - Protocol ........................... SUCCESS [1:20.724s]
[INFO] Apache HBase - Client ............................. SUCCESS [18.170s]
[INFO] Apache HBase - Replication ........................ SUCCESS [1.538s]
[INFO] Apache HBase - Prefix Tree ........................ SUCCESS [2.272s]
[INFO] Apache HBase - Resource Bundle .................... SUCCESS [0.415s]
[INFO] Apache HBase - HTTP ............................... SUCCESS [3.196s]
[INFO] Apache HBase - Procedure .......................... SUCCESS [3.366s]
[INFO] Apache HBase - Server ............................. SUCCESS [1:04.356s]
[INFO] Apache HBase - MapReduce .......................... SUCCESS [7.217s]
[INFO] Apache HBase - Testing Util ....................... SUCCESS [3.096s]
[INFO] Apache HBase - Thrift ............................. SUCCESS [19.789s]
[INFO] Apache HBase - RSGroup ............................ SUCCESS [6.827s]
[INFO] Apache HBase - Shell .............................. SUCCESS [3.441s]
[INFO] Apache HBase - Coprocessor Endpoint ............... SUCCESS [9.965s]
[INFO] Apache HBase - Backup ............................. SUCCESS [4.437s]
[INFO] Apache HBase - Integration Tests .................. SUCCESS [12.693s]
[INFO] Apache HBase - Examples ........................... SUCCESS [5.311s]
[INFO] Apache HBase - Rest ............................... SUCCESS [13.581s]
[INFO] Apache HBase - External Block Cache ............... SUCCESS [1.989s]
[INFO] Apache HBase - Spark .............................. SUCCESS [5.208s]
[INFO] Apache HBase - Spark Integration Tests ............ SUCCESS [3.174s]
[INFO] Apache HBase - Assembly ........................... SUCCESS [5.218s]
[INFO] Apache HBase - Shaded ............................. SUCCESS [0.408s]
[INFO] Apache HBase - Shaded - Client .................... SUCCESS [1.285s]
[INFO] Apache HBase - Shaded - MapReduce ................. SUCCESS [2.136s]
[INFO] Apache HBase Shaded Packaging Invariants .......... SUCCESS [1.874s]
[INFO] Apache HBase - Archetypes ......................... SUCCESS [0.275s]
[INFO] Apache HBase - Exemplar for hbase-client archetype SUCCESS [3.004s]
[INFO] Apache HBase - Exemplar for hbase-shaded-client archetype SUCCESS [3.034s]
[INFO] Apache HBase - Archetype builder .................. SUCCESS [10.511s]
[INFO] ------------------------------------------------------------------------
[INFO] BUILD SUCCESS
[INFO] ------------------------------------------------------------------------
[INFO] Total time: 8:41.196s
[INFO] Finished at: Mon Oct 30 00:31:38 UTC 2017
[INFO] Final Memory: 244M/4730M
[INFO] ------------------------------------------------------------------------
Performing Post build task...
Match found for :.* : True
Logical operation result is TRUE
Running script : # Run zombie detector script
./dev-support/zombie-detector.sh --jenkins ${BUILD_ID}
[a3159d73] $ /bin/bash -xe /tmp/jenkins4182986841031167020.sh
+ ./dev-support/zombie-detector.sh --jenkins 769
Mon Oct 30 00:31:40 UTC 2017 We're ok: there is no zombie test
{color:green}+1 zombies{color}. No zombie tests found running at the end of the build.
POST BUILD TASK : SUCCESS
END OF POST BUILD TASK : 0
Archiving artifacts
Recording test results
[FINDBUGS] Collecting findbugs analysis files...
[FINDBUGS] Searching for all files in <https://builds.apache.org/job/HBase-2.0/jdk=JDK%201.8%20(latest),label=Hadoop/ws/> that match the pattern **/findbugs.xml,**/findbugsXml.xml
[FINDBUGS] Parsing 48 files in <https://builds.apache.org/job/HBase-2.0/jdk=JDK%201.8%20(latest),label=Hadoop/ws/>
[FINDBUGS] Successfully parsed file <https://builds.apache.org/job/HBase-2.0/jdk=JDK%201.8%20(latest),label=Hadoop/769/artifact/hbase-archetypes/hbase-client-project/target/findbugs.xml> with 0 unique warnings and 0 duplicates.
[FINDBUGS] Successfully parsed file <https://builds.apache.org/job/HBase-2.0/jdk=JDK%201.8%20(latest),label=Hadoop/769/artifact/hbase-archetypes/hbase-client-project/target/findbugsXml.xml> with 0 unique warnings and 0 duplicates.
[FINDBUGS] Successfully parsed file <https://builds.apache.org/job/HBase-2.0/jdk=JDK%201.8%20(latest),label=Hadoop/769/artifact/hbase-archetypes/hbase-shaded-client-project/target/findbugs.xml> with 0 unique warnings and 0 duplicates.
[FINDBUGS] Successfully parsed file <https://builds.apache.org/job/HBase-2.0/jdk=JDK%201.8%20(latest),label=Hadoop/769/artifact/hbase-archetypes/hbase-shaded-client-project/target/findbugsXml.xml> with 0 unique warnings and 0 duplicates.
[FINDBUGS] Successfully parsed file <https://builds.apache.org/job/HBase-2.0/jdk=JDK%201.8%20(latest),label=Hadoop/769/artifact/hbase-backup/target/findbugs.xml> with 0 unique warnings and 0 duplicates.
[FINDBUGS] Successfully parsed file <https://builds.apache.org/job/HBase-2.0/jdk=JDK%201.8%20(latest),label=Hadoop/769/artifact/hbase-backup/target/findbugsXml.xml> with 0 unique warnings and 0 duplicates.
[FINDBUGS] Successfully parsed file <https://builds.apache.org/job/HBase-2.0/jdk=JDK%201.8%20(latest),label=Hadoop/769/artifact/hbase-client/target/findbugs.xml> with 0 unique warnings and 0 duplicates.
[FINDBUGS] Successfully parsed file <https://builds.apache.org/job/HBase-2.0/jdk=JDK%201.8%20(latest),label=Hadoop/769/artifact/hbase-client/target/findbugsXml.xml> with 0 unique warnings and 0 duplicates.
[FINDBUGS] Successfully parsed file <https://builds.apache.org/job/HBase-2.0/jdk=JDK%201.8%20(latest),label=Hadoop/769/artifact/hbase-common/target/findbugs.xml> with 0 unique warnings and 0 duplicates.
[FINDBUGS] Successfully parsed file <https://builds.apache.org/job/HBase-2.0/jdk=JDK%201.8%20(latest),label=Hadoop/769/artifact/hbase-common/target/findbugsXml.xml> with 0 unique warnings and 0 duplicates.
[FINDBUGS] Successfully parsed file <https://builds.apache.org/job/HBase-2.0/jdk=JDK%201.8%20(latest),label=Hadoop/769/artifact/hbase-endpoint/target/findbugs.xml> with 0 unique warnings and 0 duplicates.
[FINDBUGS] Successfully parsed file <https://builds.apache.org/job/HBase-2.0/jdk=JDK%201.8%20(latest),label=Hadoop/769/artifact/hbase-endpoint/target/findbugsXml.xml> with 0 unique warnings and 0 duplicates.
[FINDBUGS] Successfully parsed file <https://builds.apache.org/job/HBase-2.0/jdk=JDK%201.8%20(latest),label=Hadoop/769/artifact/hbase-examples/target/findbugs.xml> with 0 unique warnings and 0 duplicates.
[FINDBUGS] Successfully parsed file <https://builds.apache.org/job/HBase-2.0/jdk=JDK%201.8%20(latest),label=Hadoop/769/artifact/hbase-examples/target/findbugsXml.xml> with 0 unique warnings and 0 duplicates.
[FINDBUGS] Successfully parsed file <https://builds.apache.org/job/HBase-2.0/jdk=JDK%201.8%20(latest),label=Hadoop/769/artifact/hbase-external-blockcache/target/findbugs.xml> with 0 unique warnings and 0 duplicates.
[FINDBUGS] Successfully parsed file <https://builds.apache.org/job/HBase-2.0/jdk=JDK%201.8%20(latest),label=Hadoop/769/artifact/hbase-external-blockcache/target/findbugsXml.xml> with 0 unique warnings and 0 duplicates.
[FINDBUGS] Successfully parsed file <https://builds.apache.org/job/HBase-2.0/jdk=JDK%201.8%20(latest),label=Hadoop/769/artifact/hbase-hadoop-compat/target/findbugs.xml> with 0 unique warnings and 0 duplicates.
[FINDBUGS] Successfully parsed file <https://builds.apache.org/job/HBase-2.0/jdk=JDK%201.8%20(latest),label=Hadoop/769/artifact/hbase-hadoop-compat/target/findbugsXml.xml> with 0 unique warnings and 0 duplicates.
[FINDBUGS] Successfully parsed file <https://builds.apache.org/job/HBase-2.0/jdk=JDK%201.8%20(latest),label=Hadoop/769/artifact/hbase-hadoop2-compat/target/findbugs.xml> with 0 unique warnings and 0 duplicates.
[FINDBUGS] Successfully parsed file <https://builds.apache.org/job/HBase-2.0/jdk=JDK%201.8%20(latest),label=Hadoop/769/artifact/hbase-hadoop2-compat/target/findbugsXml.xml> with 0 unique warnings and 0 duplicates.
[FINDBUGS] Successfully parsed file <https://builds.apache.org/job/HBase-2.0/jdk=JDK%201.8%20(latest),label=Hadoop/769/artifact/hbase-http/target/findbugs.xml> with 0 unique warnings and 0 duplicates.
[FINDBUGS] Successfully parsed file <https://builds.apache.org/job/HBase-2.0/jdk=JDK%201.8%20(latest),label=Hadoop/769/artifact/hbase-http/target/findbugsXml.xml> with 0 unique warnings and 0 duplicates.
[FINDBUGS] Successfully parsed file <https://builds.apache.org/job/HBase-2.0/jdk=JDK%201.8%20(latest),label=Hadoop/769/artifact/hbase-mapreduce/target/findbugs.xml> with 0 unique warnings and 0 duplicates.
[FINDBUGS] Successfully parsed file <https://builds.apache.org/job/HBase-2.0/jdk=JDK%201.8%20(latest),label=Hadoop/769/artifact/hbase-mapreduce/target/findbugsXml.xml> with 0 unique warnings and 0 duplicates.
[FINDBUGS] Successfully parsed file <https://builds.apache.org/job/HBase-2.0/jdk=JDK%201.8%20(latest),label=Hadoop/769/artifact/hbase-metrics-api/target/findbugs.xml> with 0 unique warnings and 0 duplicates.
[FINDBUGS] Successfully parsed file <https://builds.apache.org/job/HBase-2.0/jdk=JDK%201.8%20(latest),label=Hadoop/769/artifact/hbase-metrics-api/target/findbugsXml.xml> with 0 unique warnings and 0 duplicates.
[FINDBUGS] Successfully parsed file <https://builds.apache.org/job/HBase-2.0/jdk=JDK%201.8%20(latest),label=Hadoop/769/artifact/hbase-metrics/target/findbugs.xml> with 0 unique warnings and 0 duplicates.
[FINDBUGS] Successfully parsed file <https://builds.apache.org/job/HBase-2.0/jdk=JDK%201.8%20(latest),label=Hadoop/769/artifact/hbase-metrics/target/findbugsXml.xml> with 0 unique warnings and 0 duplicates.
[FINDBUGS] Successfully parsed file <https://builds.apache.org/job/HBase-2.0/jdk=JDK%201.8%20(latest),label=Hadoop/769/artifact/hbase-prefix-tree/target/findbugs.xml> with 0 unique warnings and 0 duplicates.
[FINDBUGS] Successfully parsed file <https://builds.apache.org/job/HBase-2.0/jdk=JDK%201.8%20(latest),label=Hadoop/769/artifact/hbase-prefix-tree/target/findbugsXml.xml> with 0 unique warnings and 0 duplicates.
[FINDBUGS] Successfully parsed file <https://builds.apache.org/job/HBase-2.0/jdk=JDK%201.8%20(latest),label=Hadoop/769/artifact/hbase-procedure/target/findbugs.xml> with 0 unique warnings and 0 duplicates.
[FINDBUGS] Successfully parsed file <https://builds.apache.org/job/HBase-2.0/jdk=JDK%201.8%20(latest),label=Hadoop/769/artifact/hbase-procedure/target/findbugsXml.xml> with 0 unique warnings and 0 duplicates.
[FINDBUGS] Successfully parsed file <https://builds.apache.org/job/HBase-2.0/jdk=JDK%201.8%20(latest),label=Hadoop/769/artifact/hbase-protocol-shaded/target/findbugs.xml> with 0 unique warnings and 0 duplicates.
[FINDBUGS] Successfully parsed file <https://builds.apache.org/job/HBase-2.0/jdk=JDK%201.8%20(latest),label=Hadoop/769/artifact/hbase-protocol-shaded/target/findbugsXml.xml> with 0 unique warnings and 0 duplicates.
[FINDBUGS] Successfully parsed file <https://builds.apache.org/job/HBase-2.0/jdk=JDK%201.8%20(latest),label=Hadoop/769/artifact/hbase-protocol/target/findbugs.xml> with 0 unique warnings and 0 duplicates.
[FINDBUGS] Successfully parsed file <https://builds.apache.org/job/HBase-2.0/jdk=JDK%201.8%20(latest),label=Hadoop/769/artifact/hbase-protocol/target/findbugsXml.xml> with 0 unique warnings and 0 duplicates.
[FINDBUGS] Successfully parsed file <https://builds.apache.org/job/HBase-2.0/jdk=JDK%201.8%20(latest),label=Hadoop/769/artifact/hbase-replication/target/findbugs.xml> with 0 unique warnings and 0 duplicates.
[FINDBUGS] Successfully parsed file <https://builds.apache.org/job/HBase-2.0/jdk=JDK%201.8%20(latest),label=Hadoop/769/artifact/hbase-replication/target/findbugsXml.xml> with 0 unique warnings and 0 duplicates.
[FINDBUGS] Successfully parsed file <https://builds.apache.org/job/HBase-2.0/jdk=JDK%201.8%20(latest),label=Hadoop/769/artifact/hbase-rest/target/findbugs.xml> with 0 unique warnings and 0 duplicates.
[FINDBUGS] Successfully parsed file <https://builds.apache.org/job/HBase-2.0/jdk=JDK%201.8%20(latest),label=Hadoop/769/artifact/hbase-rest/target/findbugsXml.xml> with 0 unique warnings and 0 duplicates.
[FINDBUGS] Successfully parsed file <https://builds.apache.org/job/HBase-2.0/jdk=JDK%201.8%20(latest),label=Hadoop/769/artifact/hbase-rsgroup/target/findbugs.xml> with 0 unique warnings and 0 duplicates.
[FINDBUGS] Successfully parsed file <https://builds.apache.org/job/HBase-2.0/jdk=JDK%201.8%20(latest),label=Hadoop/769/artifact/hbase-rsgroup/target/findbugsXml.xml> with 0 unique warnings and 0 duplicates.
[FINDBUGS] Successfully parsed file <https://builds.apache.org/job/HBase-2.0/jdk=JDK%201.8%20(latest),label=Hadoop/769/artifact/hbase-server/target/findbugs.xml> with 0 unique warnings and 0 duplicates.
[FINDBUGS] Successfully parsed file <https://builds.apache.org/job/HBase-2.0/jdk=JDK%201.8%20(latest),label=Hadoop/769/artifact/hbase-server/target/findbugsXml.xml> with 0 unique warnings and 0 duplicates.
[FINDBUGS] Successfully parsed file <https://builds.apache.org/job/HBase-2.0/jdk=JDK%201.8%20(latest),label=Hadoop/769/artifact/hbase-spark/target/findbugs.xml> with 0 unique warnings and 0 duplicates.
[FINDBUGS] Successfully parsed file <https://builds.apache.org/job/HBase-2.0/jdk=JDK%201.8%20(latest),label=Hadoop/769/artifact/hbase-spark/target/findbugsXml.xml> with 0 unique warnings and 0 duplicates.
[FINDBUGS] Successfully parsed file <https://builds.apache.org/job/HBase-2.0/jdk=JDK%201.8%20(latest),label=Hadoop/769/artifact/hbase-thrift/target/findbugs.xml> with 0 unique warnings and 0 duplicates.
[FINDBUGS] Successfully parsed file <https://builds.apache.org/job/HBase-2.0/jdk=JDK%201.8%20(latest),label=Hadoop/769/artifact/hbase-thrift/target/findbugsXml.xml> with 0 unique warnings and 0 duplicates.
<Git Blamer> Using GitBlamer to create author and commit information for all warnings.
<Git Blamer> GIT_COMMIT=15388d4e169f28eed432b94bf9228e72c6bf920d, workspace=<https://builds.apache.org/job/HBase-2.0/jdk=JDK%201.8%20(latest),label=Hadoop/ws/>
[FINDBUGS] Computing warning deltas based on reference build #767
[CHECKSTYLE] Collecting checkstyle analysis files...
[CHECKSTYLE] Searching for all files in <https://builds.apache.org/job/HBase-2.0/jdk=JDK%201.8%20(latest),label=Hadoop/ws/> that match the pattern **/checkstyle-result.xml
[CHECKSTYLE] Parsing 40 files in <https://builds.apache.org/job/HBase-2.0/jdk=JDK%201.8%20(latest),label=Hadoop/ws/>
[CHECKSTYLE] Successfully parsed file <https://builds.apache.org/job/HBase-2.0/jdk=JDK%201.8%20(latest),label=Hadoop/769/artifact/hbase-annotations/target/checkstyle-result.xml> with 1 unique warning and 0 duplicates.
[CHECKSTYLE] Successfully parsed file <https://builds.apache.org/job/HBase-2.0/jdk=JDK%201.8%20(latest),label=Hadoop/769/artifact/hbase-archetypes/hbase-archetype-builder/target/checkstyle-result.xml> with 1 unique warning and 0 duplicates.
[CHECKSTYLE] Successfully parsed file <https://builds.apache.org/job/HBase-2.0/jdk=JDK%201.8%20(latest),label=Hadoop/769/artifact/hbase-archetypes/hbase-client-project/target/checkstyle-result.xml> with 10 unique warnings and 0 duplicates.
[CHECKSTYLE] Successfully parsed file <https://builds.apache.org/job/HBase-2.0/jdk=JDK%201.8%20(latest),label=Hadoop/769/artifact/hbase-archetypes/hbase-shaded-client-project/target/checkstyle-result.xml> with 19 unique warnings and 0 duplicates.
[CHECKSTYLE] Successfully parsed file <https://builds.apache.org/job/HBase-2.0/jdk=JDK%201.8%20(latest),label=Hadoop/769/artifact/hbase-archetypes/target/checkstyle-result.xml> with 19 unique warnings and 0 duplicates.
[CHECKSTYLE] Successfully parsed file <https://builds.apache.org/job/HBase-2.0/jdk=JDK%201.8%20(latest),label=Hadoop/769/artifact/hbase-assembly/target/checkstyle-result.xml> with 19 unique warnings and 0 duplicates.
[CHECKSTYLE] Successfully parsed file <https://builds.apache.org/job/HBase-2.0/jdk=JDK%201.8%20(latest),label=Hadoop/769/artifact/hbase-backup/target/checkstyle-result.xml> with 296 unique warnings and 0 duplicates.
[CHECKSTYLE] Successfully parsed file <https://builds.apache.org/job/HBase-2.0/jdk=JDK%201.8%20(latest),label=Hadoop/769/artifact/hbase-build-configuration/target/checkstyle-result.xml> with 296 unique warnings and 0 duplicates.
[CHECKSTYLE] Successfully parsed file <https://builds.apache.org/job/HBase-2.0/jdk=JDK%201.8%20(latest),label=Hadoop/769/artifact/hbase-checkstyle/target/checkstyle-result.xml> with 296 unique warnings and 0 duplicates.
[CHECKSTYLE] Successfully parsed file <https://builds.apache.org/job/HBase-2.0/jdk=JDK%201.8%20(latest),label=Hadoop/769/artifact/hbase-client/target/checkstyle-result.xml> with 4158 unique warnings and 0 duplicates.
[CHECKSTYLE] Successfully parsed file <https://builds.apache.org/job/HBase-2.0/jdk=JDK%201.8%20(latest),label=Hadoop/769/artifact/hbase-common/target/checkstyle-result.xml> with 6031 unique warnings and 0 duplicates.
[CHECKSTYLE] Successfully parsed file <https://builds.apache.org/job/HBase-2.0/jdk=JDK%201.8%20(latest),label=Hadoop/769/artifact/hbase-endpoint/target/checkstyle-result.xml> with 6263 unique warnings and 0 duplicates.
[CHECKSTYLE] Successfully parsed file <https://builds.apache.org/job/HBase-2.0/jdk=JDK%201.8%20(latest),label=Hadoop/769/artifact/hbase-examples/target/checkstyle-result.xml> with 6566 unique warnings and 0 duplicates.
[CHECKSTYLE] Successfully parsed file <https://builds.apache.org/job/HBase-2.0/jdk=JDK%201.8%20(latest),label=Hadoop/769/artifact/hbase-external-blockcache/target/checkstyle-result.xml> with 6568 unique warnings and 0 duplicates.
[CHECKSTYLE] Successfully parsed file <https://builds.apache.org/job/HBase-2.0/jdk=JDK%201.8%20(latest),label=Hadoop/769/artifact/hbase-hadoop-compat/target/checkstyle-result.xml> with 6602 unique warnings and 0 duplicates.
[CHECKSTYLE] Successfully parsed file <https://builds.apache.org/job/HBase-2.0/jdk=JDK%201.8%20(latest),label=Hadoop/769/artifact/hbase-hadoop2-compat/target/checkstyle-result.xml> with 6779 unique warnings and 0 duplicates.
[CHECKSTYLE] Successfully parsed file <https://builds.apache.org/job/HBase-2.0/jdk=JDK%201.8%20(latest),label=Hadoop/769/artifact/hbase-http/target/checkstyle-result.xml> with 6968 unique warnings and 0 duplicates.
[CHECKSTYLE] Successfully parsed file <https://builds.apache.org/job/HBase-2.0/jdk=JDK%201.8%20(latest),label=Hadoop/769/artifact/hbase-it/target/checkstyle-result.xml> with 7461 unique warnings and 0 duplicates.
[CHECKSTYLE] Successfully parsed file <https://builds.apache.org/job/HBase-2.0/jdk=JDK%201.8%20(latest),label=Hadoop/769/artifact/hbase-mapreduce/target/checkstyle-result.xml> with 8660 unique warnings and 0 duplicates.
[CHECKSTYLE] Successfully parsed file <https://builds.apache.org/job/HBase-2.0/jdk=JDK%201.8%20(latest),label=Hadoop/769/artifact/hbase-metrics-api/target/checkstyle-result.xml> with 8665 unique warnings and 0 duplicates.
[CHECKSTYLE] Successfully parsed file <https://builds.apache.org/job/HBase-2.0/jdk=JDK%201.8%20(latest),label=Hadoop/769/artifact/hbase-metrics/target/checkstyle-result.xml> with 8678 unique warnings and 0 duplicates.
[CHECKSTYLE] Successfully parsed file <https://builds.apache.org/job/HBase-2.0/jdk=JDK%201.8%20(latest),label=Hadoop/769/artifact/hbase-prefix-tree/target/checkstyle-result.xml> with 8893 unique warnings and 0 duplicates.
[CHECKSTYLE] Successfully parsed file <https://builds.apache.org/job/HBase-2.0/jdk=JDK%201.8%20(latest),label=Hadoop/769/artifact/hbase-procedure/target/checkstyle-result.xml> with 9157 unique warnings and 0 duplicates.
[CHECKSTYLE] Successfully parsed file <https://builds.apache.org/job/HBase-2.0/jdk=JDK%201.8%20(latest),label=Hadoop/769/artifact/hbase-protocol-shaded/target/checkstyle-result.xml> with 9160 unique warnings and 0 duplicates.
[CHECKSTYLE] Successfully parsed file <https://builds.apache.org/job/HBase-2.0/jdk=JDK%201.8%20(latest),label=Hadoop/769/artifact/hbase-protocol/target/checkstyle-result.xml> with 9163 unique warnings and 0 duplicates.
[CHECKSTYLE] Successfully parsed file <https://builds.apache.org/job/HBase-2.0/jdk=JDK%201.8%20(latest),label=Hadoop/769/artifact/hbase-replication/target/checkstyle-result.xml> with 9239 unique warnings and 0 duplicates.
[CHECKSTYLE] Successfully parsed file <https://builds.apache.org/job/HBase-2.0/jdk=JDK%201.8%20(latest),label=Hadoop/769/artifact/hbase-resource-bundle/target/checkstyle-result.xml> with 9239 unique warnings and 0 duplicates.
[CHECKSTYLE] Successfully parsed file <https://builds.apache.org/job/HBase-2.0/jdk=JDK%201.8%20(latest),label=Hadoop/769/artifact/hbase-rest/target/checkstyle-result.xml> with 10125 unique warnings and 0 duplicates.
[CHECKSTYLE] Successfully parsed file <https://builds.apache.org/job/HBase-2.0/jdk=JDK%201.8%20(latest),label=Hadoop/769/artifact/hbase-rsgroup/target/checkstyle-result.xml> with 10197 unique warnings and 0 duplicates.
[CHECKSTYLE] Successfully parsed file <https://builds.apache.org/job/HBase-2.0/jdk=JDK%201.8%20(latest),label=Hadoop/769/artifact/hbase-server/target/checkstyle-result.xml> with 21681 unique warnings and 0 duplicates.
[CHECKSTYLE] Successfully parsed file <https://builds.apache.org/job/HBase-2.0/jdk=JDK%201.8%20(latest),label=Hadoop/769/artifact/hbase-shaded/hbase-shaded-check-invariants/target/checkstyle-result.xml> with 21681 unique warnings and 0 duplicates.
[CHECKSTYLE] Successfully parsed file <https://builds.apache.org/job/HBase-2.0/jdk=JDK%201.8%20(latest),label=Hadoop/769/artifact/hbase-shaded/hbase-shaded-client/target/checkstyle-result.xml> with 21681 unique warnings and 0 duplicates.
[CHECKSTYLE] Successfully parsed file <https://builds.apache.org/job/HBase-2.0/jdk=JDK%201.8%20(latest),label=Hadoop/769/artifact/hbase-shaded/hbase-shaded-mapreduce/target/checkstyle-result.xml> with 21681 unique warnings and 0 duplicates.
[CHECKSTYLE] Successfully parsed file <https://builds.apache.org/job/HBase-2.0/jdk=JDK%201.8%20(latest),label=Hadoop/769/artifact/hbase-shaded/target/checkstyle-result.xml> with 21681 unique warnings and 0 duplicates.
[CHECKSTYLE] Successfully parsed file <https://builds.apache.org/job/HBase-2.0/jdk=JDK%201.8%20(latest),label=Hadoop/769/artifact/hbase-shell/target/checkstyle-result.xml> with 21683 unique warnings and 0 duplicates.
[CHECKSTYLE] Successfully parsed file <https://builds.apache.org/job/HBase-2.0/jdk=JDK%201.8%20(latest),label=Hadoop/769/artifact/hbase-spark-it/target/checkstyle-result.xml> with 21706 unique warnings and 0 duplicates.
[CHECKSTYLE] Successfully parsed file <https://builds.apache.org/job/HBase-2.0/jdk=JDK%201.8%20(latest),label=Hadoop/769/artifact/hbase-spark/target/checkstyle-result.xml> with 21750 unique warnings and 0 duplicates.
[CHECKSTYLE] Successfully parsed file <https://builds.apache.org/job/HBase-2.0/jdk=JDK%201.8%20(latest),label=Hadoop/769/artifact/hbase-testing-util/target/checkstyle-result.xml> with 21750 unique warnings and 0 duplicates.
[CHECKSTYLE] Successfully parsed file <https://builds.apache.org/job/HBase-2.0/jdk=JDK%201.8%20(latest),label=Hadoop/769/artifact/hbase-thrift/target/checkstyle-result.xml> with 22237 unique warnings and 0 duplicates.
[CHECKSTYLE] Successfully parsed file <https://builds.apache.org/job/HBase-2.0/jdk=JDK%201.8%20(latest),label=Hadoop/769/artifact/target/checkstyle-result.xml> with 22237 unique warnings and 0 duplicates.
<Git Blamer> Using GitBlamer to create author and commit information for all warnings.
<Git Blamer> GIT_COMMIT=15388d4e169f28eed432b94bf9228e72c6bf920d, workspace=<https://builds.apache.org/job/HBase-2.0/jdk=JDK%201.8%20(latest),label=Hadoop/ws/>
> git rev-parse 15388d4e169f28eed432b94bf9228e72c6bf920d^{commit} # timeout=10
ERROR: Build step failed with exception
org.eclipse.jgit.errors.LargeObjectException: 9a315e1c6dc0d0fa1e206ce0599d3c10193ea24e exceeds size limit
at org.eclipse.jgit.internal.storage.file.LargePackedWholeObject.getCachedBytes(LargePackedWholeObject.java:98)
at org.eclipse.jgit.treewalk.CanonicalTreeParser.reset(CanonicalTreeParser.java:214)
at org.eclipse.jgit.treewalk.CanonicalTreeParser.createSubtreeIterator0(CanonicalTreeParser.java:248)
at org.eclipse.jgit.treewalk.CanonicalTreeParser.createSubtreeIterator(CanonicalTreeParser.java:226)
at org.eclipse.jgit.treewalk.CanonicalTreeParser.createSubtreeIterator(CanonicalTreeParser.java:70)
at org.eclipse.jgit.treewalk.TreeWalk.enterSubtree(TreeWalk.java:1210)
at org.eclipse.jgit.treewalk.TreeWalk.next(TreeWalk.java:828)
at org.eclipse.jgit.blame.BlameGenerator.find(BlameGenerator.java:955)
at org.eclipse.jgit.blame.BlameGenerator.processOne(BlameGenerator.java:603)
at org.eclipse.jgit.blame.BlameGenerator.next(BlameGenerator.java:496)
at org.eclipse.jgit.blame.BlameResult.computeAll(BlameResult.java:239)
at org.eclipse.jgit.blame.BlameGenerator.computeBlameResult(BlameGenerator.java:450)
at org.eclipse.jgit.api.BlameCommand.call(BlameCommand.java:230)
at hudson.plugins.analysis.util.GitBlamer$BlameCallback.invoke(GitBlamer.java:130)
at hudson.plugins.analysis.util.GitBlamer$BlameCallback.invoke(GitBlamer.java:104)
at org.jenkinsci.plugins.gitclient.AbstractGitAPIImpl.withRepository(AbstractGitAPIImpl.java:29)
at org.jenkinsci.plugins.gitclient.CliGitAPIImpl.withRepository(CliGitAPIImpl.java:71)
at hudson.plugins.analysis.util.GitBlamer.loadBlameResultsForFiles(GitBlamer.java:61)
at hudson.plugins.analysis.util.GitBlamer.blame(GitBlamer.java:54)
at hudson.plugins.analysis.util.AbstractBlamer$1.invoke(AbstractBlamer.java:62)
at hudson.plugins.analysis.util.AbstractBlamer$1.invoke(AbstractBlamer.java:59)
at hudson.FilePath$FileCallableWrapper.call(FilePath.java:2750)
at hudson.remoting.UserRequest.perform(UserRequest.java:181)
at hudson.remoting.UserRequest.perform(UserRequest.java:52)
at hudson.remoting.Request$2.run(Request.java:336)
at hudson.remoting.InterceptingExecutorService$1.call(InterceptingExecutorService.java:68)
at java.util.concurrent.FutureTask.run(FutureTask.java:266)
at java.util.concurrent.ThreadPoolExecutor.runWorker(ThreadPoolExecutor.java:1142)
at java.util.concurrent.ThreadPoolExecutor$Worker.run(ThreadPoolExecutor.java:617)
at java.lang.Thread.run(Thread.java:748)
at ......remote call to H4(Native Method)
at hudson.remoting.Channel.attachCallSiteStackTrace(Channel.java:1554)
at hudson.remoting.UserResponse.retrieve(UserRequest.java:281)
at hudson.remoting.Channel.call(Channel.java:839)
at hudson.FilePath.act(FilePath.java:987)
at hudson.FilePath.act(FilePath.java:976)
at hudson.plugins.analysis.util.AbstractBlamer.invokeBlamer(AbstractBlamer.java:59)
at hudson.plugins.analysis.util.AbstractBlamer.blame(AbstractBlamer.java:45)
at hudson.plugins.analysis.core.HealthAwarePublisher.blame(HealthAwarePublisher.java:109)
at hudson.plugins.checkstyle.CheckStylePublisher.perform(CheckStylePublisher.java:81)
at hudson.plugins.analysis.core.HealthAwarePublisher.perform(HealthAwarePublisher.java:69)
at hudson.plugins.analysis.core.HealthAwareRecorder.perform(HealthAwareRecorder.java:298)
at hudson.tasks.BuildStepCompatibilityLayer.perform(BuildStepCompatibilityLayer.java:81)
at hudson.tasks.BuildStepMonitor$1.perform(BuildStepMonitor.java:20)
at hudson.model.AbstractBuild$AbstractBuildExecution.perform(AbstractBuild.java:736)
at hudson.model.AbstractBuild$AbstractBuildExecution.performAllBuildSteps(AbstractBuild.java:682)
at hudson.model.Build$BuildExecution.post2(Build.java:186)
at hudson.model.AbstractBuild$AbstractBuildExecution.post(AbstractBuild.java:627)
at hudson.model.Run.execute(Run.java:1762)
at hudson.matrix.MatrixRun.run(MatrixRun.java:146)
at hudson.model.ResourceController.execute(ResourceController.java:97)
at hudson.model.Executor.run(Executor.java:419)
Build step 'Publish Checkstyle analysis results' marked build as failure