You are viewing a plain text version of this content. The canonical link for it is here.
Posted to commits@myfaces.apache.org by Apache Jenkins Server <je...@builds.apache.org> on 2018/11/14 19:52:32 UTC

Build failed in Jenkins: Tobago Trunk » Tobago Core #1590

See <https://builds.apache.org/job/Tobago%20Trunk/org.apache.myfaces.tobago$tobago-core/1590/display/redirect>

------------------------------------------
[INFO] 
[INFO] ---------------< org.apache.myfaces.tobago:tobago-core >----------------
[INFO] Building Tobago Core 5.0.0-SNAPSHOT                               [8/19]
[INFO] --------------------------------[ jar ]---------------------------------
[INFO] 
[INFO] --- maven-clean-plugin:2.6.1:clean (default-clean) @ tobago-core ---
[INFO] Deleting <https://builds.apache.org/job/Tobago%20Trunk/org.apache.myfaces.tobago$tobago-core/ws/target>
[INFO] 
[INFO] --- animal-sniffer-maven-plugin:1.14:check (default-cli) @ tobago-core ---
[INFO] Checking unresolved references to org.codehaus.mojo.signature:java18:1.0
[INFO] 
[INFO] --- maven-checkstyle-plugin:2.17:check (default-cli) @ tobago-core ---
[INFO] Starting audit...
<https://builds.apache.org/job/Tobago%20Trunk/org.apache.myfaces.tobago$tobago-core/ws/src/main/java/org/apache/myfaces/tobago/context/TobagoContext.java>:24:8: error: Unused import - org.apache.myfaces.tobago.util.MessageUtils.
<https://builds.apache.org/job/Tobago%20Trunk/org.apache.myfaces.tobago$tobago-core/ws/src/main/java/org/apache/myfaces/tobago/context/TobagoContext.java>:25:8: error: Unused import - org.apache.myfaces.tobago.util.ResourceUtils.
<https://builds.apache.org/job/Tobago%20Trunk/org.apache.myfaces.tobago$tobago-core/ws/src/main/java/org/apache/myfaces/tobago/internal/renderkit/renderer/FileRenderer.java>:167:69: error: ',' is not followed by whitespace.
<https://builds.apache.org/job/Tobago%20Trunk/org.apache.myfaces.tobago$tobago-core/ws/src/main/resources/org/apache/myfaces/tobago/context/TobagoMessageBundle_en.properties>:0: error: File does not end with a newline.
<https://builds.apache.org/job/Tobago%20Trunk/org.apache.myfaces.tobago$tobago-core/ws/src/main/resources/org/apache/myfaces/tobago/context/TobagoResourceBundle.properties>:4: error: Line has trailing spaces.
<https://builds.apache.org/job/Tobago%20Trunk/org.apache.myfaces.tobago$tobago-core/ws/src/main/resources/org/apache/myfaces/tobago/context/TobagoResourceBundle_es.properties>:4: error: Line has trailing spaces.
<https://builds.apache.org/job/Tobago%20Trunk/org.apache.myfaces.tobago$tobago-core/ws/src/main/resources/org/apache/myfaces/tobago/context/TobagoMessageBundle.properties>:0: error: Key 'tobago.ajax.response.error' missing.
<https://builds.apache.org/job/Tobago%20Trunk/org.apache.myfaces.tobago$tobago-core/ws/src/main/resources/org/apache/myfaces/tobago/context/TobagoResourceBundle_de.properties>:0: error: Key 'tobago.ajax.response.error' missing.
<https://builds.apache.org/job/Tobago%20Trunk/org.apache.myfaces.tobago$tobago-core/ws/src/main/resources/org/apache/myfaces/tobago/context/TobagoResourceBundle_de.properties>:0: error: Key 'tobago.message.confirmation.okay' missing.
<https://builds.apache.org/job/Tobago%20Trunk/org.apache.myfaces.tobago$tobago-core/ws/src/main/resources/org/apache/myfaces/tobago/context/TobagoResourceBundle_es.properties>:0: error: Key 'tobago.message.confirmation.okay' missing.
<https://builds.apache.org/job/Tobago%20Trunk/org.apache.myfaces.tobago$tobago-core/ws/src/main/resources/org/apache/myfaces/tobago/context/TobagoResourceBundle.properties>:0: error: Key 'tobago.ajax.response.error' missing.
Audit done.
[INFO] There are 11 errors reported by Checkstyle 6.11.2 with tobago/checkstyle.xml ruleset.
[ERROR] src/main/java/org/apache/myfaces/tobago/context/TobagoContext.java:[24,8] (imports) UnusedImports: Unused import - org.apache.myfaces.tobago.util.MessageUtils.
[ERROR] src/main/java/org/apache/myfaces/tobago/context/TobagoContext.java:[25,8] (imports) UnusedImports: Unused import - org.apache.myfaces.tobago.util.ResourceUtils.
[ERROR] src/main/java/org/apache/myfaces/tobago/internal/renderkit/renderer/FileRenderer.java:[167,69] (whitespace) WhitespaceAfter: ',' is not followed by whitespace.
[ERROR] src/main/resources/org/apache/myfaces/tobago/context/TobagoMessageBundle_en.properties:[0] (misc) NewlineAtEndOfFile: File does not end with a newline.
[ERROR] src/main/resources/org/apache/myfaces/tobago/context/TobagoResourceBundle.properties:[4] (regexp) RegexpSingleline: Line has trailing spaces.
[ERROR] src/main/resources/org/apache/myfaces/tobago/context/TobagoResourceBundle_es.properties:[4] (regexp) RegexpSingleline: Line has trailing spaces.
[ERROR] src/main/resources/org/apache/myfaces/tobago/context/TobagoMessageBundle.properties:[0] (misc) Translation: Key 'tobago.ajax.response.error' missing.
[ERROR] src/main/resources/org/apache/myfaces/tobago/context/TobagoResourceBundle_de.properties:[0] (misc) Translation: Key 'tobago.ajax.response.error' missing.
[ERROR] src/main/resources/org/apache/myfaces/tobago/context/TobagoResourceBundle_de.properties:[0] (misc) Translation: Key 'tobago.message.confirmation.okay' missing.
[ERROR] src/main/resources/org/apache/myfaces/tobago/context/TobagoResourceBundle_es.properties:[0] (misc) Translation: Key 'tobago.message.confirmation.okay' missing.
[ERROR] src/main/resources/org/apache/myfaces/tobago/context/TobagoResourceBundle.properties:[0] (misc) Translation: Key 'tobago.ajax.response.error' missing.

Jenkins build is back to normal : Tobago Trunk » Tobago Core #1594

Posted by Apache Jenkins Server <je...@builds.apache.org>.
See <https://builds.apache.org/job/Tobago%20Trunk/org.apache.myfaces.tobago$tobago-core/1594/display/redirect?page=changes>


Build failed in Jenkins: Tobago Trunk » Tobago Core #1593

Posted by Apache Jenkins Server <je...@builds.apache.org>.
See <https://builds.apache.org/job/Tobago%20Trunk/org.apache.myfaces.tobago$tobago-core/1593/display/redirect?page=changes>

Changes:

[lofwyr] fix: TOBAGO-1953 Show info in empty sheets

------------------------------------------
[INFO] 
[INFO] ---------------< org.apache.myfaces.tobago:tobago-core >----------------
[INFO] Building Tobago Core 5.0.0-SNAPSHOT                               [8/19]
[INFO] --------------------------------[ jar ]---------------------------------
[INFO] 
[INFO] --- maven-clean-plugin:2.6.1:clean (default-clean) @ tobago-core ---
[INFO] Deleting <https://builds.apache.org/job/Tobago%20Trunk/org.apache.myfaces.tobago$tobago-core/ws/target>
[INFO] 
[INFO] --- animal-sniffer-maven-plugin:1.14:check (default-cli) @ tobago-core ---
[INFO] Checking unresolved references to org.codehaus.mojo.signature:java18:1.0
[INFO] 
[INFO] --- maven-checkstyle-plugin:2.17:check (default-cli) @ tobago-core ---
[INFO] Starting audit...
<https://builds.apache.org/job/Tobago%20Trunk/org.apache.myfaces.tobago$tobago-core/ws/src/main/resources/org/apache/myfaces/tobago/context/TobagoResourceBundle_de.properties>:0: error: Key 'sheetPagingInfoEmptyRow' missing.
Audit done.
[INFO] There is 1 error reported by Checkstyle 6.11.2 with tobago/checkstyle.xml ruleset.
[ERROR] src/main/resources/org/apache/myfaces/tobago/context/TobagoResourceBundle_de.properties:[0] (misc) Translation: Key 'sheetPagingInfoEmptyRow' missing.

Build failed in Jenkins: Tobago Trunk » Tobago Core #1592

Posted by Apache Jenkins Server <je...@builds.apache.org>.
See <https://builds.apache.org/job/Tobago%20Trunk/org.apache.myfaces.tobago$tobago-core/1592/display/redirect?page=changes>

Changes:

[lofwyr] fix: checkstyle

------------------------------------------
[INFO] 
[INFO] ---------------< org.apache.myfaces.tobago:tobago-core >----------------
[INFO] Building Tobago Core 5.0.0-SNAPSHOT                               [8/19]
[INFO] --------------------------------[ jar ]---------------------------------
[INFO] 
[INFO] --- maven-clean-plugin:2.6.1:clean (default-clean) @ tobago-core ---
[INFO] Deleting <https://builds.apache.org/job/Tobago%20Trunk/org.apache.myfaces.tobago$tobago-core/ws/target>
[INFO] 
[INFO] --- animal-sniffer-maven-plugin:1.14:check (default-cli) @ tobago-core ---
[INFO] Checking unresolved references to org.codehaus.mojo.signature:java18:1.0
[INFO] 
[INFO] --- maven-checkstyle-plugin:2.17:check (default-cli) @ tobago-core ---
[INFO] Starting audit...
<https://builds.apache.org/job/Tobago%20Trunk/org.apache.myfaces.tobago$tobago-core/ws/src/main/resources/org/apache/myfaces/tobago/context/TobagoResourceBundle_de.properties>:0: error: Key 'sheetPagingInfoEmptyRow' missing.
Audit done.
[INFO] There is 1 error reported by Checkstyle 6.11.2 with tobago/checkstyle.xml ruleset.
[ERROR] src/main/resources/org/apache/myfaces/tobago/context/TobagoResourceBundle_de.properties:[0] (misc) Translation: Key 'sheetPagingInfoEmptyRow' missing.

Build failed in Jenkins: Tobago Trunk » Tobago Core #1591

Posted by Apache Jenkins Server <je...@builds.apache.org>.
See <https://builds.apache.org/job/Tobago%20Trunk/org.apache.myfaces.tobago$tobago-core/1591/display/redirect>

------------------------------------------
[INFO] 
[INFO] ---------------< org.apache.myfaces.tobago:tobago-core >----------------
[INFO] Building Tobago Core 5.0.0-SNAPSHOT                               [8/19]
[INFO] --------------------------------[ jar ]---------------------------------
[INFO] 
[INFO] --- maven-clean-plugin:2.6.1:clean (default-clean) @ tobago-core ---
[INFO] Deleting <https://builds.apache.org/job/Tobago%20Trunk/org.apache.myfaces.tobago$tobago-core/ws/target>
[INFO] 
[INFO] --- animal-sniffer-maven-plugin:1.14:check (default-cli) @ tobago-core ---
[INFO] Checking unresolved references to org.codehaus.mojo.signature:java18:1.0
[INFO] 
[INFO] --- maven-checkstyle-plugin:2.17:check (default-cli) @ tobago-core ---
[INFO] Starting audit...
<https://builds.apache.org/job/Tobago%20Trunk/org.apache.myfaces.tobago$tobago-core/ws/src/main/java/org/apache/myfaces/tobago/context/TobagoContext.java>:24:8: error: Unused import - org.apache.myfaces.tobago.util.MessageUtils.
<https://builds.apache.org/job/Tobago%20Trunk/org.apache.myfaces.tobago$tobago-core/ws/src/main/java/org/apache/myfaces/tobago/context/TobagoContext.java>:25:8: error: Unused import - org.apache.myfaces.tobago.util.ResourceUtils.
<https://builds.apache.org/job/Tobago%20Trunk/org.apache.myfaces.tobago$tobago-core/ws/src/main/java/org/apache/myfaces/tobago/internal/renderkit/renderer/FileRenderer.java>:167:69: error: ',' is not followed by whitespace.
<https://builds.apache.org/job/Tobago%20Trunk/org.apache.myfaces.tobago$tobago-core/ws/src/main/resources/org/apache/myfaces/tobago/context/TobagoMessageBundle_en.properties>:0: error: File does not end with a newline.
<https://builds.apache.org/job/Tobago%20Trunk/org.apache.myfaces.tobago$tobago-core/ws/src/main/resources/org/apache/myfaces/tobago/context/TobagoResourceBundle.properties>:4: error: Line has trailing spaces.
<https://builds.apache.org/job/Tobago%20Trunk/org.apache.myfaces.tobago$tobago-core/ws/src/main/resources/org/apache/myfaces/tobago/context/TobagoResourceBundle_es.properties>:4: error: Line has trailing spaces.
<https://builds.apache.org/job/Tobago%20Trunk/org.apache.myfaces.tobago$tobago-core/ws/src/main/resources/org/apache/myfaces/tobago/context/TobagoMessageBundle.properties>:0: error: Key 'tobago.ajax.response.error' missing.
<https://builds.apache.org/job/Tobago%20Trunk/org.apache.myfaces.tobago$tobago-core/ws/src/main/resources/org/apache/myfaces/tobago/context/TobagoResourceBundle_de.properties>:0: error: Key 'tobago.ajax.response.error' missing.
<https://builds.apache.org/job/Tobago%20Trunk/org.apache.myfaces.tobago$tobago-core/ws/src/main/resources/org/apache/myfaces/tobago/context/TobagoResourceBundle_de.properties>:0: error: Key 'tobago.message.confirmation.okay' missing.
<https://builds.apache.org/job/Tobago%20Trunk/org.apache.myfaces.tobago$tobago-core/ws/src/main/resources/org/apache/myfaces/tobago/context/TobagoResourceBundle_es.properties>:0: error: Key 'tobago.message.confirmation.okay' missing.
<https://builds.apache.org/job/Tobago%20Trunk/org.apache.myfaces.tobago$tobago-core/ws/src/main/resources/org/apache/myfaces/tobago/context/TobagoResourceBundle.properties>:0: error: Key 'tobago.ajax.response.error' missing.
Audit done.
[INFO] There are 11 errors reported by Checkstyle 6.11.2 with tobago/checkstyle.xml ruleset.
[ERROR] src/main/java/org/apache/myfaces/tobago/context/TobagoContext.java:[24,8] (imports) UnusedImports: Unused import - org.apache.myfaces.tobago.util.MessageUtils.
[ERROR] src/main/java/org/apache/myfaces/tobago/context/TobagoContext.java:[25,8] (imports) UnusedImports: Unused import - org.apache.myfaces.tobago.util.ResourceUtils.
[ERROR] src/main/java/org/apache/myfaces/tobago/internal/renderkit/renderer/FileRenderer.java:[167,69] (whitespace) WhitespaceAfter: ',' is not followed by whitespace.
[ERROR] src/main/resources/org/apache/myfaces/tobago/context/TobagoMessageBundle_en.properties:[0] (misc) NewlineAtEndOfFile: File does not end with a newline.
[ERROR] src/main/resources/org/apache/myfaces/tobago/context/TobagoResourceBundle.properties:[4] (regexp) RegexpSingleline: Line has trailing spaces.
[ERROR] src/main/resources/org/apache/myfaces/tobago/context/TobagoResourceBundle_es.properties:[4] (regexp) RegexpSingleline: Line has trailing spaces.
[ERROR] src/main/resources/org/apache/myfaces/tobago/context/TobagoMessageBundle.properties:[0] (misc) Translation: Key 'tobago.ajax.response.error' missing.
[ERROR] src/main/resources/org/apache/myfaces/tobago/context/TobagoResourceBundle_de.properties:[0] (misc) Translation: Key 'tobago.ajax.response.error' missing.
[ERROR] src/main/resources/org/apache/myfaces/tobago/context/TobagoResourceBundle_de.properties:[0] (misc) Translation: Key 'tobago.message.confirmation.okay' missing.
[ERROR] src/main/resources/org/apache/myfaces/tobago/context/TobagoResourceBundle_es.properties:[0] (misc) Translation: Key 'tobago.message.confirmation.okay' missing.
[ERROR] src/main/resources/org/apache/myfaces/tobago/context/TobagoResourceBundle.properties:[0] (misc) Translation: Key 'tobago.ajax.response.error' missing.