You are viewing a plain text version of this content. The canonical link for it is here.
Posted to notifications@maven.apache.org by Hudson <Hu...@sonatype.org> on 2008/06/28 15:20:31 UTC
Build failed in Hudson: Maven-2.1.x #171
See http://ci.sonatype.org/job/Maven-2.1.x/171/changes
Changes:
[vsiveton] o merged from r672519 (specified XML encoding UTF-8)
[vsiveton] o merged from r672517 (removed empty comment)
[vsiveton] o merged from r672514 (minor comments)
[vsiveton] o merged from r638671 (MNG-3469: add Resource.toString() method for debugging. patch from Wayne Fay)
[vsiveton] o merged from r638669 (MNG-3468: add FileSet.toString() method for debugging. patch from Wayne Fay)
[vsiveton] o merged from r638668 (MNG-3467: add toString() method for debugging. patch from Wayne Fay)
[vsiveton] o one line for namespace
[vsiveton] o merged from r672506 (fixed typo)
[vsiveton] o merged from r672501 (updated to last modello-maven-plugin 1.0-alpha-18)
------------------------------------------
[...truncated 3382 lines...]
Running org.apache.maven.embedder.execution.EmbedderUsingScmPluginTest
properties = {connectionUrl=scm:svn:http://svn.apache.org/repos/asf/maven/components/trunk/maven-embedder, outputDirectory=http://ci.sonatype.org/job/Maven-2.1.x/ws/maven-2.1.x/maven-embedder/target/scm.diff}
[INFO] Scanning for projects...
[INFO] ------------------------------------------------------------------------
[INFO] Building Maven Quick Start Archetype
[INFO]
[INFO] Id: org.apache.maven:embedder-test-project:jar:1.0-SNAPSHOT
[INFO] task-segment: [org.apache.maven.plugins:maven-scm-plugin:1.0:diff] (aggregator-style)
[INFO] ------------------------------------------------------------------------
[INFO] [scm:diff]
[INFO] Executing: svn --non-interactive diff
[INFO] Working directory: http://ci.sonatype.org/job/Maven-2.1.x/ws/maven-2.1.x/maven-embedder/target/scm-plugin-from-embedder
[INFO]
Tests run: 1, Failures: 0, Errors: 0, Skipped: 0, Time elapsed: 0.802 sec
Running org.apache.maven.cli.TestEmbedderLogger
Tests run: 0, Failures: 0, Errors: 0, Skipped: 0, Time elapsed: 0.002 sec
Running org.apache.maven.embedder.MavenEmbedderProjectWithExtensionReadingTest
[INFO] Scanning for projects...
[INFO] ------------------------------------------------------------------------
[INFO] Building Maven Quick Start Archetype
[INFO]
[INFO] Id: org.apache.maven:embedder-test-project:jar:1.0-SNAPSHOT
[INFO] task-segment: [package]
[INFO] ------------------------------------------------------------------------
[INFO] [resources:resources]
[INFO] Using default encoding to copy filtered resources.
[INFO] [compiler:compile]
[INFO] Compiling 1 source file to http://ci.sonatype.org/job/Maven-2.1.x/ws/maven-2.1.x/maven-embedder/target/embedder-test-project0/home/j2ee-hudson/.hudson/jobs/Maven-2.1.x/workspace/maven-2.1.x/maven-embedder/target/embedder-test-project0/target/classes
[INFO] [resources:testResources]
[INFO] Using default encoding to copy filtered resources.
[INFO] [compiler:testCompile]
[INFO] Compiling 1 source file to http://ci.sonatype.org/job/Maven-2.1.x/ws/maven-2.1.x/maven-embedder/target/embedder-test-project0/home/j2ee-hudson/.hudson/jobs/Maven-2.1.x/workspace/maven-2.1.x/maven-embedder/target/embedder-test-project0/target/test-classes
[INFO] [surefire:test]
[INFO] Surefire report directory: http://ci.sonatype.org/job/Maven-2.1.x/ws/maven-2.1.x/maven-embedder/target/embedder-test-project0/target/surefire-reports
-------------------------------------------------------
T E S T S
-------------------------------------------------------
Running org.apache.maven.AppTest
Tests run: 1, Failures: 0, Errors: 0, Skipped: 0, Time elapsed: 0.031 sec
Results :
Tests run: 1, Failures: 0, Errors: 0, Skipped: 0
[INFO] [jar:jar]
[INFO] Building jar: http://ci.sonatype.org/job/Maven-2.1.x/ws/maven-2.1.x/maven-embedder/target/embedder-test-project0/target/embedder-test-project-1.0-SNAPSHOT.jar
[INFO] Scanning for projects...
[INFO] ------------------------------------------------------------------------
[INFO] Building Maven Quick Start Archetype
[INFO]
[INFO] Id: org.apache.maven:embedder-test-project:jar:1.0-SNAPSHOT
[INFO] task-segment: [package]
[INFO] ------------------------------------------------------------------------
[INFO] [resources:resources]
[INFO] Using default encoding to copy filtered resources.
[INFO] [compiler:compile]
[INFO] Compiling 1 source file to http://ci.sonatype.org/job/Maven-2.1.x/ws/maven-2.1.x/maven-embedder/target/embedder-test-project1/home/j2ee-hudson/.hudson/jobs/Maven-2.1.x/workspace/maven-2.1.x/maven-embedder/target/embedder-test-project1/target/classes
[INFO] [resources:testResources]
[INFO] Using default encoding to copy filtered resources.
[INFO] [compiler:testCompile]
[INFO] Compiling 1 source file to http://ci.sonatype.org/job/Maven-2.1.x/ws/maven-2.1.x/maven-embedder/target/embedder-test-project1/home/j2ee-hudson/.hudson/jobs/Maven-2.1.x/workspace/maven-2.1.x/maven-embedder/target/embedder-test-project1/target/test-classes
[INFO] [surefire:test]
[INFO] Surefire report directory: http://ci.sonatype.org/job/Maven-2.1.x/ws/maven-2.1.x/maven-embedder/target/embedder-test-project1/target/surefire-reports
-------------------------------------------------------
T E S T S
-------------------------------------------------------
Running org.apache.maven.AppTest
Tests run: 1, Failures: 0, Errors: 0, Skipped: 0, Time elapsed: 0.032 sec
Results :
Tests run: 1, Failures: 0, Errors: 0, Skipped: 0
[INFO] [jar:jar]
[INFO] Building jar: http://ci.sonatype.org/job/Maven-2.1.x/ws/maven-2.1.x/maven-embedder/target/embedder-test-project1/target/embedder-test-project-1.0-SNAPSHOT.jar
[INFO] Scanning for projects...
[INFO] ------------------------------------------------------------------------
[INFO] Building Maven Quick Start Archetype
[INFO]
[INFO] Id: org.apache.maven:embedder-test-project:jar:1.0-SNAPSHOT
[INFO] task-segment: [validate]
[INFO] ------------------------------------------------------------------------
[INFO] Scanning for projects...
[INFO] ------------------------------------------------------------------------
[INFO] Building Maven Quick Start Archetype
[INFO]
[INFO] Id: org.apache.maven:embedder-test-project:jar:1.0-SNAPSHOT
[INFO] task-segment: [validate]
[INFO] ------------------------------------------------------------------------
[INFO] Scanning for projects...
[INFO] ------------------------------------------------------------------------
[INFO] Building Maven Quick Start Archetype
[INFO]
[INFO] Id: org.apache.maven:embedder-test-project:jar:1.0-SNAPSHOT
[INFO] task-segment: [package]
[INFO] ------------------------------------------------------------------------
[INFO] [resources:resources]
[INFO] Using default encoding to copy filtered resources.
[INFO] [compiler:compile]
[INFO] Compiling 1 source file to http://ci.sonatype.org/job/Maven-2.1.x/ws/maven-2.1.x/maven-embedder/target/embedder-test-project-caching/home/j2ee-hudson/.hudson/jobs/Maven-2.1.x/workspace/maven-2.1.x/maven-embedder/target/embedder-test-project-caching/target/classes
[INFO] [resources:testResources]
[INFO] Using default encoding to copy filtered resources.
[INFO] [compiler:testCompile]
[INFO] Compiling 1 source file to http://ci.sonatype.org/job/Maven-2.1.x/ws/maven-2.1.x/maven-embedder/target/embedder-test-project-caching/home/j2ee-hudson/.hudson/jobs/Maven-2.1.x/workspace/maven-2.1.x/maven-embedder/target/embedder-test-project-caching/target/test-classes
[INFO] [surefire:test]
[INFO] Surefire report directory: http://ci.sonatype.org/job/Maven-2.1.x/ws/maven-2.1.x/maven-embedder/target/embedder-test-project-caching/target/surefire-reports
-------------------------------------------------------
T E S T S
-------------------------------------------------------
Running org.apache.maven.AppTest
Tests run: 1, Failures: 0, Errors: 0, Skipped: 0, Time elapsed: 0.027 sec
Results :
Tests run: 1, Failures: 0, Errors: 0, Skipped: 0
[INFO] [jar:jar]
[INFO] Building jar: http://ci.sonatype.org/job/Maven-2.1.x/ws/maven-2.1.x/maven-embedder/target/embedder-test-project-caching/target/embedder-test-project-1.0-SNAPSHOT.jar
[INFO] Scanning for projects...
[INFO] ------------------------------------------------------------------------
[INFO] Building Maven Quick Start Archetype
[INFO]
[INFO] Id: org.apache.maven:embedder-test-project:jar:1.0-SNAPSHOT
[INFO] task-segment: [package]
[INFO] ------------------------------------------------------------------------
[INFO] [resources:resources]
[INFO] Using default encoding to copy filtered resources.
[INFO] [compiler:compile]
[INFO] Nothing to compile - all classes are up to date
[INFO] [resources:testResources]
[INFO] Using default encoding to copy filtered resources.
[INFO] [compiler:testCompile]
[INFO] Nothing to compile - all classes are up to date
[INFO] [surefire:test]
[INFO] Surefire report directory: http://ci.sonatype.org/job/Maven-2.1.x/ws/maven-2.1.x/maven-embedder/target/embedder-test-project-caching/target/surefire-reports
-------------------------------------------------------
T E S T S
-------------------------------------------------------
Running org.apache.maven.AppTest
Tests run: 1, Failures: 0, Errors: 0, Skipped: 0, Time elapsed: 0.029 sec
Results :
Tests run: 1, Failures: 0, Errors: 0, Skipped: 0
[INFO] [jar:jar]
Tests run: 16, Failures: 0, Errors: 0, Skipped: 0, Time elapsed: 8.292 sec
Running org.apache.maven.cli.MavenCliTest
Tests run: 1, Failures: 0, Errors: 0, Skipped: 0, Time elapsed: 0.025 sec
Running org.apache.maven.embedder.MavenEmbedderExampleTest
[INFO] Scanning for projects...
[INFO] ------------------------------------------------------------------------
[INFO] Building simple-project
[INFO]
[INFO] Id: org.apache.maven.embedder:simple-project:jar:1.0-SNAPSHOT
[INFO] task-segment: [clean, install]
[INFO] ------------------------------------------------------------------------
[INFO] [clean:clean]
[INFO] Deleting directory http://ci.sonatype.org/job/Maven-2.1.x/ws/maven-2.1.x/maven-embedder/src/examples/simple-project/target
[INFO] Deleting directory http://ci.sonatype.org/job/Maven-2.1.x/ws/maven-2.1.x/maven-embedder/src/examples/simple-project/home/j2ee-hudson/.hudson/jobs/Maven-2.1.x/workspace/maven-2.1.x/maven-embedder/src/examples/simple-project/target/classes
[INFO] Deleting directory http://ci.sonatype.org/job/Maven-2.1.x/ws/maven-2.1.x/maven-embedder/src/examples/simple-project/home/j2ee-hudson/.hudson/jobs/Maven-2.1.x/workspace/maven-2.1.x/maven-embedder/src/examples/simple-project/target/test-classes
[INFO] [resources:resources]
[INFO] Using default encoding to copy filtered resources.
[INFO] [compiler:compile]
[INFO] Compiling 1 source file to http://ci.sonatype.org/job/Maven-2.1.x/ws/maven-2.1.x/maven-embedder/src/examples/simple-project/home/j2ee-hudson/.hudson/jobs/Maven-2.1.x/workspace/maven-2.1.x/maven-embedder/src/examples/simple-project/target/classes
[INFO] [resources:testResources]
[INFO] Using default encoding to copy filtered resources.
[INFO] [compiler:testCompile]
[INFO] Compiling 1 source file to http://ci.sonatype.org/job/Maven-2.1.x/ws/maven-2.1.x/maven-embedder/src/examples/simple-project/home/j2ee-hudson/.hudson/jobs/Maven-2.1.x/workspace/maven-2.1.x/maven-embedder/src/examples/simple-project/target/test-classes
[INFO] [surefire:test]
[INFO] Surefire report directory: http://ci.sonatype.org/job/Maven-2.1.x/ws/maven-2.1.x/maven-embedder/src/examples/simple-project/target/surefire-reports
-------------------------------------------------------
T E S T S
-------------------------------------------------------
Running org.apache.maven.embedder.AppTest
Tests run: 1, Failures: 0, Errors: 0, Skipped: 0, Time elapsed: 0.032 sec
Results :
Tests run: 1, Failures: 0, Errors: 0, Skipped: 0
[INFO] [jar:jar]
[INFO] Building jar: http://ci.sonatype.org/job/Maven-2.1.x/ws/maven-2.1.x/maven-embedder/src/examples/simple-project/target/simple-project-1.0-SNAPSHOT.jar
[INFO] [install:install]
[INFO] Installing http://ci.sonatype.org/job/Maven-2.1.x/ws/maven-2.1.x/maven-embedder/src/examples/simple-project/target/simple-project-1.0-SNAPSHOT.jar to /home/j2ee-hudson/.m2/repository/org/apache/maven/embedder/simple-project/1.0-SNAPSHOT/simple-project-1.0-SNAPSHOT.jar
You are working in the 'development' environment!
Tests run: 3, Failures: 0, Errors: 0, Skipped: 0, Time elapsed: 2.716 sec
Running org.apache.maven.cli.CLIRequestUtilsTest
key=value
[]
Tests run: 2, Failures: 0, Errors: 0, Skipped: 0, Time elapsed: 0.168 sec
Running org.apache.maven.embedder.MavenEmbedderEventingTest
Test source dir: http://ci.sonatype.org/job/Maven-2.1.x/ws/maven-2.1.x/maven-embedder/src/test/eventing-projects/simple-read-project
Test temp dir: http://ci.sonatype.org/job/Maven-2.1.x/ws/maven-2.1.x/maven-embedder/target/eventing-projects/simple-read-project
Test source dir: http://ci.sonatype.org/job/Maven-2.1.x/ws/maven-2.1.x/maven-embedder/src/test/eventing-projects/read-with-deps
Test temp dir: http://ci.sonatype.org/job/Maven-2.1.x/ws/maven-2.1.x/maven-embedder/target/eventing-projects/read-with-deps
Test source dir: http://ci.sonatype.org/job/Maven-2.1.x/ws/maven-2.1.x/maven-embedder/src/test/eventing-projects/simple-read-project
Test temp dir: http://ci.sonatype.org/job/Maven-2.1.x/ws/maven-2.1.x/maven-embedder/target/eventing-projects/simple-read-project
[INFO] Scanning for projects...
[INFO] ------------------------------------------------------------------------
[INFO] Building Unnamed - testing:simple-read-project:jar:1
[INFO]
[INFO] Id: testing:simple-read-project:jar:1
[INFO] task-segment: [clean]
[INFO] ------------------------------------------------------------------------
[INFO] [clean:clean]
Tests run: 4, Failures: 0, Errors: 0, Skipped: 0, Time elapsed: 0.602 sec
Results :
Tests run: 113, Failures: 1, Errors: 1, Skipped: 0
[INFO] ------------------------------------------------------------------------
[ERROR] BUILD FAILURE
[INFO] ------------------------------------------------------------------------
[INFO] There are test failures.
[INFO] ------------------------------------------------------------------------
[INFO] Trace
org.apache.maven.BuildFailureException: There are test failures.
at org.apache.maven.lifecycle.DefaultLifecycleExecutor.executeGoals(DefaultLifecycleExecutor.java:579)
at org.apache.maven.lifecycle.DefaultLifecycleExecutor.executeGoalWithLifecycle(DefaultLifecycleExecutor.java:499)
at org.apache.maven.lifecycle.DefaultLifecycleExecutor.executeGoal(DefaultLifecycleExecutor.java:478)
at org.apache.maven.lifecycle.DefaultLifecycleExecutor.executeGoalAndHandleFailures(DefaultLifecycleExecutor.java:330)
at org.apache.maven.lifecycle.DefaultLifecycleExecutor.executeTaskSegments(DefaultLifecycleExecutor.java:291)
at org.apache.maven.lifecycle.DefaultLifecycleExecutor.execute(DefaultLifecycleExecutor.java:142)
at org.apache.maven.DefaultMaven.doExecute(DefaultMaven.java:336)
at org.apache.maven.DefaultMaven.execute(DefaultMaven.java:129)
at org.apache.maven.cli.MavenCli.main(MavenCli.java:287)
at sun.reflect.NativeMethodAccessorImpl.invoke0(Native Method)
at sun.reflect.NativeMethodAccessorImpl.invoke(NativeMethodAccessorImpl.java:39)
at sun.reflect.DelegatingMethodAccessorImpl.invoke(DelegatingMethodAccessorImpl.java:25)
at java.lang.reflect.Method.invoke(Method.java:585)
at org.codehaus.classworlds.Launcher.launchEnhanced(Launcher.java:315)
at org.codehaus.classworlds.Launcher.launch(Launcher.java:255)
at org.codehaus.classworlds.Launcher.mainWithExitCode(Launcher.java:430)
at org.codehaus.classworlds.Launcher.main(Launcher.java:375)
Caused by: org.apache.maven.plugin.MojoFailureException: There are test failures.
at org.apache.maven.plugin.surefire.SurefirePlugin.execute(SurefirePlugin.java:403)
at org.apache.maven.plugin.DefaultPluginManager.executeMojo(DefaultPluginManager.java:451)
at org.apache.maven.lifecycle.DefaultLifecycleExecutor.executeGoals(DefaultLifecycleExecutor.java:558)
... 16 more
[INFO] ------------------------------------------------------------------------
[INFO] Total time: 2 minutes 7 seconds
[INFO] Finished at: Sat Jun 28 08:20:30 CDT 2008
[INFO] Final Memory: 66M/490M
[INFO] ------------------------------------------------------------------------
Hudson build is back to normal: Maven-2.1.x #177
Posted by Hudson <Hu...@sonatype.org>.
See http://ci.sonatype.org/job/Maven-2.1.x/177/changes
Build failed in Hudson: Maven-2.1.x #176
Posted by Hudson <Hu...@sonatype.org>.
See http://ci.sonatype.org/job/Maven-2.1.x/176/changes
------------------------------------------
started
Updating https://svn.apache.org/repos/asf/maven/components/trunk
ERROR: Failed to update https://svn.apache.org/repos/asf/maven/components/trunk
org.tmatesoft.svn.core.SVNCancelException: svn: Operation cancelled
at hudson.scm.SubversionUpdateEventHandler.checkCancelled(SubversionUpdateEventHandler.java:191)
at org.tmatesoft.svn.core.wc.SVNBasicClient.checkCancelled(SVNBasicClient.java:334)
at org.tmatesoft.svn.core.internal.wc.admin.SVNWCAccess.checkCancelled(SVNWCAccess.java:75)
at org.tmatesoft.svn.core.internal.wc.admin.SVNWCAccess.doOpen(SVNWCAccess.java:359)
at org.tmatesoft.svn.core.internal.wc.admin.SVNWCAccess.doOpen(SVNWCAccess.java:372)
at org.tmatesoft.svn.core.internal.wc.admin.SVNWCAccess.doOpen(SVNWCAccess.java:372)
at org.tmatesoft.svn.core.internal.wc.admin.SVNWCAccess.doOpen(SVNWCAccess.java:372)
at org.tmatesoft.svn.core.internal.wc.admin.SVNWCAccess.doOpen(SVNWCAccess.java:372)
at org.tmatesoft.svn.core.internal.wc.admin.SVNWCAccess.doOpen(SVNWCAccess.java:372)
at org.tmatesoft.svn.core.internal.wc.admin.SVNWCAccess.doOpen(SVNWCAccess.java:372)
at org.tmatesoft.svn.core.internal.wc.admin.SVNWCAccess.doOpen(SVNWCAccess.java:372)
at org.tmatesoft.svn.core.internal.wc.admin.SVNWCAccess.doOpen(SVNWCAccess.java:372)
at org.tmatesoft.svn.core.internal.wc.admin.SVNWCAccess.doOpen(SVNWCAccess.java:372)
at org.tmatesoft.svn.core.internal.wc.admin.SVNWCAccess.doOpen(SVNWCAccess.java:372)
at org.tmatesoft.svn.core.internal.wc.admin.SVNWCAccess.doOpen(SVNWCAccess.java:372)
at org.tmatesoft.svn.core.internal.wc.admin.SVNWCAccess.doOpen(SVNWCAccess.java:372)
at org.tmatesoft.svn.core.internal.wc.admin.SVNWCAccess.doOpen(SVNWCAccess.java:372)
at org.tmatesoft.svn.core.internal.wc.admin.SVNWCAccess.open(SVNWCAccess.java:261)
at org.tmatesoft.svn.core.internal.wc.admin.SVNWCAccess.openAnchor(SVNWCAccess.java:153)
at org.tmatesoft.svn.core.wc.SVNUpdateClient.doUpdate(SVNUpdateClient.java:145)
at hudson.scm.SubversionSCM$CheckOutTask.invoke(SubversionSCM.java:382)
at hudson.scm.SubversionSCM$CheckOutTask.invoke(SubversionSCM.java:354)
at hudson.FilePath.act(FilePath.java:312)
at hudson.scm.SubversionSCM.checkout(SubversionSCM.java:348)
at hudson.scm.SubversionSCM.checkout(SubversionSCM.java:299)
at hudson.model.AbstractProject.checkout(AbstractProject.java:567)
at hudson.model.AbstractBuild$AbstractRunner.checkout(AbstractBuild.java:251)
at hudson.model.AbstractBuild$AbstractRunner.run(AbstractBuild.java:225)
at hudson.model.Run.run(Run.java:756)
at hudson.model.Build.run(Build.java:85)
at hudson.model.ResourceController.execute(ResourceController.java:70)
at hudson.model.Executor.run(Executor.java:77)
Build failed in Hudson: Maven-2.1.x #175
Posted by Hudson <Hu...@sonatype.org>.
See http://ci.sonatype.org/job/Maven-2.1.x/175/changes
Changes:
[brett] We require the newer version of the surefire plugin or it is possible to get old versions of plexus-utils in the tests
------------------------------------------
started
Updating https://svn.apache.org/repos/asf/maven/components/trunk
U maven-embedder/pom.xml
At revision 672731
[maven-2.1.x] $ /opt/maven/2.0/bin/mvn clean deploy -B -U -e -Dmaven.repo.local=/home/j2ee-hudson/repos/Maven-2.1.x -Pstrict -Dsurefire.useFile=false
+ Error stacktraces are turned on.
[INFO] Scanning for projects...
Downloading: http://localhost:8081/nexus/content/groups/public/org/apache/maven/maven-parent/8/maven-parent-8.pom
Downloading: http://localhost:8081/nexus/content/groups/public/org/apache/maven/maven-parent/8/maven-parent-8.pom
Downloading: http://localhost:8081/nexus/content/groups/public/org/apache/maven/maven-parent/8/maven-parent-8.pom
[INFO] ------------------------------------------------------------------------
[ERROR] FATAL ERROR
[INFO] ------------------------------------------------------------------------
[INFO] Failed to resolve artifact.
GroupId: org.apache.maven
ArtifactId: maven-parent
Version: 8
Reason: Unable to download the artifact from any repository
org.apache.maven:maven-parent:pom:8
from the specified remote repositories:
Nexus (http://localhost:8081/nexus/content/groups/public)
[INFO] ------------------------------------------------------------------------
[INFO] Trace
org.apache.maven.reactor.MavenExecutionException: Cannot find parent: org.apache.maven:maven-parent for project: null:maven:pom:2.1-SNAPSHOT for project null:maven:pom:2.1-SNAPSHOT
at org.apache.maven.DefaultMaven.getProjects(DefaultMaven.java:378)
at org.apache.maven.DefaultMaven.doExecute(DefaultMaven.java:292)
at org.apache.maven.DefaultMaven.execute(DefaultMaven.java:129)
at org.apache.maven.cli.MavenCli.main(MavenCli.java:287)
at sun.reflect.NativeMethodAccessorImpl.invoke0(Native Method)
at sun.reflect.NativeMethodAccessorImpl.invoke(NativeMethodAccessorImpl.java:39)
at sun.reflect.DelegatingMethodAccessorImpl.invoke(DelegatingMethodAccessorImpl.java:25)
at java.lang.reflect.Method.invoke(Method.java:585)
at org.codehaus.classworlds.Launcher.launchEnhanced(Launcher.java:315)
at org.codehaus.classworlds.Launcher.launch(Launcher.java:255)
at org.codehaus.classworlds.Launcher.mainWithExitCode(Launcher.java:430)
at org.codehaus.classworlds.Launcher.main(Launcher.java:375)
Caused by: org.apache.maven.project.ProjectBuildingException: Cannot find parent: org.apache.maven:maven-parent for project: null:maven:pom:2.1-SNAPSHOT for project null:maven:pom:2.1-SNAPSHOT
at org.apache.maven.project.DefaultMavenProjectBuilder.assembleLineage(DefaultMavenProjectBuilder.java:1370)
at org.apache.maven.project.DefaultMavenProjectBuilder.buildInternal(DefaultMavenProjectBuilder.java:821)
at org.apache.maven.project.DefaultMavenProjectBuilder.buildFromSourceFileInternal(DefaultMavenProjectBuilder.java:506)
at org.apache.maven.project.DefaultMavenProjectBuilder.build(DefaultMavenProjectBuilder.java:198)
at org.apache.maven.DefaultMaven.getProject(DefaultMaven.java:583)
at org.apache.maven.DefaultMaven.collectProjects(DefaultMaven.java:461)
at org.apache.maven.DefaultMaven.getProjects(DefaultMaven.java:365)
... 11 more
Caused by: org.apache.maven.project.ProjectBuildingException: POM 'org.apache.maven:maven-parent' not found in repository: Unable to download the artifact from any repository
org.apache.maven:maven-parent:pom:8
from the specified remote repositories:
Nexus (http://localhost:8081/nexus/content/groups/public)
for project org.apache.maven:maven-parent
at org.apache.maven.project.DefaultMavenProjectBuilder.findModelFromRepository(DefaultMavenProjectBuilder.java:603)
at org.apache.maven.project.DefaultMavenProjectBuilder.assembleLineage(DefaultMavenProjectBuilder.java:1366)
... 17 more
Caused by: org.apache.maven.artifact.resolver.ArtifactNotFoundException: Unable to download the artifact from any repository
org.apache.maven:maven-parent:pom:8
from the specified remote repositories:
Nexus (http://localhost:8081/nexus/content/groups/public)
at org.apache.maven.artifact.resolver.DefaultArtifactResolver.resolve(DefaultArtifactResolver.java:212)
at org.apache.maven.artifact.resolver.DefaultArtifactResolver.resolve(DefaultArtifactResolver.java:74)
at org.apache.maven.project.DefaultMavenProjectBuilder.findModelFromRepository(DefaultMavenProjectBuilder.java:556)
... 18 more
Caused by: org.apache.maven.wagon.ResourceDoesNotExistException: Unable to download the artifact from any repository
at org.apache.maven.artifact.manager.DefaultWagonManager.getArtifact(DefaultWagonManager.java:331)
at org.apache.maven.artifact.resolver.DefaultArtifactResolver.resolve(DefaultArtifactResolver.java:200)
... 20 more
[INFO] ------------------------------------------------------------------------
[INFO] Total time: 20 minutes 34 seconds
[INFO] Finished at: Mon Jun 30 04:37:19 CDT 2008
[INFO] Final Memory: 2M/134M
[INFO] ------------------------------------------------------------------------
Build failed in Hudson: Maven-2.1.x #174
Posted by Hudson <Hu...@sonatype.org>.
See http://ci.sonatype.org/job/Maven-2.1.x/174/changes
Changes:
[brett] [MNG-3634] revert portion of this change that caused a backwards compatibility problem
------------------------------------------
started
Updating https://svn.apache.org/repos/asf/maven/components/trunk
U maven-model/src/main/mdo/maven.mdo
At revision 672695
[maven-2.1.x] $ /opt/maven/2.0/bin/mvn clean deploy -B -U -e -Dmaven.repo.local=/home/j2ee-hudson/repos/Maven-2.1.x -Pstrict -Dsurefire.useFile=false
+ Error stacktraces are turned on.
[INFO] Scanning for projects...
[INFO] Reactor build order:
[INFO] Apache Maven
[INFO] Maven Workspace
[INFO] Maven Lifecycle Model
[INFO] Maven Reporting API
[INFO] Maven Model
[INFO] Maven Profile Model
[INFO] Maven Plugin API
[INFO] Maven Project Builder
[INFO] Maven Core
[INFO] Maven Toolchains
[INFO] Maven Embedder
[INFO] Maven Distribution
[INFO] ------------------------------------------------------------------------
[INFO] Building Apache Maven
[INFO] task-segment: [clean, deploy]
[INFO] ------------------------------------------------------------------------
[INFO] [clean:clean]
[INFO] Deleting directory http://ci.sonatype.org/job/Maven-2.1.x/ws/maven-2.1.x/target
[INFO] [enforcer:enforce {execution: enforce-jdk-15}]
[INFO] Setting property: classpath.resource.loader.class => 'org.codehaus.plexus.velocity.ContextClassLoaderResourceLoader'.
[INFO] Setting property: velocimacro.messages.on => 'false'.
[INFO] Setting property: resource.loader => 'classpath'.
[INFO] Setting property: resource.manager.logwhenfound => 'false'.
[INFO] [remote-resources:process {execution: default}]
[INFO] [site:attach-descriptor]
[INFO] Unable to load parent project from a relative path: Could not find the model file 'http://ci.sonatype.org/job/Maven-2.1.x/ws/maven-2.1.x/../pom/maven/pom.xml'. for project unknown
[INFO] Parent project loaded from repository.
[INFO] [install:install]
[INFO] Installing http://ci.sonatype.org/job/Maven-2.1.x/ws/maven-2.1.x/pom.xml to /home/j2ee-hudson/repos/Maven-2.1.x/org/apache/maven/maven/2.1-SNAPSHOT/maven-2.1-SNAPSHOT.pom
[INFO] [deploy:deploy]
altDeploymentRepository = null
[INFO] Retrieving previous build number from apache.snapshots
[WARNING] *** CHECKSUM FAILED - Invalid checksum file - RETRYING
[WARNING] *** CHECKSUM FAILED - Invalid checksum file - IGNORING
[INFO] repository metadata for: 'snapshot org.apache.maven:maven:2.1-SNAPSHOT' could not be found on repository: apache.snapshots, so will be created
Uploading: http://localhost:8081/nexus/content/repositories/maven.snapshots/org/apache/maven/maven/2.1-SNAPSHOT/maven-2.1-20080630.041701-1.pom
16K uploaded
[INFO] ------------------------------------------------------------------------
[ERROR] BUILD ERROR
[INFO] ------------------------------------------------------------------------
[INFO] Error deploying artifact: Failed to transfer file: http://localhost:8081/nexus/content/repositories/maven.snapshots/org/apache/maven/maven/2.1-SNAPSHOT/maven-2.1-20080630.041701-1.pom. Return code is: 500
[INFO] ------------------------------------------------------------------------
[INFO] Trace
org.apache.maven.lifecycle.LifecycleExecutionException: Error deploying artifact: Failed to transfer file: http://localhost:8081/nexus/content/repositories/maven.snapshots/org/apache/maven/maven/2.1-SNAPSHOT/maven-2.1-20080630.041701-1.pom. Return code is: 500
at org.apache.maven.lifecycle.DefaultLifecycleExecutor.executeGoals(DefaultLifecycleExecutor.java:583)
at org.apache.maven.lifecycle.DefaultLifecycleExecutor.executeGoalWithLifecycle(DefaultLifecycleExecutor.java:499)
at org.apache.maven.lifecycle.DefaultLifecycleExecutor.executeGoal(DefaultLifecycleExecutor.java:478)
at org.apache.maven.lifecycle.DefaultLifecycleExecutor.executeGoalAndHandleFailures(DefaultLifecycleExecutor.java:330)
at org.apache.maven.lifecycle.DefaultLifecycleExecutor.executeTaskSegments(DefaultLifecycleExecutor.java:291)
at org.apache.maven.lifecycle.DefaultLifecycleExecutor.execute(DefaultLifecycleExecutor.java:142)
at org.apache.maven.DefaultMaven.doExecute(DefaultMaven.java:336)
at org.apache.maven.DefaultMaven.execute(DefaultMaven.java:129)
at org.apache.maven.cli.MavenCli.main(MavenCli.java:287)
at sun.reflect.NativeMethodAccessorImpl.invoke0(Native Method)
at sun.reflect.NativeMethodAccessorImpl.invoke(NativeMethodAccessorImpl.java:39)
at sun.reflect.DelegatingMethodAccessorImpl.invoke(DelegatingMethodAccessorImpl.java:25)
at java.lang.reflect.Method.invoke(Method.java:585)
at org.codehaus.classworlds.Launcher.launchEnhanced(Launcher.java:315)
at org.codehaus.classworlds.Launcher.launch(Launcher.java:255)
at org.codehaus.classworlds.Launcher.mainWithExitCode(Launcher.java:430)
at org.codehaus.classworlds.Launcher.main(Launcher.java:375)
Caused by: org.apache.maven.plugin.MojoExecutionException: Error deploying artifact: Failed to transfer file: http://localhost:8081/nexus/content/repositories/maven.snapshots/org/apache/maven/maven/2.1-SNAPSHOT/maven-2.1-20080630.041701-1.pom. Return code is: 500
at org.apache.maven.plugin.deploy.DeployMojo.execute(DeployMojo.java:174)
at org.apache.maven.plugin.DefaultPluginManager.executeMojo(DefaultPluginManager.java:451)
at org.apache.maven.lifecycle.DefaultLifecycleExecutor.executeGoals(DefaultLifecycleExecutor.java:558)
... 16 more
Caused by: org.apache.maven.artifact.deployer.ArtifactDeploymentException: Error deploying artifact: Failed to transfer file: http://localhost:8081/nexus/content/repositories/maven.snapshots/org/apache/maven/maven/2.1-SNAPSHOT/maven-2.1-20080630.041701-1.pom. Return code is: 500
at org.apache.maven.artifact.deployer.DefaultArtifactDeployer.deploy(DefaultArtifactDeployer.java:94)
at org.apache.maven.plugin.deploy.DeployMojo.execute(DeployMojo.java:152)
... 18 more
Caused by: org.apache.maven.wagon.TransferFailedException: Failed to transfer file: http://localhost:8081/nexus/content/repositories/maven.snapshots/org/apache/maven/maven/2.1-SNAPSHOT/maven-2.1-20080630.041701-1.pom. Return code is: 500
at org.apache.maven.wagon.providers.http.LightweightHttpWagon.put(LightweightHttpWagon.java:172)
at org.apache.maven.artifact.manager.DefaultWagonManager.putRemoteFile(DefaultWagonManager.java:244)
at org.apache.maven.artifact.manager.DefaultWagonManager.putArtifact(DefaultWagonManager.java:160)
at org.apache.maven.artifact.deployer.DefaultArtifactDeployer.deploy(DefaultArtifactDeployer.java:80)
... 19 more
[INFO] ------------------------------------------------------------------------
[INFO] Total time: 12 seconds
[INFO] Finished at: Sun Jun 29 23:17:02 CDT 2008
[INFO] Final Memory: 35M/422M
[INFO] ------------------------------------------------------------------------
Build failed in Hudson: Maven-2.1.x #173
Posted by Hudson <Hu...@sonatype.org>.
See http://ci.sonatype.org/job/Maven-2.1.x/173/changes
Changes:
[vsiveton] o merged r672624 (replaced logical tag to be more consistent)
[vsiveton] o merged r672622 (removed unnecessary CDATA in description tags)
------------------------------------------
[...truncated 816 lines...]
[INFO] outputDirectory: http://ci.sonatype.org/job/Maven-2.1.x/ws/maven-2.1.x/maven-model/target/generated-sources/modello
[INFO] Working on model: src/main/mdo/maven.mdo
[INFO] Generating current version: 4.0.0
[WARNING] DEPRECATED [model]: Use models instead
[INFO] [modello:xpp3-reader {execution: standard}]
[INFO] outputDirectory: http://ci.sonatype.org/job/Maven-2.1.x/ws/maven-2.1.x/maven-model/target/generated-sources/modello
[INFO] Working on model: src/main/mdo/maven.mdo
[INFO] Generating current version: 4.0.0
[WARNING] DEPRECATED [model]: Use models instead
[INFO] [modello:xpp3-writer {execution: standard}]
[INFO] outputDirectory: http://ci.sonatype.org/job/Maven-2.1.x/ws/maven-2.1.x/maven-model/target/generated-sources/modello
[INFO] Working on model: src/main/mdo/maven.mdo
[INFO] Generating current version: 4.0.0
[INFO] [remote-resources:process {execution: default}]
[INFO] [resources:resources]
[INFO] Using default encoding to copy filtered resources.
[INFO] [compiler:compile]
[INFO] Compiling 46 source files to http://ci.sonatype.org/job/Maven-2.1.x/ws/maven-2.1.x/maven-model/target/classes
[INFO] [resources:testResources]
[INFO] Using default encoding to copy filtered resources.
[INFO] [compiler:testCompile]
[INFO] No sources to compile
[INFO] [surefire:test]
[INFO] Surefire report directory: http://ci.sonatype.org/job/Maven-2.1.x/ws/maven-2.1.x/maven-model/target/surefire-reports
-------------------------------------------------------
T E S T S
-------------------------------------------------------
There are no tests to run.
Results :
Tests run: 0, Failures: 0, Errors: 0, Skipped: 0
[INFO] [jar:jar]
[INFO] Building jar: http://ci.sonatype.org/job/Maven-2.1.x/ws/maven-2.1.x/maven-model/target/maven-model-2.1-SNAPSHOT.jar
[INFO] [install:install]
[INFO] Installing http://ci.sonatype.org/job/Maven-2.1.x/ws/maven-2.1.x/maven-model/target/maven-model-2.1-SNAPSHOT.jar to /home/j2ee-hudson/repos/Maven-2.1.x/org/apache/maven/maven-model/2.1-SNAPSHOT/maven-model-2.1-SNAPSHOT.jar
[INFO] [deploy:deploy]
altDeploymentRepository = null
[INFO] Retrieving previous build number from apache.snapshots
Uploading: http://localhost:8081/nexus/content/repositories/maven.snapshots/org/apache/maven/maven-model/2.1-SNAPSHOT/maven-model-2.1-20080629.141702-192.jar
90K uploaded
[INFO] Retrieving previous metadata from apache.snapshots
[INFO] Uploading repository metadata for: 'artifact org.apache.maven:maven-model'
[INFO] Retrieving previous metadata from apache.snapshots
[INFO] Uploading repository metadata for: 'snapshot org.apache.maven:maven-model:2.1-SNAPSHOT'
[INFO] Uploading project information for maven-model 2.1-20080629.141702-192
[INFO] ------------------------------------------------------------------------
[INFO] Building Maven Profile Model
[INFO] task-segment: [clean, deploy]
[INFO] ------------------------------------------------------------------------
[INFO] [clean:clean]
[INFO] Deleting directory http://ci.sonatype.org/job/Maven-2.1.x/ws/maven-2.1.x/maven-profile/target
[INFO] [enforcer:enforce {execution: enforce-jdk-15}]
[WARNING] DEPRECATED [model]: Use models instead
[INFO] [modello:java {execution: standard}]
[INFO] outputDirectory: http://ci.sonatype.org/job/Maven-2.1.x/ws/maven-2.1.x/maven-profile/target/generated-sources/modello
[INFO] Working on model: src/main/mdo/profiles.mdo
[INFO] Generating current version: 1.0.0
[WARNING] DEPRECATED [model]: Use models instead
[INFO] [modello:xpp3-reader {execution: standard}]
[INFO] outputDirectory: http://ci.sonatype.org/job/Maven-2.1.x/ws/maven-2.1.x/maven-profile/target/generated-sources/modello
[INFO] Working on model: src/main/mdo/profiles.mdo
[INFO] Generating current version: 1.0.0
[WARNING] DEPRECATED [model]: Use models instead
[INFO] [modello:xpp3-writer {execution: standard}]
[INFO] outputDirectory: http://ci.sonatype.org/job/Maven-2.1.x/ws/maven-2.1.x/maven-profile/target/generated-sources/modello
[INFO] Working on model: src/main/mdo/profiles.mdo
[INFO] Generating current version: 1.0.0
[INFO] [remote-resources:process {execution: default}]
[INFO] [resources:resources]
[INFO] Using default encoding to copy filtered resources.
[INFO] [compiler:compile]
[INFO] Compiling 15 source files to http://ci.sonatype.org/job/Maven-2.1.x/ws/maven-2.1.x/maven-profile/target/classes
[INFO] [resources:testResources]
[INFO] Using default encoding to copy filtered resources.
[INFO] [compiler:testCompile]
[INFO] No sources to compile
[INFO] [surefire:test]
[INFO] Surefire report directory: http://ci.sonatype.org/job/Maven-2.1.x/ws/maven-2.1.x/maven-profile/target/surefire-reports
-------------------------------------------------------
T E S T S
-------------------------------------------------------
There are no tests to run.
Results :
Tests run: 0, Failures: 0, Errors: 0, Skipped: 0
[INFO] [jar:jar]
[INFO] Building jar: http://ci.sonatype.org/job/Maven-2.1.x/ws/maven-2.1.x/maven-profile/target/maven-profile-2.1-SNAPSHOT.jar
[INFO] [install:install]
[INFO] Installing http://ci.sonatype.org/job/Maven-2.1.x/ws/maven-2.1.x/maven-profile/target/maven-profile-2.1-SNAPSHOT.jar to /home/j2ee-hudson/repos/Maven-2.1.x/org/apache/maven/maven-profile/2.1-SNAPSHOT/maven-profile-2.1-SNAPSHOT.jar
[INFO] [deploy:deploy]
altDeploymentRepository = null
[INFO] Retrieving previous build number from apache.snapshots
Uploading: http://localhost:8081/nexus/content/repositories/maven.snapshots/org/apache/maven/maven-profile/2.1-SNAPSHOT/maven-profile-2.1-20080629.141702-189.jar
34K uploaded
[INFO] Retrieving previous metadata from apache.snapshots
[INFO] Uploading repository metadata for: 'snapshot org.apache.maven:maven-profile:2.1-SNAPSHOT'
[INFO] Uploading project information for maven-profile 2.1-20080629.141702-189
[INFO] Retrieving previous metadata from apache.snapshots
[INFO] Uploading repository metadata for: 'artifact org.apache.maven:maven-profile'
[INFO] ------------------------------------------------------------------------
[INFO] Building Maven Plugin API
[INFO] task-segment: [clean, deploy]
[INFO] ------------------------------------------------------------------------
[INFO] [clean:clean]
[INFO] Deleting directory http://ci.sonatype.org/job/Maven-2.1.x/ws/maven-2.1.x/maven-plugin-api/target
[INFO] snapshot org.apache.maven.artifact:maven-artifact:3.0-SNAPSHOT: checking for updates from central
[INFO] snapshot org.apache.maven.artifact:maven-artifact:3.0-SNAPSHOT: checking for updates from codehaus.snapshots
[INFO] snapshot org.apache.maven.artifact:maven-artifact:3.0-SNAPSHOT: checking for updates from apache.snapshots
Downloading: http://localhost:8081/nexus/content/groups/public/org/apache/maven/artifact/maven-artifact/3.0-SNAPSHOT/maven-artifact-3.0-20080627.174652-98.pom
5K downloaded
Downloading: http://localhost:8081/nexus/content/groups/public/org/apache/maven/wagon/wagon-provider-api/1.0-beta-3/wagon-provider-api-1.0-beta-3.pom
906b downloaded
Downloading: http://localhost:8081/nexus/content/groups/public/org/apache/maven/wagon/wagon/1.0-beta-3/wagon-1.0-beta-3.pom
8K downloaded
Downloading: http://localhost:8081/nexus/content/groups/public/org/apache/maven/artifact/maven-artifact/3.0-SNAPSHOT/maven-artifact-3.0-20080627.174652-98.jar
211K downloaded
Downloading: http://localhost:8081/nexus/content/groups/public/org/apache/maven/wagon/wagon-provider-api/1.0-beta-3/wagon-provider-api-1.0-beta-3.jar
50K downloaded
[INFO] [enforcer:enforce {execution: enforce-jdk-15}]
[WARNING] DEPRECATED [model]: Use models instead
[INFO] [modello:java {execution: standard}]
[INFO] outputDirectory: http://ci.sonatype.org/job/Maven-2.1.x/ws/maven-2.1.x/maven-plugin-api/target/generated-sources/modello
[INFO] Working on model: src/main/mdo/lifecycle.mdo
[INFO] Generating current version: 1.0.0
[WARNING] DEPRECATED [model]: Use models instead
[INFO] [modello:xpp3-reader {execution: standard}]
[INFO] outputDirectory: http://ci.sonatype.org/job/Maven-2.1.x/ws/maven-2.1.x/maven-plugin-api/target/generated-sources/modello
[INFO] Working on model: src/main/mdo/lifecycle.mdo
[INFO] Generating current version: 1.0.0
[WARNING] DEPRECATED [model]: Use models instead
[INFO] [modello:xpp3-writer {execution: standard}]
[INFO] outputDirectory: http://ci.sonatype.org/job/Maven-2.1.x/ws/maven-2.1.x/maven-plugin-api/target/generated-sources/modello
[INFO] Working on model: src/main/mdo/lifecycle.mdo
[INFO] Generating current version: 1.0.0
[INFO] [remote-resources:process {execution: default}]
[INFO] [resources:resources]
[INFO] Using default encoding to copy filtered resources.
[INFO] [compiler:compile]
[INFO] Compiling 23 source files to http://ci.sonatype.org/job/Maven-2.1.x/ws/maven-2.1.x/maven-plugin-api/target/classes
[INFO] [resources:testResources]
[INFO] Using default encoding to copy filtered resources.
[INFO] [compiler:testCompile]
[INFO] Compiling 1 source file to http://ci.sonatype.org/job/Maven-2.1.x/ws/maven-2.1.x/maven-plugin-api/target/test-classes
[INFO] [surefire:test]
[INFO] Surefire report directory: http://ci.sonatype.org/job/Maven-2.1.x/ws/maven-2.1.x/maven-plugin-api/target/surefire-reports
-------------------------------------------------------
T E S T S
-------------------------------------------------------
Running org.apache.maven.plugin.lifecycle.LifecycleXpp3ReaderTest
Tests run: 1, Failures: 0, Errors: 0, Skipped: 0, Time elapsed: 0.066 sec
Results :
Tests run: 1, Failures: 0, Errors: 0, Skipped: 0
[INFO] [jar:jar]
[INFO] Building jar: http://ci.sonatype.org/job/Maven-2.1.x/ws/maven-2.1.x/maven-plugin-api/target/maven-plugin-api-2.1-SNAPSHOT.jar
[INFO] [install:install]
[INFO] Installing http://ci.sonatype.org/job/Maven-2.1.x/ws/maven-2.1.x/maven-plugin-api/target/maven-plugin-api-2.1-SNAPSHOT.jar to /home/j2ee-hudson/repos/Maven-2.1.x/org/apache/maven/maven-plugin-api/2.1-SNAPSHOT/maven-plugin-api-2.1-SNAPSHOT.jar
[INFO] [deploy:deploy]
altDeploymentRepository = null
[INFO] Retrieving previous build number from apache.snapshots
Uploading: http://localhost:8081/nexus/content/repositories/maven.snapshots/org/apache/maven/maven-plugin-api/2.1-SNAPSHOT/maven-plugin-api-2.1-20080629.141702-186.jar
42K uploaded
[INFO] Retrieving previous metadata from apache.snapshots
[INFO] Uploading repository metadata for: 'artifact org.apache.maven:maven-plugin-api'
[INFO] Retrieving previous metadata from apache.snapshots
[INFO] Uploading repository metadata for: 'snapshot org.apache.maven:maven-plugin-api:2.1-SNAPSHOT'
[INFO] Uploading project information for maven-plugin-api 2.1-20080629.141702-186
[INFO] ------------------------------------------------------------------------
[INFO] Building Maven Project Builder
[INFO] task-segment: [clean, deploy]
[INFO] ------------------------------------------------------------------------
Downloading: http://localhost:8081/nexus/content/groups/public/org/codehaus/mojo/aspectj-maven-plugin/1.0-beta-2/aspectj-maven-plugin-1.0-beta-2.pom
4K downloaded
Downloading: http://localhost:8081/nexus/content/groups/public/org/codehaus/mojo/mojo/12/mojo-12.pom
7K downloaded
Downloading: http://localhost:8081/nexus/content/groups/public/org/codehaus/mojo/aspectj-maven-plugin/1.0-beta-2/aspectj-maven-plugin-1.0-beta-2.jar
26K downloaded
[INFO] [clean:clean]
[INFO] Deleting directory http://ci.sonatype.org/job/Maven-2.1.x/ws/maven-2.1.x/maven-project/target
Downloading: http://localhost:8081/nexus/content/groups/public/org/codehaus/plexus/plexus-interpolation/1.0/plexus-interpolation-1.0.pom
1K downloaded
Downloading: http://localhost:8081/nexus/content/groups/public/org/apache/maven/wagon/wagon-file/1.0-beta-3/wagon-file-1.0-beta-3.pom
575b downloaded
Downloading: http://localhost:8081/nexus/content/groups/public/org/apache/maven/wagon/wagon-providers/1.0-beta-3/wagon-providers-1.0-beta-3.pom
1K downloaded
Downloading: http://localhost:8081/nexus/content/groups/public/org/codehaus/plexus/plexus-interpolation/1.0/plexus-interpolation-1.0.jar
33K downloaded
Downloading: http://localhost:8081/nexus/content/groups/public/org/apache/maven/wagon/wagon-file/1.0-beta-3/wagon-file-1.0-beta-3.jar
9K downloaded
[INFO] [enforcer:enforce {execution: enforce-jdk-15}]
[INFO] [remote-resources:process {execution: default}]
[INFO] [resources:resources]
[INFO] Using default encoding to copy filtered resources.
[INFO] [compiler:compile]
[INFO] Compiling 74 source files to http://ci.sonatype.org/job/Maven-2.1.x/ws/maven-2.1.x/maven-project/target/classes
[INFO] ------------------------------------------------------------------------
[ERROR] BUILD FAILURE
[INFO] ------------------------------------------------------------------------
[INFO] Compilation failure
http://ci.sonatype.org/job/Maven-2.1.x/ws/maven-2.1.x/maven-project/src/main/java/org/apache/maven/profiles/injection/DefaultProfileInjector.java :[362,50] cannot find symbol
symbol : method getDistributionManagement()
location: class org.apache.maven.model.Profile
http://ci.sonatype.org/job/Maven-2.1.x/ws/maven-2.1.x/maven-project/src/main/java/org/apache/maven/project/ModelUtils.java :[619,16] cannot find symbol
symbol : method getDistributionManagement()
location: class org.apache.maven.model.Profile
[INFO] ------------------------------------------------------------------------
[INFO] Trace
org.apache.maven.BuildFailureException: Compilation failure
at org.apache.maven.lifecycle.DefaultLifecycleExecutor.executeGoals(DefaultLifecycleExecutor.java:579)
at org.apache.maven.lifecycle.DefaultLifecycleExecutor.executeGoalWithLifecycle(DefaultLifecycleExecutor.java:499)
at org.apache.maven.lifecycle.DefaultLifecycleExecutor.executeGoal(DefaultLifecycleExecutor.java:478)
at org.apache.maven.lifecycle.DefaultLifecycleExecutor.executeGoalAndHandleFailures(DefaultLifecycleExecutor.java:330)
at org.apache.maven.lifecycle.DefaultLifecycleExecutor.executeTaskSegments(DefaultLifecycleExecutor.java:291)
at org.apache.maven.lifecycle.DefaultLifecycleExecutor.execute(DefaultLifecycleExecutor.java:142)
at org.apache.maven.DefaultMaven.doExecute(DefaultMaven.java:336)
at org.apache.maven.DefaultMaven.execute(DefaultMaven.java:129)
at org.apache.maven.cli.MavenCli.main(MavenCli.java:287)
at sun.reflect.NativeMethodAccessorImpl.invoke0(Native Method)
at sun.reflect.NativeMethodAccessorImpl.invoke(NativeMethodAccessorImpl.java:39)
at sun.reflect.DelegatingMethodAccessorImpl.invoke(DelegatingMethodAccessorImpl.java:25)
at java.lang.reflect.Method.invoke(Method.java:585)
at org.codehaus.classworlds.Launcher.launchEnhanced(Launcher.java:315)
at org.codehaus.classworlds.Launcher.launch(Launcher.java:255)
at org.codehaus.classworlds.Launcher.mainWithExitCode(Launcher.java:430)
at org.codehaus.classworlds.Launcher.main(Launcher.java:375)
Caused by: org.apache.maven.plugin.CompilationFailureException: Compilation failure
at org.apache.maven.plugin.AbstractCompilerMojo.execute(AbstractCompilerMojo.java:516)
at org.apache.maven.plugin.CompilerMojo.execute(CompilerMojo.java:114)
at org.apache.maven.plugin.DefaultPluginManager.executeMojo(DefaultPluginManager.java:451)
at org.apache.maven.lifecycle.DefaultLifecycleExecutor.executeGoals(DefaultLifecycleExecutor.java:558)
... 16 more
[INFO] ------------------------------------------------------------------------
[INFO] Total time: 24 seconds
[INFO] Finished at: Sun Jun 29 09:17:18 CDT 2008
[INFO] Final Memory: 51M/423M
[INFO] ------------------------------------------------------------------------
Build failed in Hudson: Maven-2.1.x #172
Posted by Hudson <Hu...@sonatype.org>.
See http://ci.sonatype.org/job/Maven-2.1.x/172/changes
Changes:
[vsiveton] o merged r672527 (MNG-3634: Improve the maven model to change the order of the POM elements)
------------------------------------------
[...truncated 174 lines...]
Tests run: 0, Failures: 0, Errors: 0, Skipped: 0
[INFO] [jar:jar]
[INFO] Building jar: http://ci.sonatype.org/job/Maven-2.1.x/ws/maven-2.1.x/maven-reporting-api/target/maven-reporting-api-2.1-SNAPSHOT.jar
[INFO] [install:install]
[INFO] Installing http://ci.sonatype.org/job/Maven-2.1.x/ws/maven-2.1.x/maven-reporting-api/target/maven-reporting-api-2.1-SNAPSHOT.jar to /home/j2ee-hudson/repos/Maven-2.1.x/org/apache/maven/maven-reporting-api/2.1-SNAPSHOT/maven-reporting-api-2.1-SNAPSHOT.jar
[INFO] [deploy:deploy]
altDeploymentRepository = null
[INFO] Retrieving previous build number from apache.snapshots
Uploading: http://localhost:8081/nexus/content/repositories/maven.snapshots/org/apache/maven/maven-reporting-api/2.1-SNAPSHOT/maven-reporting-api-2.1-20080628.151701-169.jar
9K uploaded
[INFO] Uploading project information for maven-reporting-api 2.1-20080628.151701-169
[INFO] Retrieving previous metadata from apache.snapshots
[INFO] Uploading repository metadata for: 'artifact org.apache.maven:maven-reporting-api'
[INFO] Retrieving previous metadata from apache.snapshots
[INFO] Uploading repository metadata for: 'snapshot org.apache.maven:maven-reporting-api:2.1-SNAPSHOT'
[INFO] ------------------------------------------------------------------------
[INFO] Building Maven Model
[INFO] task-segment: [clean, deploy]
[INFO] ------------------------------------------------------------------------
[INFO] [clean:clean]
[INFO] Deleting directory http://ci.sonatype.org/job/Maven-2.1.x/ws/maven-2.1.x/maven-model/target
[INFO] [enforcer:enforce {execution: enforce-jdk-15}]
[WARNING] DEPRECATED [model]: Use models instead
[INFO] [modello:java {execution: standard}]
[INFO] outputDirectory: http://ci.sonatype.org/job/Maven-2.1.x/ws/maven-2.1.x/maven-model/target/generated-sources/modello
[INFO] Working on model: src/main/mdo/maven.mdo
[INFO] Generating current version: 4.0.0
[WARNING] DEPRECATED [model]: Use models instead
[INFO] [modello:xpp3-reader {execution: standard}]
[INFO] outputDirectory: http://ci.sonatype.org/job/Maven-2.1.x/ws/maven-2.1.x/maven-model/target/generated-sources/modello
[INFO] Working on model: src/main/mdo/maven.mdo
[INFO] Generating current version: 4.0.0
[WARNING] DEPRECATED [model]: Use models instead
[INFO] [modello:xpp3-writer {execution: standard}]
[INFO] outputDirectory: http://ci.sonatype.org/job/Maven-2.1.x/ws/maven-2.1.x/maven-model/target/generated-sources/modello
[INFO] Working on model: src/main/mdo/maven.mdo
[INFO] Generating current version: 4.0.0
[INFO] [remote-resources:process {execution: default}]
[INFO] [resources:resources]
[INFO] Using default encoding to copy filtered resources.
[INFO] [compiler:compile]
[INFO] Compiling 46 source files to http://ci.sonatype.org/job/Maven-2.1.x/ws/maven-2.1.x/maven-model/target/classes
[INFO] [resources:testResources]
[INFO] Using default encoding to copy filtered resources.
[INFO] [compiler:testCompile]
[INFO] No sources to compile
[INFO] [surefire:test]
[INFO] Surefire report directory: http://ci.sonatype.org/job/Maven-2.1.x/ws/maven-2.1.x/maven-model/target/surefire-reports
-------------------------------------------------------
T E S T S
-------------------------------------------------------
There are no tests to run.
Results :
Tests run: 0, Failures: 0, Errors: 0, Skipped: 0
[INFO] [jar:jar]
[INFO] Building jar: http://ci.sonatype.org/job/Maven-2.1.x/ws/maven-2.1.x/maven-model/target/maven-model-2.1-SNAPSHOT.jar
[INFO] [install:install]
[INFO] Installing http://ci.sonatype.org/job/Maven-2.1.x/ws/maven-2.1.x/maven-model/target/maven-model-2.1-SNAPSHOT.jar to /home/j2ee-hudson/repos/Maven-2.1.x/org/apache/maven/maven-model/2.1-SNAPSHOT/maven-model-2.1-SNAPSHOT.jar
[INFO] [deploy:deploy]
altDeploymentRepository = null
[INFO] Retrieving previous build number from apache.snapshots
Uploading: http://localhost:8081/nexus/content/repositories/maven.snapshots/org/apache/maven/maven-model/2.1-SNAPSHOT/maven-model-2.1-20080628.151701-191.jar
90K uploaded
[INFO] Retrieving previous metadata from apache.snapshots
[INFO] Uploading repository metadata for: 'artifact org.apache.maven:maven-model'
[INFO] Retrieving previous metadata from apache.snapshots
[INFO] Uploading repository metadata for: 'snapshot org.apache.maven:maven-model:2.1-SNAPSHOT'
[INFO] Uploading project information for maven-model 2.1-20080628.151701-191
[INFO] ------------------------------------------------------------------------
[INFO] Building Maven Profile Model
[INFO] task-segment: [clean, deploy]
[INFO] ------------------------------------------------------------------------
[INFO] [clean:clean]
[INFO] Deleting directory http://ci.sonatype.org/job/Maven-2.1.x/ws/maven-2.1.x/maven-profile/target
[INFO] [enforcer:enforce {execution: enforce-jdk-15}]
[WARNING] DEPRECATED [model]: Use models instead
[INFO] [modello:java {execution: standard}]
[INFO] outputDirectory: http://ci.sonatype.org/job/Maven-2.1.x/ws/maven-2.1.x/maven-profile/target/generated-sources/modello
[INFO] Working on model: src/main/mdo/profiles.mdo
[INFO] Generating current version: 1.0.0
[WARNING] DEPRECATED [model]: Use models instead
[INFO] [modello:xpp3-reader {execution: standard}]
[INFO] outputDirectory: http://ci.sonatype.org/job/Maven-2.1.x/ws/maven-2.1.x/maven-profile/target/generated-sources/modello
[INFO] Working on model: src/main/mdo/profiles.mdo
[INFO] Generating current version: 1.0.0
[WARNING] DEPRECATED [model]: Use models instead
[INFO] [modello:xpp3-writer {execution: standard}]
[INFO] outputDirectory: http://ci.sonatype.org/job/Maven-2.1.x/ws/maven-2.1.x/maven-profile/target/generated-sources/modello
[INFO] Working on model: src/main/mdo/profiles.mdo
[INFO] Generating current version: 1.0.0
[INFO] [remote-resources:process {execution: default}]
[INFO] [resources:resources]
[INFO] Using default encoding to copy filtered resources.
[INFO] [compiler:compile]
[INFO] Compiling 15 source files to http://ci.sonatype.org/job/Maven-2.1.x/ws/maven-2.1.x/maven-profile/target/classes
[INFO] [resources:testResources]
[INFO] Using default encoding to copy filtered resources.
[INFO] [compiler:testCompile]
[INFO] No sources to compile
[INFO] [surefire:test]
[INFO] Surefire report directory: http://ci.sonatype.org/job/Maven-2.1.x/ws/maven-2.1.x/maven-profile/target/surefire-reports
-------------------------------------------------------
T E S T S
-------------------------------------------------------
There are no tests to run.
Results :
Tests run: 0, Failures: 0, Errors: 0, Skipped: 0
[INFO] [jar:jar]
[INFO] Building jar: http://ci.sonatype.org/job/Maven-2.1.x/ws/maven-2.1.x/maven-profile/target/maven-profile-2.1-SNAPSHOT.jar
[INFO] [install:install]
[INFO] Installing http://ci.sonatype.org/job/Maven-2.1.x/ws/maven-2.1.x/maven-profile/target/maven-profile-2.1-SNAPSHOT.jar to /home/j2ee-hudson/repos/Maven-2.1.x/org/apache/maven/maven-profile/2.1-SNAPSHOT/maven-profile-2.1-SNAPSHOT.jar
[INFO] [deploy:deploy]
altDeploymentRepository = null
[INFO] Retrieving previous build number from apache.snapshots
Uploading: http://localhost:8081/nexus/content/repositories/maven.snapshots/org/apache/maven/maven-profile/2.1-SNAPSHOT/maven-profile-2.1-20080628.151701-188.jar
34K uploaded
[INFO] Retrieving previous metadata from apache.snapshots
[INFO] Uploading repository metadata for: 'snapshot org.apache.maven:maven-profile:2.1-SNAPSHOT'
[INFO] Uploading project information for maven-profile 2.1-20080628.151701-188
[INFO] Retrieving previous metadata from apache.snapshots
[INFO] Uploading repository metadata for: 'artifact org.apache.maven:maven-profile'
[INFO] ------------------------------------------------------------------------
[INFO] Building Maven Plugin API
[INFO] task-segment: [clean, deploy]
[INFO] ------------------------------------------------------------------------
[INFO] [clean:clean]
[INFO] Deleting directory http://ci.sonatype.org/job/Maven-2.1.x/ws/maven-2.1.x/maven-plugin-api/target
[INFO] snapshot org.apache.maven.artifact:maven-artifact:3.0-SNAPSHOT: checking for updates from central
[INFO] snapshot org.apache.maven.artifact:maven-artifact:3.0-SNAPSHOT: checking for updates from codehaus.snapshots
[INFO] snapshot org.apache.maven.artifact:maven-artifact:3.0-SNAPSHOT: checking for updates from apache.snapshots
[INFO] [enforcer:enforce {execution: enforce-jdk-15}]
[WARNING] DEPRECATED [model]: Use models instead
[INFO] [modello:java {execution: standard}]
[INFO] outputDirectory: http://ci.sonatype.org/job/Maven-2.1.x/ws/maven-2.1.x/maven-plugin-api/target/generated-sources/modello
[INFO] Working on model: src/main/mdo/lifecycle.mdo
[INFO] Generating current version: 1.0.0
[WARNING] DEPRECATED [model]: Use models instead
[INFO] [modello:xpp3-reader {execution: standard}]
[INFO] outputDirectory: http://ci.sonatype.org/job/Maven-2.1.x/ws/maven-2.1.x/maven-plugin-api/target/generated-sources/modello
[INFO] Working on model: src/main/mdo/lifecycle.mdo
[INFO] Generating current version: 1.0.0
[WARNING] DEPRECATED [model]: Use models instead
[INFO] [modello:xpp3-writer {execution: standard}]
[INFO] outputDirectory: http://ci.sonatype.org/job/Maven-2.1.x/ws/maven-2.1.x/maven-plugin-api/target/generated-sources/modello
[INFO] Working on model: src/main/mdo/lifecycle.mdo
[INFO] Generating current version: 1.0.0
[INFO] [remote-resources:process {execution: default}]
[INFO] [resources:resources]
[INFO] Using default encoding to copy filtered resources.
[INFO] [compiler:compile]
[INFO] Compiling 23 source files to http://ci.sonatype.org/job/Maven-2.1.x/ws/maven-2.1.x/maven-plugin-api/target/classes
[INFO] [resources:testResources]
[INFO] Using default encoding to copy filtered resources.
[INFO] [compiler:testCompile]
[INFO] Compiling 1 source file to http://ci.sonatype.org/job/Maven-2.1.x/ws/maven-2.1.x/maven-plugin-api/target/test-classes
[INFO] [surefire:test]
[INFO] Surefire report directory: http://ci.sonatype.org/job/Maven-2.1.x/ws/maven-2.1.x/maven-plugin-api/target/surefire-reports
-------------------------------------------------------
T E S T S
-------------------------------------------------------
Running org.apache.maven.plugin.lifecycle.LifecycleXpp3ReaderTest
Tests run: 1, Failures: 0, Errors: 0, Skipped: 0, Time elapsed: 0.066 sec
Results :
Tests run: 1, Failures: 0, Errors: 0, Skipped: 0
[INFO] [jar:jar]
[INFO] Building jar: http://ci.sonatype.org/job/Maven-2.1.x/ws/maven-2.1.x/maven-plugin-api/target/maven-plugin-api-2.1-SNAPSHOT.jar
[INFO] [install:install]
[INFO] Installing http://ci.sonatype.org/job/Maven-2.1.x/ws/maven-2.1.x/maven-plugin-api/target/maven-plugin-api-2.1-SNAPSHOT.jar to /home/j2ee-hudson/repos/Maven-2.1.x/org/apache/maven/maven-plugin-api/2.1-SNAPSHOT/maven-plugin-api-2.1-SNAPSHOT.jar
[INFO] [deploy:deploy]
altDeploymentRepository = null
[INFO] Retrieving previous build number from apache.snapshots
Uploading: http://localhost:8081/nexus/content/repositories/maven.snapshots/org/apache/maven/maven-plugin-api/2.1-SNAPSHOT/maven-plugin-api-2.1-20080628.151701-185.jar
42K uploaded
[INFO] Retrieving previous metadata from apache.snapshots
[INFO] Uploading repository metadata for: 'artifact org.apache.maven:maven-plugin-api'
[INFO] Retrieving previous metadata from apache.snapshots
[INFO] Uploading repository metadata for: 'snapshot org.apache.maven:maven-plugin-api:2.1-SNAPSHOT'
[INFO] Uploading project information for maven-plugin-api 2.1-20080628.151701-185
[INFO] ------------------------------------------------------------------------
[INFO] Building Maven Project Builder
[INFO] task-segment: [clean, deploy]
[INFO] ------------------------------------------------------------------------
[INFO] [clean:clean]
[INFO] Deleting directory http://ci.sonatype.org/job/Maven-2.1.x/ws/maven-2.1.x/maven-project/target
[INFO] [enforcer:enforce {execution: enforce-jdk-15}]
[INFO] [remote-resources:process {execution: default}]
[INFO] [resources:resources]
[INFO] Using default encoding to copy filtered resources.
[INFO] [compiler:compile]
[INFO] Compiling 74 source files to http://ci.sonatype.org/job/Maven-2.1.x/ws/maven-2.1.x/maven-project/target/classes
[INFO] ------------------------------------------------------------------------
[ERROR] BUILD FAILURE
[INFO] ------------------------------------------------------------------------
[INFO] Compilation failure
http://ci.sonatype.org/job/Maven-2.1.x/ws/maven-2.1.x/maven-project/src/main/java/org/apache/maven/profiles/injection/DefaultProfileInjector.java :[362,50] cannot find symbol
symbol : method getDistributionManagement()
location: class org.apache.maven.model.Profile
http://ci.sonatype.org/job/Maven-2.1.x/ws/maven-2.1.x/maven-project/src/main/java/org/apache/maven/project/ModelUtils.java :[619,16] cannot find symbol
symbol : method getDistributionManagement()
location: class org.apache.maven.model.Profile
[INFO] ------------------------------------------------------------------------
[INFO] Trace
org.apache.maven.BuildFailureException: Compilation failure
at org.apache.maven.lifecycle.DefaultLifecycleExecutor.executeGoals(DefaultLifecycleExecutor.java:579)
at org.apache.maven.lifecycle.DefaultLifecycleExecutor.executeGoalWithLifecycle(DefaultLifecycleExecutor.java:499)
at org.apache.maven.lifecycle.DefaultLifecycleExecutor.executeGoal(DefaultLifecycleExecutor.java:478)
at org.apache.maven.lifecycle.DefaultLifecycleExecutor.executeGoalAndHandleFailures(DefaultLifecycleExecutor.java:330)
at org.apache.maven.lifecycle.DefaultLifecycleExecutor.executeTaskSegments(DefaultLifecycleExecutor.java:291)
at org.apache.maven.lifecycle.DefaultLifecycleExecutor.execute(DefaultLifecycleExecutor.java:142)
at org.apache.maven.DefaultMaven.doExecute(DefaultMaven.java:336)
at org.apache.maven.DefaultMaven.execute(DefaultMaven.java:129)
at org.apache.maven.cli.MavenCli.main(MavenCli.java:287)
at sun.reflect.NativeMethodAccessorImpl.invoke0(Native Method)
at sun.reflect.NativeMethodAccessorImpl.invoke(NativeMethodAccessorImpl.java:39)
at sun.reflect.DelegatingMethodAccessorImpl.invoke(DelegatingMethodAccessorImpl.java:25)
at java.lang.reflect.Method.invoke(Method.java:585)
at org.codehaus.classworlds.Launcher.launchEnhanced(Launcher.java:315)
at org.codehaus.classworlds.Launcher.launch(Launcher.java:255)
at org.codehaus.classworlds.Launcher.mainWithExitCode(Launcher.java:430)
at org.codehaus.classworlds.Launcher.main(Launcher.java:375)
Caused by: org.apache.maven.plugin.CompilationFailureException: Compilation failure
at org.apache.maven.plugin.AbstractCompilerMojo.execute(AbstractCompilerMojo.java:516)
at org.apache.maven.plugin.CompilerMojo.execute(CompilerMojo.java:114)
at org.apache.maven.plugin.DefaultPluginManager.executeMojo(DefaultPluginManager.java:451)
at org.apache.maven.lifecycle.DefaultLifecycleExecutor.executeGoals(DefaultLifecycleExecutor.java:558)
... 16 more
[INFO] ------------------------------------------------------------------------
[INFO] Total time: 21 seconds
[INFO] Finished at: Sat Jun 28 10:17:17 CDT 2008
[INFO] Final Memory: 50M/417M
[INFO] ------------------------------------------------------------------------