You are viewing a plain text version of this content. The canonical link for it is here.
Posted to notifications@maven.apache.org by Apache Jenkins Server <je...@builds.apache.org> on 2011/08/12 17:07:08 UTC
Build failed in Jenkins: maven-sandbox-plexus-utils-commons-bridge
#52
See <https://builds.apache.org/job/maven-sandbox-plexus-utils-commons-bridge/52/changes>
Changes:
[struberg] MSANDBOX-51 fork Os.java over from Apache ant.
We also needed to make a few static fields public
due to compat reasons with the old plexus-utils.
------------------------------------------
Started by an SCM change
Building remotely on solaris1
Updating https://svn.apache.org/repos/asf/maven/sandbox/trunk/plexus-utils-commons-bridge
AU plexus-utils-commons-bridge/src/main/java/org/codehaus/plexus/util/Os.java
A plexus-utils-tck/src/test/java/org/codehaus/plexus/util/OsTest.java
At revision 1157142
[maven-sandbox-plexus-utils-commons-bridge] $ /export/home/hudson/hudson-slave/tools/Maven_3.0.3/bin/mvn clean verify -Dmaven.test.failure.ignore=true
Warning: JAVA_HOME environment variable is not set.
[INFO] Scanning for projects...
[INFO] ------------------------------------------------------------------------
[INFO] Reactor Build Order:
[INFO]
[INFO] Plexus Utils to Apache Commons bridge Parent
[INFO] Plexus Utils Test Compatibility Kit
[INFO] Plexus Utils to Apache Commons bridge
[INFO]
[INFO] ------------------------------------------------------------------------
[INFO] Building Plexus Utils to Apache Commons bridge Parent 0.1-SNAPSHOT
[INFO] ------------------------------------------------------------------------
[INFO]
[INFO] --- maven-clean-plugin:2.4.1:clean (default-clean) @ plexus-utils-commons-bridge-parent ---
[INFO] Deleting /zonestorage/hudson_solaris/home/hudson/hudson-slave/workspace/maven-sandbox-plexus-utils-commons-bridge/target
[INFO]
[INFO] --- maven-remote-resources-plugin:1.1:process (default) @ plexus-utils-commons-bridge-parent ---
[INFO] Setting property: classpath.resource.loader.class => 'org.codehaus.plexus.velocity.ContextClassLoaderResourceLoader'.
[INFO] Setting property: velocimacro.messages.on => 'false'.
[INFO] Setting property: resource.loader => 'classpath'.
[INFO] Setting property: resource.manager.logwhenfound => 'false'.
[INFO]
[INFO] --- maven-site-plugin:3.0-beta-3:attach-descriptor (attach-descriptor) @ plexus-utils-commons-bridge-parent ---
[INFO]
[INFO] ------------------------------------------------------------------------
[INFO] Building Plexus Utils Test Compatibility Kit 0.1-SNAPSHOT
[INFO] ------------------------------------------------------------------------
[INFO]
[INFO] --- maven-clean-plugin:2.4.1:clean (default-clean) @ plexus-utils-tck ---
[INFO] Deleting /zonestorage/hudson_solaris/home/hudson/hudson-slave/workspace/maven-sandbox-plexus-utils-commons-bridge/plexus-utils-tck/target
[INFO]
[INFO] --- maven-remote-resources-plugin:1.1:process (default) @ plexus-utils-tck ---
[INFO]
[INFO] --- maven-resources-plugin:2.4:resources (default-resources) @ plexus-utils-tck ---
[INFO] Using 'UTF-8' encoding to copy filtered resources.
[INFO] skip non existing resourceDirectory /zonestorage/hudson_solaris/home/hudson/hudson-slave/workspace/maven-sandbox-plexus-utils-commons-bridge/plexus-utils-tck/src/main/resources
[INFO] Copying 3 resources
[INFO]
[INFO] --- maven-compiler-plugin:2.3.2:compile (default-compile) @ plexus-utils-tck ---
[INFO] Nothing to compile - all classes are up to date
[INFO]
[INFO] --- maven-resources-plugin:2.4:testResources (default-testResources) @ plexus-utils-tck ---
[INFO] Using 'UTF-8' encoding to copy filtered resources.
[INFO] Copying 1 resource
[INFO] Copying 3 resources
[INFO]
[INFO] --- maven-compiler-plugin:2.3.2:testCompile (default-testCompile) @ plexus-utils-tck ---
[INFO] Compiling 19 source files to /zonestorage/hudson_solaris/home/hudson/hudson-slave/workspace/maven-sandbox-plexus-utils-commons-bridge/plexus-utils-tck/target/test-classes
[INFO] -------------------------------------------------------------
[ERROR] COMPILATION ERROR :
[INFO] -------------------------------------------------------------
[ERROR] /zonestorage/hudson_solaris/home/hudson/hudson-slave/workspace/maven-sandbox-plexus-utils-commons-bridge/plexus-utils-tck/src/test/java/org/codehaus/plexus/util/reflection/ReflectorTestHelper.java:[60,50] cannot find symbol
symbol : method isEmpty()
location: class java.lang.String
[ERROR] /zonestorage/hudson_solaris/home/hudson/hudson-slave/workspace/maven-sandbox-plexus-utils-commons-bridge/plexus-utils-tck/src/test/java/org/codehaus/plexus/util/reflection/ReflectorTestHelper.java:[91,50] cannot find symbol
symbol : method isEmpty()
location: class java.lang.String
[ERROR] /zonestorage/hudson_solaris/home/hudson/hudson-slave/workspace/maven-sandbox-plexus-utils-commons-bridge/plexus-utils-tck/src/test/java/org/codehaus/plexus/util/ExceptionUtilsTest.java:[161,36] cannot find symbol
symbol : constructor SQLException(java.lang.NullPointerException)
location: class java.sql.SQLException
[ERROR] /zonestorage/hudson_solaris/home/hudson/hudson-slave/workspace/maven-sandbox-plexus-utils-commons-bridge/plexus-utils-tck/src/test/java/org/codehaus/plexus/util/ExceptionUtilsTest.java:[173,36] cannot find symbol
symbol : constructor SQLException(java.lang.NullPointerException)
location: class java.sql.SQLException
[ERROR] /zonestorage/hudson_solaris/home/hudson/hudson-slave/workspace/maven-sandbox-plexus-utils-commons-bridge/plexus-utils-tck/src/test/java/org/codehaus/plexus/util/ExceptionUtilsTest.java:[196,36] cannot find symbol
symbol : constructor SQLException(java.lang.NullPointerException)
location: class java.sql.SQLException
[ERROR] /zonestorage/hudson_solaris/home/hudson/hudson-slave/workspace/maven-sandbox-plexus-utils-commons-bridge/plexus-utils-tck/src/test/java/org/codehaus/plexus/util/ExceptionUtilsTest.java:[237,36] cannot find symbol
symbol : constructor SQLException(java.lang.NullPointerException)
location: class java.sql.SQLException
[ERROR] /zonestorage/hudson_solaris/home/hudson/hudson-slave/workspace/maven-sandbox-plexus-utils-commons-bridge/plexus-utils-tck/src/test/java/org/codehaus/plexus/util/ExceptionUtilsTest.java:[293,36] cannot find symbol
symbol : constructor SQLException(java.lang.NullPointerException)
location: class java.sql.SQLException
[ERROR] /zonestorage/hudson_solaris/home/hudson/hudson-slave/workspace/maven-sandbox-plexus-utils-commons-bridge/plexus-utils-tck/src/test/java/org/codehaus/plexus/util/ExceptionUtilsTest.java:[322,36] cannot find symbol
symbol : constructor SQLException(java.lang.NullPointerException)
location: class java.sql.SQLException
[ERROR] /zonestorage/hudson_solaris/home/hudson/hudson-slave/workspace/maven-sandbox-plexus-utils-commons-bridge/plexus-utils-tck/src/test/java/org/codehaus/plexus/util/ExceptionUtilsTest.java:[403,36] cannot find symbol
symbol : constructor SQLException(java.lang.NullPointerException)
location: class java.sql.SQLException
[ERROR] /zonestorage/hudson_solaris/home/hudson/hudson-slave/workspace/maven-sandbox-plexus-utils-commons-bridge/plexus-utils-tck/src/test/java/org/codehaus/plexus/util/ExceptionUtilsTest.java:[445,36] cannot find symbol
symbol : constructor SQLException(java.lang.NullPointerException)
location: class java.sql.SQLException
[INFO] 10 errors
[INFO] -------------------------------------------------------------
[INFO] ------------------------------------------------------------------------
[INFO] Reactor Summary:
[INFO]
[INFO] Plexus Utils to Apache Commons bridge Parent ...... SUCCESS [14.140s]
[INFO] Plexus Utils Test Compatibility Kit ............... FAILURE [5.553s]
[INFO] Plexus Utils to Apache Commons bridge ............. SKIPPED
[INFO] ------------------------------------------------------------------------
[INFO] BUILD FAILURE
[INFO] ------------------------------------------------------------------------
[INFO] Total time: 20.280s
[INFO] Finished at: Fri Aug 12 15:07:48 GMT+00:00 2011
[INFO] Final Memory: 15M/217M
[INFO] ------------------------------------------------------------------------
[ERROR] Failed to execute goal org.apache.maven.plugins:maven-compiler-plugin:2.3.2:testCompile (default-testCompile) on project plexus-utils-tck: Compilation failure: Compilation failure:
[ERROR] /zonestorage/hudson_solaris/home/hudson/hudson-slave/workspace/maven-sandbox-plexus-utils-commons-bridge/plexus-utils-tck/src/test/java/org/codehaus/plexus/util/reflection/ReflectorTestHelper.java:[60,50] cannot find symbol
[ERROR] symbol : method isEmpty()
[ERROR] location: class java.lang.String
[ERROR] /zonestorage/hudson_solaris/home/hudson/hudson-slave/workspace/maven-sandbox-plexus-utils-commons-bridge/plexus-utils-tck/src/test/java/org/codehaus/plexus/util/reflection/ReflectorTestHelper.java:[91,50] cannot find symbol
[ERROR] symbol : method isEmpty()
[ERROR] location: class java.lang.String
[ERROR] /zonestorage/hudson_solaris/home/hudson/hudson-slave/workspace/maven-sandbox-plexus-utils-commons-bridge/plexus-utils-tck/src/test/java/org/codehaus/plexus/util/ExceptionUtilsTest.java:[161,36] cannot find symbol
[ERROR] symbol : constructor SQLException(java.lang.NullPointerException)
[ERROR] location: class java.sql.SQLException
[ERROR] /zonestorage/hudson_solaris/home/hudson/hudson-slave/workspace/maven-sandbox-plexus-utils-commons-bridge/plexus-utils-tck/src/test/java/org/codehaus/plexus/util/ExceptionUtilsTest.java:[173,36] cannot find symbol
[ERROR] symbol : constructor SQLException(java.lang.NullPointerException)
[ERROR] location: class java.sql.SQLException
[ERROR] /zonestorage/hudson_solaris/home/hudson/hudson-slave/workspace/maven-sandbox-plexus-utils-commons-bridge/plexus-utils-tck/src/test/java/org/codehaus/plexus/util/ExceptionUtilsTest.java:[196,36] cannot find symbol
[ERROR] symbol : constructor SQLException(java.lang.NullPointerException)
[ERROR] location: class java.sql.SQLException
[ERROR] /zonestorage/hudson_solaris/home/hudson/hudson-slave/workspace/maven-sandbox-plexus-utils-commons-bridge/plexus-utils-tck/src/test/java/org/codehaus/plexus/util/ExceptionUtilsTest.java:[237,36] cannot find symbol
[ERROR] symbol : constructor SQLException(java.lang.NullPointerException)
[ERROR] location: class java.sql.SQLException
[ERROR] /zonestorage/hudson_solaris/home/hudson/hudson-slave/workspace/maven-sandbox-plexus-utils-commons-bridge/plexus-utils-tck/src/test/java/org/codehaus/plexus/util/ExceptionUtilsTest.java:[293,36] cannot find symbol
[ERROR] symbol : constructor SQLException(java.lang.NullPointerException)
[ERROR] location: class java.sql.SQLException
[ERROR] /zonestorage/hudson_solaris/home/hudson/hudson-slave/workspace/maven-sandbox-plexus-utils-commons-bridge/plexus-utils-tck/src/test/java/org/codehaus/plexus/util/ExceptionUtilsTest.java:[322,36] cannot find symbol
[ERROR] symbol : constructor SQLException(java.lang.NullPointerException)
[ERROR] location: class java.sql.SQLException
[ERROR] /zonestorage/hudson_solaris/home/hudson/hudson-slave/workspace/maven-sandbox-plexus-utils-commons-bridge/plexus-utils-tck/src/test/java/org/codehaus/plexus/util/ExceptionUtilsTest.java:[403,36] cannot find symbol
[ERROR] symbol : constructor SQLException(java.lang.NullPointerException)
[ERROR] location: class java.sql.SQLException
[ERROR] /zonestorage/hudson_solaris/home/hudson/hudson-slave/workspace/maven-sandbox-plexus-utils-commons-bridge/plexus-utils-tck/src/test/java/org/codehaus/plexus/util/ExceptionUtilsTest.java:[445,36] cannot find symbol
[ERROR] symbol : constructor SQLException(java.lang.NullPointerException)
[ERROR] location: class java.sql.SQLException
[ERROR] -> [Help 1]
[ERROR]
[ERROR] To see the full stack trace of the errors, re-run Maven with the -e switch.
[ERROR] Re-run Maven using the -X switch to enable full debug logging.
[ERROR]
[ERROR] For more information about the errors and possible solutions, please read the following articles:
[ERROR] [Help 1] http://cwiki.apache.org/confluence/display/MAVEN/MojoFailureException
[ERROR]
[ERROR] After correcting the problems, you can resume the build with the command
[ERROR] mvn <goals> -rf :plexus-utils-tck
[WARNINGS] Skipping publisher since build result is FAILURE
Recording test results