You are viewing a plain text version of this content. The canonical link for it is here.
Posted to notifications@zookeeper.apache.org by Apache Jenkins Server <je...@builds.apache.org> on 2020/05/06 12:15:04 UTC
ZooKeeper_branch35_jdk8 - Build # 1819 - Still Failing
See https://builds.apache.org/job/ZooKeeper_branch35_jdk8/1819/
###################################################################################
########################## LAST 60 LINES OF THE CONSOLE ###########################
[...truncated 71.34 KB...]
[junit] Running org.apache.zookeeper.test.ServerCnxnTest in thread 2
[junit] Tests run: 1, Failures: 0, Errors: 0, Skipped: 0, Time elapsed: 5.685 sec, Thread: 4, Class: org.apache.zookeeper.test.SaslDigestAuthOverSSLTest
[junit] Tests run: 1, Failures: 0, Errors: 0, Skipped: 0, Time elapsed: 5.4 sec, Thread: 3, Class: org.apache.zookeeper.test.SaslKerberosAuthOverSSLTest
[junit] Tests run: 1, Failures: 0, Errors: 0, Skipped: 0, Time elapsed: 3.416 sec, Thread: 2, Class: org.apache.zookeeper.test.ServerCnxnTest
[junit] Running org.apache.zookeeper.test.SessionInvalidationTest in thread 4
[junit] Running org.apache.zookeeper.test.SessionTest in thread 3
[junit] Running org.apache.zookeeper.test.SessionTimeoutTest in thread 2
[junit] Tests run: 1, Failures: 0, Errors: 0, Skipped: 0, Time elapsed: 0.864 sec, Thread: 4, Class: org.apache.zookeeper.test.SessionInvalidationTest
[junit] Running org.apache.zookeeper.test.SessionTrackerCheckTest in thread 4
[junit] Tests run: 2, Failures: 0, Errors: 0, Skipped: 0, Time elapsed: 0.103 sec, Thread: 4, Class: org.apache.zookeeper.test.SessionTrackerCheckTest
[junit] Tests run: 4, Failures: 0, Errors: 0, Skipped: 0, Time elapsed: 1.722 sec, Thread: 2, Class: org.apache.zookeeper.test.SessionTimeoutTest
[junit] Running org.apache.zookeeper.test.SessionUpgradeTest in thread 4
[junit] Running org.apache.zookeeper.test.StandaloneTest in thread 2
[junit] Tests run: 4, Failures: 0, Errors: 0, Skipped: 0, Time elapsed: 2.699 sec, Thread: 2, Class: org.apache.zookeeper.test.StandaloneTest
[junit] Running org.apache.zookeeper.test.StatTest in thread 2
[junit] Tests run: 4, Failures: 0, Errors: 0, Skipped: 0, Time elapsed: 1.361 sec, Thread: 2, Class: org.apache.zookeeper.test.StatTest
[junit] Running org.apache.zookeeper.test.StaticHostProviderTest in thread 2
[junit] Tests run: 26, Failures: 0, Errors: 0, Skipped: 0, Time elapsed: 2.287 sec, Thread: 2, Class: org.apache.zookeeper.test.StaticHostProviderTest
[junit] Running org.apache.zookeeper.test.StringUtilTest in thread 2
[junit] Tests run: 1, Failures: 0, Errors: 0, Skipped: 0, Time elapsed: 0.077 sec, Thread: 2, Class: org.apache.zookeeper.test.StringUtilTest
[junit] Running org.apache.zookeeper.test.SyncCallTest in thread 2
[junit] Tests run: 5, Failures: 0, Errors: 0, Skipped: 0, Time elapsed: 13.076 sec, Thread: 3, Class: org.apache.zookeeper.test.SessionTest
[junit] Tests run: 1, Failures: 0, Errors: 0, Skipped: 0, Time elapsed: 0.768 sec, Thread: 2, Class: org.apache.zookeeper.test.SyncCallTest
[junit] Running org.apache.zookeeper.test.TruncateTest in thread 3
[junit] Running org.apache.zookeeper.test.WatchEventWhenAutoResetTest in thread 2
[junit] Tests run: 3, Failures: 0, Errors: 0, Skipped: 0, Time elapsed: 9.101 sec, Thread: 3, Class: org.apache.zookeeper.test.TruncateTest
[junit] Running org.apache.zookeeper.test.WatchedEventTest in thread 3
[junit] Tests run: 4, Failures: 0, Errors: 0, Skipped: 0, Time elapsed: 0.089 sec, Thread: 3, Class: org.apache.zookeeper.test.WatchedEventTest
[junit] Tests run: 4, Failures: 0, Errors: 0, Skipped: 0, Time elapsed: 21.561 sec, Thread: 4, Class: org.apache.zookeeper.test.SessionUpgradeTest
[junit] Running org.apache.zookeeper.test.WatcherFuncTest in thread 3
[junit] Running org.apache.zookeeper.test.WatcherTest in thread 4
[junit] Tests run: 6, Failures: 0, Errors: 0, Skipped: 0, Time elapsed: 3.387 sec, Thread: 3, Class: org.apache.zookeeper.test.WatcherFuncTest
[junit] Running org.apache.zookeeper.test.X509AuthTest in thread 3
[junit] Tests run: 3, Failures: 0, Errors: 0, Skipped: 0, Time elapsed: 0.104 sec, Thread: 3, Class: org.apache.zookeeper.test.X509AuthTest
[junit] Running org.apache.zookeeper.test.ZkDatabaseCorruptionTest in thread 3
[junit] Tests run: 4, Failures: 0, Errors: 0, Skipped: 0, Time elapsed: 22.3 sec, Thread: 2, Class: org.apache.zookeeper.test.WatchEventWhenAutoResetTest
[junit] Running org.apache.zookeeper.test.ZooKeeperQuotaTest in thread 2
[junit] Tests run: 1, Failures: 0, Errors: 0, Skipped: 0, Time elapsed: 0.818 sec, Thread: 2, Class: org.apache.zookeeper.test.ZooKeeperQuotaTest
[junit] Running org.apache.zookeeper.util.PemReaderTest in thread 2
[junit] Tests run: 2, Failures: 0, Errors: 0, Skipped: 0, Time elapsed: 12.655 sec, Thread: 3, Class: org.apache.zookeeper.test.ZkDatabaseCorruptionTest
[junit] Running org.apache.jute.BinaryInputArchiveTest in thread 3
[junit] Tests run: 3, Failures: 0, Errors: 0, Skipped: 0, Time elapsed: 0.079 sec, Thread: 3, Class: org.apache.jute.BinaryInputArchiveTest
[junit] Tests run: 64, Failures: 0, Errors: 0, Skipped: 0, Time elapsed: 4.276 sec, Thread: 2, Class: org.apache.zookeeper.util.PemReaderTest
[junit] Tests run: 8, Failures: 0, Errors: 0, Skipped: 0, Time elapsed: 31.452 sec, Thread: 4, Class: org.apache.zookeeper.test.WatcherTest
[junit] Tests run: 13, Failures: 0, Errors: 0, Skipped: 0, Time elapsed: 278.316 sec, Thread: 1, Class: org.apache.zookeeper.test.ReconfigTest
fail.build.on.test.failure:
BUILD FAILED
/home/jenkins/jenkins-slave/workspace/ZooKeeper_branch35_jdk8/build.xml:1480: The following error occurred while executing this line:
/home/jenkins/jenkins-slave/workspace/ZooKeeper_branch35_jdk8/build.xml:1333: The following error occurred while executing this line:
/home/jenkins/jenkins-slave/workspace/ZooKeeper_branch35_jdk8/build.xml:1337: Tests failed!
Total time: 26 minutes 13 seconds
Build step 'Invoke Ant' marked build as failure
Archiving artifacts
Recording test results
Email was triggered for: Failure - Any
Sending email for trigger: Failure - Any
###################################################################################
############################## FAILED TESTS (if any) ##############################
1 tests failed.
FAILED: org.apache.zookeeper.test.CnxManagerTest.testWorkerThreads
Error Message:
Unable to run quorum server
Stack Trace:
java.lang.RuntimeException: Unable to run quorum server
at org.apache.zookeeper.server.quorum.QuorumPeer.loadDataBase(QuorumPeer.java:938)
at org.apache.zookeeper.server.quorum.QuorumPeer.start(QuorumPeer.java:887)
at org.apache.zookeeper.test.CnxManagerTest.testWorkerThreads(CnxManagerTest.java:431)
at org.apache.zookeeper.JUnit4ZKTestRunner$LoggedInvokeMethod.evaluate(JUnit4ZKTestRunner.java:80)
Caused by: java.io.IOException: The accepted epoch, 0 is less than the current epoch, 1
at org.apache.zookeeper.server.quorum.QuorumPeer.loadDataBase(QuorumPeer.java:934)