You are viewing a plain text version of this content. The canonical link for it is here.
Posted to dev@lucene.apache.org by Policeman Jenkins Server <je...@thetaphi.de> on 2015/04/15 09:16:17 UTC

[JENKINS] Lucene-Solr-5.x-Linux (32bit/jdk1.7.0_80-ea-b05) - Build # 12140 - Still Failing!

Build: http://jenkins.thetaphi.de/job/Lucene-Solr-5.x-Linux/12140/
Java: 32bit/jdk1.7.0_80-ea-b05 -client -XX:+UseConcMarkSweepGC

1 tests failed.
FAILED:  org.apache.solr.cloud.ChaosMonkeyNothingIsSafeTest.test

Error Message:
There were too many update fails (36 > 20) - we expect it can happen, but shouldn't easily

Stack Trace:
java.lang.AssertionError: There were too many update fails (36 > 20) - we expect it can happen, but shouldn't easily
	at __randomizedtesting.SeedInfo.seed([5E9436BB251C6AC9:D6C009618BE00731]:0)
	at org.junit.Assert.fail(Assert.java:93)
	at org.junit.Assert.assertTrue(Assert.java:43)
	at org.junit.Assert.assertFalse(Assert.java:68)
	at org.apache.solr.cloud.ChaosMonkeyNothingIsSafeTest.test(ChaosMonkeyNothingIsSafeTest.java:230)
	at sun.reflect.NativeMethodAccessorImpl.invoke0(Native Method)
	at sun.reflect.NativeMethodAccessorImpl.invoke(NativeMethodAccessorImpl.java:57)
	at sun.reflect.DelegatingMethodAccessorImpl.invoke(DelegatingMethodAccessorImpl.java:43)
	at java.lang.reflect.Method.invoke(Method.java:606)
	at com.carrotsearch.randomizedtesting.RandomizedRunner.invoke(RandomizedRunner.java:1627)
	at com.carrotsearch.randomizedtesting.RandomizedRunner$6.evaluate(RandomizedRunner.java:836)
	at com.carrotsearch.randomizedtesting.RandomizedRunner$7.evaluate(RandomizedRunner.java:872)
	at com.carrotsearch.randomizedtesting.RandomizedRunner$8.evaluate(RandomizedRunner.java:886)
	at org.apache.solr.BaseDistributedSearchTestCase$ShardsRepeatRule$ShardsFixedStatement.callStatement(BaseDistributedSearchTestCase.java:960)
	at org.apache.solr.BaseDistributedSearchTestCase$ShardsRepeatRule$ShardsStatement.evaluate(BaseDistributedSearchTestCase.java:935)
	at com.carrotsearch.randomizedtesting.rules.SystemPropertiesRestoreRule$1.evaluate(SystemPropertiesRestoreRule.java:57)
	at org.apache.lucene.util.TestRuleSetupTeardownChained$1.evaluate(TestRuleSetupTeardownChained.java:50)
	at org.apache.lucene.util.AbstractBeforeAfterRule$1.evaluate(AbstractBeforeAfterRule.java:46)
	at org.apache.lucene.util.TestRuleThreadAndTestName$1.evaluate(TestRuleThreadAndTestName.java:49)
	at org.apache.lucene.util.TestRuleIgnoreAfterMaxFailures$1.evaluate(TestRuleIgnoreAfterMaxFailures.java:65)
	at org.apache.lucene.util.TestRuleMarkFailure$1.evaluate(TestRuleMarkFailure.java:48)
	at com.carrotsearch.randomizedtesting.rules.StatementAdapter.evaluate(StatementAdapter.java:36)
	at com.carrotsearch.randomizedtesting.ThreadLeakControl$StatementRunner.run(ThreadLeakControl.java:365)
	at com.carrotsearch.randomizedtesting.ThreadLeakControl.forkTimeoutingTask(ThreadLeakControl.java:798)
	at com.carrotsearch.randomizedtesting.ThreadLeakControl$3.evaluate(ThreadLeakControl.java:458)
	at com.carrotsearch.randomizedtesting.RandomizedRunner.runSingleTest(RandomizedRunner.java:845)
	at com.carrotsearch.randomizedtesting.RandomizedRunner$3.evaluate(RandomizedRunner.java:747)
	at com.carrotsearch.randomizedtesting.RandomizedRunner$4.evaluate(RandomizedRunner.java:781)
	at com.carrotsearch.randomizedtesting.RandomizedRunner$5.evaluate(RandomizedRunner.java:792)
	at com.carrotsearch.randomizedtesting.rules.StatementAdapter.evaluate(StatementAdapter.java:36)
	at com.carrotsearch.randomizedtesting.rules.SystemPropertiesRestoreRule$1.evaluate(SystemPropertiesRestoreRule.java:57)
	at org.apache.lucene.util.AbstractBeforeAfterRule$1.evaluate(AbstractBeforeAfterRule.java:46)
	at com.carrotsearch.randomizedtesting.rules.StatementAdapter.evaluate(StatementAdapter.java:36)
	at org.apache.lucene.util.TestRuleStoreClassName$1.evaluate(TestRuleStoreClassName.java:42)
	at com.carrotsearch.randomizedtesting.rules.NoShadowingOrOverridesOnMethodsRule$1.evaluate(NoShadowingOrOverridesOnMethodsRule.java:39)
	at com.carrotsearch.randomizedtesting.rules.NoShadowingOrOverridesOnMethodsRule$1.evaluate(NoShadowingOrOverridesOnMethodsRule.java:39)
	at com.carrotsearch.randomizedtesting.rules.StatementAdapter.evaluate(StatementAdapter.java:36)
	at com.carrotsearch.randomizedtesting.rules.StatementAdapter.evaluate(StatementAdapter.java:36)
	at com.carrotsearch.randomizedtesting.rules.StatementAdapter.evaluate(StatementAdapter.java:36)
	at org.apache.lucene.util.TestRuleAssertionsRequired$1.evaluate(TestRuleAssertionsRequired.java:54)
	at org.apache.lucene.util.TestRuleMarkFailure$1.evaluate(TestRuleMarkFailure.java:48)
	at org.apache.lucene.util.TestRuleIgnoreAfterMaxFailures$1.evaluate(TestRuleIgnoreAfterMaxFailures.java:65)
	at org.apache.lucene.util.TestRuleIgnoreTestSuites$1.evaluate(TestRuleIgnoreTestSuites.java:55)
	at com.carrotsearch.randomizedtesting.rules.StatementAdapter.evaluate(StatementAdapter.java:36)
	at com.carrotsearch.randomizedtesting.ThreadLeakControl$StatementRunner.run(ThreadLeakControl.java:365)
	at java.lang.Thread.run(Thread.java:745)




Build Log:
[...truncated 10476 lines...]
   [junit4] Suite: org.apache.solr.cloud.ChaosMonkeyNothingIsSafeTest
   [junit4]   2> Creating dataDir: /home/jenkins/workspace/Lucene-Solr-5.x-Linux/solr/build/solr-core/test/J2/temp/solr.cloud.ChaosMonkeyNothingIsSafeTest 5E9436BB251C6AC9-001/init-core-data-001
   [junit4]   2> 1570807 T10843 oas.BaseDistributedSearchTestCase.initHostContext Setting hostContext system property: /
   [junit4]   2> 1570810 T10843 oasc.ZkTestServer.run STARTING ZK TEST SERVER
   [junit4]   2> 1570811 T10844 oasc.ZkTestServer$2$1.setClientPort client port:0.0.0.0/0.0.0.0:0
   [junit4]   2> 1570811 T10844 oasc.ZkTestServer$ZKServerMain.runFromConfig Starting server
   [junit4]   2> 1570911 T10843 oasc.ZkTestServer.run start zk server on port:36195
   [junit4]   2> 1570912 T10843 oascc.SolrZkClient.createZkCredentialsToAddAutomatically Using default ZkCredentialsProvider
   [junit4]   2> 1570912 T10843 oascc.ConnectionManager.waitForConnected Waiting for client to connect to ZooKeeper
   [junit4]   2> 1570914 T10851 oascc.ConnectionManager.process Watcher org.apache.solr.common.cloud.ConnectionManager@667b0c name:ZooKeeperConnection Watcher:127.0.0.1:36195 got event WatchedEvent state:SyncConnected type:None path:null path:null type:None
   [junit4]   2> 1570915 T10843 oascc.ConnectionManager.waitForConnected Client is connected to ZooKeeper
   [junit4]   2> 1570915 T10843 oascc.SolrZkClient.createZkACLProvider Using default ZkACLProvider
   [junit4]   2> 1570915 T10843 oascc.SolrZkClient.makePath makePath: /solr
   [junit4]   2> 1570916 T10843 oascc.SolrZkClient.createZkCredentialsToAddAutomatically Using default ZkCredentialsProvider
   [junit4]   2> 1570917 T10843 oascc.ConnectionManager.waitForConnected Waiting for client to connect to ZooKeeper
   [junit4]   2> 1570918 T10854 oascc.ConnectionManager.process Watcher org.apache.solr.common.cloud.ConnectionManager@75a62c name:ZooKeeperConnection Watcher:127.0.0.1:36195/solr got event WatchedEvent state:SyncConnected type:None path:null path:null type:None
   [junit4]   2> 1570918 T10843 oascc.ConnectionManager.waitForConnected Client is connected to ZooKeeper
   [junit4]   2> 1570919 T10843 oascc.SolrZkClient.createZkACLProvider Using default ZkACLProvider
   [junit4]   2> 1570919 T10843 oascc.SolrZkClient.makePath makePath: /collections/collection1
   [junit4]   2> 1570920 T10843 oascc.SolrZkClient.makePath makePath: /collections/collection1/shards
   [junit4]   2> 1570921 T10843 oascc.SolrZkClient.makePath makePath: /collections/control_collection
   [junit4]   2> 1570922 T10843 oascc.SolrZkClient.makePath makePath: /collections/control_collection/shards
   [junit4]   2> 1570922 T10843 oasc.AbstractZkTestCase.putConfig put /home/jenkins/workspace/Lucene-Solr-5.x-Linux/solr/core/src/test-files/solr/collection1/conf/solrconfig-tlog.xml to /configs/conf1/solrconfig.xml
   [junit4]   2> 1570923 T10843 oascc.SolrZkClient.makePath makePath: /configs/conf1/solrconfig.xml
   [junit4]   2> 1570924 T10843 oasc.AbstractZkTestCase.putConfig put /home/jenkins/workspace/Lucene-Solr-5.x-Linux/solr/core/src/test-files/solr/collection1/conf/schema15.xml to /configs/conf1/schema.xml
   [junit4]   2> 1570924 T10843 oascc.SolrZkClient.makePath makePath: /configs/conf1/schema.xml
   [junit4]   2> 1570926 T10843 oasc.AbstractZkTestCase.putConfig put /home/jenkins/workspace/Lucene-Solr-5.x-Linux/solr/core/src/test-files/solr/collection1/conf/solrconfig.snippet.randomindexconfig.xml to /configs/conf1/solrconfig.snippet.randomindexconfig.xml
   [junit4]   2> 1570926 T10843 oascc.SolrZkClient.makePath makePath: /configs/conf1/solrconfig.snippet.randomindexconfig.xml
   [junit4]   2> 1570927 T10843 oasc.AbstractZkTestCase.putConfig put /home/jenkins/workspace/Lucene-Solr-5.x-Linux/solr/core/src/test-files/solr/collection1/conf/stopwords.txt to /configs/conf1/stopwords.txt
   [junit4]   2> 1570927 T10843 oascc.SolrZkClient.makePath makePath: /configs/conf1/stopwords.txt
   [junit4]   2> 1570928 T10843 oasc.AbstractZkTestCase.putConfig put /home/jenkins/workspace/Lucene-Solr-5.x-Linux/solr/core/src/test-files/solr/collection1/conf/protwords.txt to /configs/conf1/protwords.txt
   [junit4]   2> 1570929 T10843 oascc.SolrZkClient.makePath makePath: /configs/conf1/protwords.txt
   [junit4]   2> 1570930 T10843 oasc.AbstractZkTestCase.putConfig put /home/jenkins/workspace/Lucene-Solr-5.x-Linux/solr/core/src/test-files/solr/collection1/conf/currency.xml to /configs/conf1/currency.xml
   [junit4]   2> 1570930 T10843 oascc.SolrZkClient.makePath makePath: /configs/conf1/currency.xml
   [junit4]   2> 1570931 T10843 oasc.AbstractZkTestCase.putConfig put /home/jenkins/workspace/Lucene-Solr-5.x-Linux/solr/core/src/test-files/solr/collection1/conf/enumsConfig.xml to /configs/conf1/enumsConfig.xml
   [junit4]   2> 1570931 T10843 oascc.SolrZkClient.makePath makePath: /configs/conf1/enumsConfig.xml
   [junit4]   2> 1570932 T10843 oasc.AbstractZkTestCase.putConfig put /home/jenkins/workspace/Lucene-Solr-5.x-Linux/solr/core/src/test-files/solr/collection1/conf/open-exchange-rates.json to /configs/conf1/open-exchange-rates.json
   [junit4]   2> 1570932 T10843 oascc.SolrZkClient.makePath makePath: /configs/conf1/open-exchange-rates.json
   [junit4]   2> 1570933 T10843 oasc.AbstractZkTestCase.putConfig put /home/jenkins/workspace/Lucene-Solr-5.x-Linux/solr/core/src/test-files/solr/collection1/conf/mapping-ISOLatin1Accent.txt to /configs/conf1/mapping-ISOLatin1Accent.txt
   [junit4]   2> 1570933 T10843 oascc.SolrZkClient.makePath makePath: /configs/conf1/mapping-ISOLatin1Accent.txt
   [junit4]   2> 1570934 T10843 oasc.AbstractZkTestCase.putConfig put /home/jenkins/workspace/Lucene-Solr-5.x-Linux/solr/core/src/test-files/solr/collection1/conf/old_synonyms.txt to /configs/conf1/old_synonyms.txt
   [junit4]   2> 1570934 T10843 oascc.SolrZkClient.makePath makePath: /configs/conf1/old_synonyms.txt
   [junit4]   2> 1570935 T10843 oasc.AbstractZkTestCase.putConfig put /home/jenkins/workspace/Lucene-Solr-5.x-Linux/solr/core/src/test-files/solr/collection1/conf/synonyms.txt to /configs/conf1/synonyms.txt
   [junit4]   2> 1570936 T10843 oascc.SolrZkClient.makePath makePath: /configs/conf1/synonyms.txt
   [junit4]   2> 1571019 T10843 oas.SolrTestCaseJ4.writeCoreProperties Writing core.properties file to /home/jenkins/workspace/Lucene-Solr-5.x-Linux/solr/build/solr-core/test/J2/temp/solr.cloud.ChaosMonkeyNothingIsSafeTest 5E9436BB251C6AC9-001/control-001/cores/collection1
   [junit4]   2> 1571020 T10843 oejs.Server.doStart jetty-8.1.10.v20130312
   [junit4]   2> 1571022 T10843 oejs.AbstractConnector.doStart Started SelectChannelConnector@127.0.0.1:51492
   [junit4]   2> 1571022 T10843 oascse.JettySolrRunner$1.lifeCycleStarted Jetty properties: {coreRootDirectory=/home/jenkins/workspace/Lucene-Solr-5.x-Linux/solr/build/solr-core/test/J2/../../../../../../../../../home/jenkins/workspace/Lucene-Solr-5.x-Linux/solr/build/solr-core/test/J2/temp/solr.cloud.ChaosMonkeyNothingIsSafeTest 5E9436BB251C6AC9-001/control-001/cores, solr.data.dir=/home/jenkins/workspace/Lucene-Solr-5.x-Linux/solr/build/solr-core/test/J2/temp/solr.cloud.ChaosMonkeyNothingIsSafeTest 5E9436BB251C6AC9-001/tempDir-001/control/data, hostPort=51492, hostContext=/}
   [junit4]   2> 1571022 T10843 oass.SolrDispatchFilter.init SolrDispatchFilter.init()sun.misc.Launcher$AppClassLoader@29a046
   [junit4]   2> 1571023 T10843 oasc.SolrResourceLoader.<init> new SolrResourceLoader for directory: '/home/jenkins/workspace/Lucene-Solr-5.x-Linux/solr/build/solr-core/test/J2/../../../../../../../../../home/jenkins/workspace/Lucene-Solr-5.x-Linux/solr/build/solr-core/test/J2/temp/solr.cloud.ChaosMonkeyNothingIsSafeTest 5E9436BB251C6AC9-001/control-001/'
   [junit4]   2> 1571035 T10843 oasc.SolrXmlConfig.fromFile Loading container configuration from /home/jenkins/workspace/Lucene-Solr-5.x-Linux/solr/build/solr-core/test/J2/../../../../../../../../../home/jenkins/workspace/Lucene-Solr-5.x-Linux/solr/build/solr-core/test/J2/temp/solr.cloud.ChaosMonkeyNothingIsSafeTest 5E9436BB251C6AC9-001/control-001/solr.xml
   [junit4]   2> 1571046 T10843 oasc.CorePropertiesLocator.<init> Config-defined core root directory: /home/jenkins/workspace/Lucene-Solr-5.x-Linux/solr/build/solr-core/test/J2/../../../../../../../../../home/jenkins/workspace/Lucene-Solr-5.x-Linux/solr/build/solr-core/test/J2/temp/solr.cloud.ChaosMonkeyNothingIsSafeTest 5E9436BB251C6AC9-001/control-001/cores
   [junit4]   2> 1571046 T10843 oasc.CoreContainer.<init> New CoreContainer 11332213
   [junit4]   2> 1571047 T10843 oasc.CoreContainer.load Loading cores into CoreContainer [instanceDir=/home/jenkins/workspace/Lucene-Solr-5.x-Linux/solr/build/solr-core/test/J2/../../../../../../../../../home/jenkins/workspace/Lucene-Solr-5.x-Linux/solr/build/solr-core/test/J2/temp/solr.cloud.ChaosMonkeyNothingIsSafeTest 5E9436BB251C6AC9-001/control-001/]
   [junit4]   2> 1571047 T10843 oasc.CoreContainer.load loading shared library: /home/jenkins/workspace/Lucene-Solr-5.x-Linux/solr/build/solr-core/test/J2/../../../../../../../../../home/jenkins/workspace/Lucene-Solr-5.x-Linux/solr/build/solr-core/test/J2/temp/solr.cloud.ChaosMonkeyNothingIsSafeTest 5E9436BB251C6AC9-001/control-001/lib
   [junit4]   2> 1571047 T10843 oasc.SolrResourceLoader.addToClassLoader WARN Can't find (or read) directory to add to classloader: lib (resolved as: /home/jenkins/workspace/Lucene-Solr-5.x-Linux/solr/build/solr-core/test/J2/../../../../../../../../../home/jenkins/workspace/Lucene-Solr-5.x-Linux/solr/build/solr-core/test/J2/temp/solr.cloud.ChaosMonkeyNothingIsSafeTest 5E9436BB251C6AC9-001/control-001/lib).
   [junit4]   2> 1571054 T10843 oashc.HttpShardHandlerFactory.init created with socketTimeout : 90000,urlScheme : ,connTimeout : 15000,maxConnectionsPerHost : 20,maxConnections : 10000,corePoolSize : 0,maximumPoolSize : 2147483647,maxThreadIdleTime : 5,sizeOfQueue : -1,fairnessPolicy : false,useRetries : false,
   [junit4]   2> 1571056 T10843 oasu.UpdateShardHandler.<init> Creating UpdateShardHandler HTTP client with params: socketTimeout=340000&connTimeout=45000&retry=true
   [junit4]   2> 1571057 T10843 oasl.LogWatcher.createWatcher SLF4J impl is org.slf4j.impl.Log4jLoggerFactory
   [junit4]   2> 1571058 T10843 oasl.LogWatcher.newRegisteredLogWatcher Registering Log Listener [Log4j (org.slf4j.impl.Log4jLoggerFactory)]
   [junit4]   2> 1571058 T10843 oasc.CoreContainer.load Node Name: 127.0.0.1
   [junit4]   2> 1571058 T10843 oasc.ZkContainer.initZooKeeper Zookeeper client=127.0.0.1:36195/solr
   [junit4]   2> 1571059 T10843 oasc.ZkController.checkChrootPath zkHost includes chroot
   [junit4]   2> 1571059 T10843 oascc.SolrZkClient.createZkCredentialsToAddAutomatically Using default ZkCredentialsProvider
   [junit4]   2> 1571060 T10843 oascc.ConnectionManager.waitForConnected Waiting for client to connect to ZooKeeper
   [junit4]   2> 1571061 T10866 oascc.ConnectionManager.process Watcher org.apache.solr.common.cloud.ConnectionManager@5fb218 name:ZooKeeperConnection Watcher:127.0.0.1:36195 got event WatchedEvent state:SyncConnected type:None path:null path:null type:None
   [junit4]   2> 1571062 T10843 oascc.ConnectionManager.waitForConnected Client is connected to ZooKeeper
   [junit4]   2> 1571062 T10843 oascc.SolrZkClient.createZkACLProvider Using default ZkACLProvider
   [junit4]   2> 1571063 T10843 N:127.0.0.1:51492_ oascc.ConnectionManager.waitForConnected Waiting for client to connect to ZooKeeper
   [junit4]   2> 1571065 T10869 N:127.0.0.1:51492_ oascc.ConnectionManager.process Watcher org.apache.solr.common.cloud.ConnectionManager@184c838 name:ZooKeeperConnection Watcher:127.0.0.1:36195/solr got event WatchedEvent state:SyncConnected type:None path:null path:null type:None
   [junit4]   2> 1571065 T10843 N:127.0.0.1:51492_ oascc.ConnectionManager.waitForConnected Client is connected to ZooKeeper
   [junit4]   2> 1571066 T10843 N:127.0.0.1:51492_ oascc.SolrZkClient.makePath makePath: /overseer/queue
   [junit4]   2> 1571068 T10843 N:127.0.0.1:51492_ oascc.SolrZkClient.makePath makePath: /overseer/collection-queue-work
   [junit4]   2> 1571070 T10843 N:127.0.0.1:51492_ oascc.SolrZkClient.makePath makePath: /overseer/collection-map-running
   [junit4]   2> 1571072 T10843 N:127.0.0.1:51492_ oascc.SolrZkClient.makePath makePath: /overseer/collection-map-completed
   [junit4]   2> 1571074 T10843 N:127.0.0.1:51492_ oascc.SolrZkClient.makePath makePath: /overseer/collection-map-failure
   [junit4]   2> 1571075 T10843 N:127.0.0.1:51492_ oascc.SolrZkClient.makePath makePath: /live_nodes
   [junit4]   2> 1571076 T10843 N:127.0.0.1:51492_ oascc.SolrZkClient.makePath makePath: /aliases.json
   [junit4]   2> 1571077 T10843 N:127.0.0.1:51492_ oascc.SolrZkClient.makePath makePath: /clusterstate.json
   [junit4]   2> 1571077 T10843 N:127.0.0.1:51492_ oasc.ZkController.createEphemeralLiveNode Register node as live in ZooKeeper:/live_nodes/127.0.0.1:51492_
   [junit4]   2> 1571078 T10843 N:127.0.0.1:51492_ oascc.SolrZkClient.makePath makePath: /live_nodes/127.0.0.1:51492_
   [junit4]   2> 1571079 T10843 N:127.0.0.1:51492_ oascc.SolrZkClient.makePath makePath: /overseer_elect
   [junit4]   2> 1571080 T10843 N:127.0.0.1:51492_ oascc.SolrZkClient.makePath makePath: /overseer_elect/election
   [junit4]   2> 1571081 T10843 N:127.0.0.1:51492_ oasc.Overseer.close Overseer (id=null) closing
   [junit4]   2> 1571082 T10843 N:127.0.0.1:51492_ oasc.OverseerElectionContext.runLeaderProcess I am going to be the leader 127.0.0.1:51492_
   [junit4]   2> 1571083 T10843 N:127.0.0.1:51492_ oascc.SolrZkClient.makePath makePath: /overseer_elect/leader
   [junit4]   2> 1571084 T10843 N:127.0.0.1:51492_ oasc.Overseer.start Overseer (id=93656293098061827-127.0.0.1:51492_-n_0000000000) starting
   [junit4]   2> 1571085 T10843 N:127.0.0.1:51492_ oascc.SolrZkClient.makePath makePath: /overseer/queue-work
   [junit4]   2> 1571088 T10843 N:127.0.0.1:51492_ oasc.OverseerAutoReplicaFailoverThread.<init> Starting OverseerAutoReplicaFailoverThread autoReplicaFailoverWorkLoopDelay=10000 autoReplicaFailoverWaitAfterExpiration=30000 autoReplicaFailoverBadNodeExpiration=60000
   [junit4]   2> 1571089 T10871 N:127.0.0.1:51492_ oasc.OverseerCollectionProcessor.run Process current queue of collection creations
   [junit4]   2> 1571089 T10843 N:127.0.0.1:51492_ oascc.ZkStateReader.createClusterStateWatchersAndUpdate Updating cluster state from ZooKeeper... 
   [junit4]   2> 1571090 T10870 N:127.0.0.1:51492_ oasc.Overseer$ClusterStateUpdater.run Starting to work on the main queue
   [junit4]   2> 1571091 T10843 N:127.0.0.1:51492_ oasc.CorePropertiesLocator.discover Looking for core definitions underneath /home/jenkins/workspace/Lucene-Solr-5.x-Linux/solr/build/solr-core/test/J2/../../../../../../../../../home/jenkins/workspace/Lucene-Solr-5.x-Linux/solr/build/solr-core/test/J2/temp/solr.cloud.ChaosMonkeyNothingIsSafeTest 5E9436BB251C6AC9-001/control-001/cores
   [junit4]   2> 1571093 T10843 N:127.0.0.1:51492_ oasc.CoreDescriptor.<init> CORE DESCRIPTOR: {name=collection1, instanceDir=/home/jenkins/workspace/Lucene-Solr-5.x-Linux/solr/build/solr-core/test/J2/../../../../../../../../../home/jenkins/workspace/Lucene-Solr-5.x-Linux/solr/build/solr-core/test/J2/temp/solr.cloud.ChaosMonkeyNothingIsSafeTest 5E9436BB251C6AC9-001/control-001/cores/collection1, absoluteInstDir=/home/jenkins/workspace/Lucene-Solr-5.x-Linux/solr/build/solr-core/test/J2/../../../../../../../../../home/jenkins/workspace/Lucene-Solr-5.x-Linux/solr/build/solr-core/test/J2/temp/solr.cloud.ChaosMonkeyNothingIsSafeTest 5E9436BB251C6AC9-001/control-001/cores/collection1/, dataDir=data/, loadOnStartup=true, collection=control_collection, config=solrconfig.xml, transient=false, coreNodeName=, schema=schema.xml, shard=}
   [junit4]   2> 1571094 T10843 N:127.0.0.1:51492_ oasc.CorePropertiesLocator.discoverUnder Found core collection1 in /home/jenkins/workspace/Lucene-Solr-5.x-Linux/solr/build/solr-core/test/J2/../../../../../../../../../home/jenkins/workspace/Lucene-Solr-5.x-Linux/solr/build/solr-core/test/J2/temp/solr.cloud.ChaosMonkeyNothingIsSafeTest 5E9436BB251C6AC9-001/control-001/cores/collection1/
   [junit4]   2> 1571094 T10843 N:127.0.0.1:51492_ oasc.CorePropertiesLocator.discover Found 1 core definitions
   [junit4]   2> 1571095 T10873 N:127.0.0.1:51492_ C:control_collection c:collection1 oasc.ZkController.publish publishing core=collection1 state=down collection=control_collection
   [junit4]   2> 1571095 T10873 N:127.0.0.1:51492_ C:control_collection c:collection1 oasc.ZkController.publish numShards not found on descriptor - reading it from system property
   [junit4]   2> 1571096 T10869 N:127.0.0.1:51492_ oasc.DistributedQueue$LatchWatcher.process NodeChildrenChanged fired on path /overseer/queue state SyncConnected
   [junit4]   2> 1571096 T10873 N:127.0.0.1:51492_ oasc.ZkController.waitForCoreNodeName look for our core node name
   [junit4]   2> 1571097 T10870 N:127.0.0.1:51492_ oasc.Overseer$ClusterStateUpdater.run processMessage: queueSize: 1, message = {
   [junit4]   2> 	  "numShards":"1",
   [junit4]   2> 	  "shard":null,
   [junit4]   2> 	  "core":"collection1",
   [junit4]   2> 	  "state":"down",
   [junit4]   2> 	  "node_name":"127.0.0.1:51492_",
   [junit4]   2> 	  "roles":null,
   [junit4]   2> 	  "collection":"control_collection",
   [junit4]   2> 	  "operation":"state",
   [junit4]   2> 	  "base_url":"http://127.0.0.1:51492"} current state version: 0
   [junit4]   2> 1571097 T10870 N:127.0.0.1:51492_ oasco.ReplicaMutator.updateState Update state numShards=1 message={
   [junit4]   2> 	  "numShards":"1",
   [junit4]   2> 	  "shard":null,
   [junit4]   2> 	  "core":"collection1",
   [junit4]   2> 	  "state":"down",
   [junit4]   2> 	  "node_name":"127.0.0.1:51492_",
   [junit4]   2> 	  "roles":null,
   [junit4]   2> 	  "collection":"control_collection",
   [junit4]   2> 	  "operation":"state",
   [junit4]   2> 	  "base_url":"http://127.0.0.1:51492"}
   [junit4]   2> 1571097 T10870 N:127.0.0.1:51492_ oasco.ClusterStateMutator.createCollection building a new cName: control_collection
   [junit4]   2> 1571097 T10870 N:127.0.0.1:51492_ oasco.ReplicaMutator.updateState Assigning new node to shard shard=shard1
   [junit4]   2> 1571098 T10869 N:127.0.0.1:51492_ oascc.ZkStateReader$2.process A cluster state change: WatchedEvent state:SyncConnected type:NodeDataChanged path:/clusterstate.json, has occurred - updating... (live nodes size: 1)
   [junit4]   2> 1572096 T10873 N:127.0.0.1:51492_ oasc.ZkController.waitForShardId waiting to find shard id in clusterstate for collection1
   [junit4]   2> 1572097 T10873 N:127.0.0.1:51492_ oasc.ZkController.createCollectionZkNode Check for collection zkNode:control_collection
   [junit4]   2> 1572097 T10873 N:127.0.0.1:51492_ oasc.ZkController.createCollectionZkNode Collection zkNode exists
   [junit4]   2> 1572097 T10873 N:127.0.0.1:51492_ oascc.ZkStateReader.readConfigName Load collection config from:/collections/control_collection
   [junit4]   2> 1572098 T10873 N:127.0.0.1:51492_ oascc.ZkStateReader.readConfigName path=/collections/control_collection configName=conf1 specified config exists in ZooKeeper
   [junit4]   2> 1572098 T10873 N:127.0.0.1:51492_ oasc.SolrResourceLoader.<init> new SolrResourceLoader for directory: '/home/jenkins/workspace/Lucene-Solr-5.x-Linux/solr/build/solr-core/test/J2/../../../../../../../../../home/jenkins/workspace/Lucene-Solr-5.x-Linux/solr/build/solr-core/test/J2/temp/solr.cloud.ChaosMonkeyNothingIsSafeTest 5E9436BB251C6AC9-001/control-001/cores/collection1/'
   [junit4]   2> 1572110 T10873 N:127.0.0.1:51492_ oasc.ZkController.watchZKConfDir watch zkdir /configs/conf1
   [junit4]   2> 1572112 T10873 N:127.0.0.1:51492_ oasc.Config.<init> loaded config solrconfig.xml with version 0 
   [junit4]   2> 1572117 T10873 N:127.0.0.1:51492_ oasc.SolrConfig.refreshRequestParams current version of requestparams : -1
   [junit4]   2> 1572127 T10873 N:127.0.0.1:51492_ oasc.SolrConfig.<init> Using Lucene MatchVersion: 5.2.0
   [junit4]   2> 1572150 T10873 N:127.0.0.1:51492_ oasc.SolrConfig.<init> Loaded SolrConfig: solrconfig.xml
   [junit4]   2> 1572151 T10873 N:127.0.0.1:51492_ oass.IndexSchema.readSchema Reading Solr Schema from /configs/conf1/schema.xml
   [junit4]   2> 1572156 T10873 N:127.0.0.1:51492_ oass.IndexSchema.readSchema [collection1] Schema name=test
   [junit4]   2> 1572334 T10873 N:127.0.0.1:51492_ oass.IndexSchema.readSchema default search field in schema is text
   [junit4]   2> 1572335 T10873 N:127.0.0.1:51492_ oass.IndexSchema.readSchema unique key field: id
   [junit4]   2> 1572336 T10873 N:127.0.0.1:51492_ oass.FileExchangeRateProvider.reload Reloading exchange rates from file currency.xml
   [junit4]   2> 1572338 T10873 N:127.0.0.1:51492_ oass.FileExchangeRateProvider.reload Reloading exchange rates from file currency.xml
   [junit4]   2> 1572347 T10873 N:127.0.0.1:51492_ oasc.CoreContainer.create Creating SolrCore 'collection1' using configuration from collection control_collection
   [junit4]   2> 1572348 T10873 N:127.0.0.1:51492_ c:collection1 oasc.SolrCore.initDirectoryFactory solr.StandardDirectoryFactory
   [junit4]   2> 1572348 T10873 N:127.0.0.1:51492_ c:collection1 oasc.SolrCore.<init> [collection1] Opening new SolrCore at /home/jenkins/workspace/Lucene-Solr-5.x-Linux/solr/build/solr-core/test/J2/../../../../../../../../../home/jenkins/workspace/Lucene-Solr-5.x-Linux/solr/build/solr-core/test/J2/temp/solr.cloud.ChaosMonkeyNothingIsSafeTest 5E9436BB251C6AC9-001/control-001/cores/collection1/, dataDir=/home/jenkins/workspace/Lucene-Solr-5.x-Linux/solr/build/solr-core/test/J2/temp/solr.cloud.ChaosMonkeyNothingIsSafeTest 5E9436BB251C6AC9-001/control-001/cores/collection1/data/
   [junit4]   2> 1572348 T10873 N:127.0.0.1:51492_ c:collection1 oasc.JmxMonitoredMap.<init> JMX monitoring is enabled. Adding Solr mbeans to JMX Server: com.sun.jmx.mbeanserver.JmxMBeanServer@12678ab
   [junit4]   2> 1572349 T10873 N:127.0.0.1:51492_ c:collection1 oasc.CachingDirectoryFactory.get return new directory for /home/jenkins/workspace/Lucene-Solr-5.x-Linux/solr/build/solr-core/test/J2/temp/solr.cloud.ChaosMonkeyNothingIsSafeTest 5E9436BB251C6AC9-001/control-001/cores/collection1/data
   [junit4]   2> 1572349 T10873 N:127.0.0.1:51492_ c:collection1 oasc.SolrCore.getNewIndexDir New index directory detected: old=null new=/home/jenkins/workspace/Lucene-Solr-5.x-Linux/solr/build/solr-core/test/J2/temp/solr.cloud.ChaosMonkeyNothingIsSafeTest 5E9436BB251C6AC9-001/control-001/cores/collection1/data/index/
   [junit4]   2> 1572349 T10873 N:127.0.0.1:51492_ c:collection1 oasc.SolrCore.initIndex WARN [collection1] Solr index directory '/home/jenkins/workspace/Lucene-Solr-5.x-Linux/solr/build/solr-core/test/J2/temp/solr.cloud.ChaosMonkeyNothingIsSafeTest 5E9436BB251C6AC9-001/control-001/cores/collection1/data/index' doesn't exist. Creating new index...
   [junit4]   2> 1572350 T10873 N:127.0.0.1:51492_ c:collection1 oasc.CachingDirectoryFactory.get return new directory for /home/jenkins/workspace/Lucene-Solr-5.x-Linux/solr/build/solr-core/test/J2/temp/solr.cloud.ChaosMonkeyNothingIsSafeTest 5E9436BB251C6AC9-001/control-001/cores/collection1/data/index
   [junit4]   2> 1572350 T10873 N:127.0.0.1:51492_ c:collection1 oasu.RandomMergePolicy.<init> RandomMergePolicy wrapping class org.apache.lucene.index.TieredMergePolicy: [TieredMergePolicy: maxMergeAtOnce=42, maxMergeAtOnceExplicit=20, maxMergedSegmentMB=36.4677734375, floorSegmentMB=1.41796875, forceMergeDeletesPctAllowed=10.968807385802696, segmentsPerTier=17.0, maxCFSSegmentSizeMB=8.796093022207999E12, noCFSRatio=0.45962386867516924
   [junit4]   2> 1572418 T10873 N:127.0.0.1:51492_ c:collection1 oasc.SolrDeletionPolicy.onCommit SolrDeletionPolicy.onCommit: commits: num=1
   [junit4]   2> 		commit{dir=/home/jenkins/workspace/Lucene-Solr-5.x-Linux/solr/build/solr-core/test/J2/temp/solr.cloud.ChaosMonkeyNothingIsSafeTest 5E9436BB251C6AC9-001/control-001/cores/collection1/data/index,segFN=segments_1,generation=1}
   [junit4]   2> 1572418 T10873 N:127.0.0.1:51492_ c:collection1 oasc.SolrDeletionPolicy.updateCommits newest commit generation = 1
   [junit4]   2> 1572421 T10873 N:127.0.0.1:51492_ c:collection1 oasup.UpdateRequestProcessorChain.init creating updateRequestProcessorChain "nodistrib"
   [junit4]   2> 1572422 T10873 N:127.0.0.1:51492_ c:collection1 oasup.UpdateRequestProcessorChain.init creating updateRequestProcessorChain "dedupe"
   [junit4]   2> 1572422 T10873 N:127.0.0.1:51492_ c:collection1 oasup.UpdateRequestProcessorChain.init inserting DistributedUpdateProcessorFactory into updateRequestProcessorChain "dedupe"
   [junit4]   2> 1572422 T10873 N:127.0.0.1:51492_ c:collection1 oasup.UpdateRequestProcessorChain.init creating updateRequestProcessorChain "stored_sig"
   [junit4]   2> 1572422 T10873 N:127.0.0.1:51492_ c:collection1 oasup.UpdateRequestProcessorChain.init inserting DistributedUpdateProcessorFactory into updateRequestProcessorChain "stored_sig"
   [junit4]   2> 1572423 T10873 N:127.0.0.1:51492_ c:collection1 oasup.UpdateRequestProcessorChain.init creating updateRequestProcessorChain "distrib-dup-test-chain-explicit"
   [junit4]   2> 1572423 T10873 N:127.0.0.1:51492_ c:collection1 oasup.UpdateRequestProcessorChain.init creating updateRequestProcessorChain "distrib-dup-test-chain-implicit"
   [junit4]   2> 1572423 T10873 N:127.0.0.1:51492_ c:collection1 oasup.UpdateRequestProcessorChain.init inserting DistributedUpdateProcessorFactory into updateRequestProcessorChain "distrib-dup-test-chain-implicit"
   [junit4]   2> 1572424 T10873 N:127.0.0.1:51492_ c:collection1 oasc.SolrCore.loadUpdateProcessorChains no updateRequestProcessorChain defined as default, creating implicit default
   [junit4]   2> 1572426 T10873 N:127.0.0.1:51492_ c:collection1 oashl.XMLLoader.init xsltCacheLifetimeSeconds=60
   [junit4]   2> 1572427 T10873 N:127.0.0.1:51492_ c:collection1 oashl.XMLLoader.init xsltCacheLifetimeSeconds=60
   [junit4]   2> 1572428 T10873 N:127.0.0.1:51492_ c:collection1 oashl.XMLLoader.init xsltCacheLifetimeSeconds=60
   [junit4]   2> 1572429 T10873 N:127.0.0.1:51492_ c:collection1 oashl.XMLLoader.init xsltCacheLifetimeSeconds=60
   [junit4]   2> 1572433 T10873 N:127.0.0.1:51492_ c:collection1 oasc.RequestHandlers.initHandlersFromConfig Registered paths: /admin/file,/admin/ping,/replication,/update/json,/update/csv,/admin/threads,/update/json/docs,/config,/admin/system,standard,/get,/update,/admin/luke,/admin/plugins,/admin/properties,/admin/logging,/admin/mbeans,/admin/segments,/schema
   [junit4]   2> 1572434 T10873 N:127.0.0.1:51492_ c:collection1 oasc.SolrCore.initStatsCache Using default statsCache cache: org.apache.solr.search.stats.LocalStatsCache
   [junit4]   2> 1572434 T10873 N:127.0.0.1:51492_ c:collection1 oasu.UpdateHandler.<init> Using UpdateLog implementation: org.apache.solr.update.UpdateLog
   [junit4]   2> 1572435 T10873 N:127.0.0.1:51492_ c:collection1 oasu.UpdateLog.init Initializing UpdateLog: dataDir= defaultSyncLevel=FLUSH numRecordsToKeep=100 maxNumLogsToKeep=10
   [junit4]   2> 1572435 T10873 N:127.0.0.1:51492_ c:collection1 oasu.CommitTracker.<init> Hard AutoCommit: disabled
   [junit4]   2> 1572435 T10873 N:127.0.0.1:51492_ c:collection1 oasu.CommitTracker.<init> Soft AutoCommit: disabled
   [junit4]   2> 1572436 T10873 N:127.0.0.1:51492_ c:collection1 oasu.RandomMergePolicy.<init> RandomMergePolicy wrapping class org.apache.lucene.index.TieredMergePolicy: [TieredMergePolicy: maxMergeAtOnce=27, maxMergeAtOnceExplicit=37, maxMergedSegmentMB=11.169921875, floorSegmentMB=0.2802734375, forceMergeDeletesPctAllowed=5.693830658168428, segmentsPerTier=27.0, maxCFSSegmentSizeMB=8.796093022207999E12, noCFSRatio=0.0
   [junit4]   2> 1572436 T10873 N:127.0.0.1:51492_ c:collection1 oasc.SolrDeletionPolicy.onInit SolrDeletionPolicy.onInit: commits: num=1
   [junit4]   2> 		commit{dir=/home/jenkins/workspace/Lucene-Solr-5.x-Linux/solr/build/solr-core/test/J2/temp/solr.cloud.ChaosMonkeyNothingIsSafeTest 5E9436BB251C6AC9-001/control-001/cores/collection1/data/index,segFN=segments_1,generation=1}
   [junit4]   2> 1572437 T10873 N:127.0.0.1:51492_ c:collection1 oasc.SolrDeletionPolicy.updateCommits newest commit generation = 1
   [junit4]   2> 1572437 T10873 N:127.0.0.1:51492_ c:collection1 oass.SolrIndexSearcher.<init> Opening Searcher@6fa1f2[collection1] main
   [junit4]   2> 1572437 T10873 N:127.0.0.1:51492_ c:collection1 oascc.ZkStateReader.readConfigName Load collection config from:/collections/control_collection
   [junit4]   2> 1572438 T10873 N:127.0.0.1:51492_ c:collection1 oascc.ZkStateReader.readConfigName path=/collections/control_collection configName=conf1 specified config exists in ZooKeeper
   [junit4]   2> 1572438 T10873 N:127.0.0.1:51492_ c:collection1 oasr.ManagedResourceStorage.newStorageIO Setting up ZooKeeper-based storage for the RestManager with znodeBase: /configs/conf1
   [junit4]   2> 1572438 T10873 N:127.0.0.1:51492_ c:collection1 oasr.ManagedResourceStorage$ZooKeeperStorageIO.configure Configured ZooKeeperStorageIO with znodeBase: /configs/conf1
   [junit4]   2> 1572438 T10873 N:127.0.0.1:51492_ c:collection1 oasr.RestManager.init Initializing RestManager with initArgs: {}
   [junit4]   2> 1572439 T10873 N:127.0.0.1:51492_ c:collection1 oasr.ManagedResourceStorage.load Reading _rest_managed.json using ZooKeeperStorageIO:path=/configs/conf1
   [junit4]   2> 1572439 T10873 N:127.0.0.1:51492_ c:collection1 oasr.ManagedResourceStorage$ZooKeeperStorageIO.openInputStream No data found for znode /configs/conf1/_rest_managed.json
   [junit4]   2> 1572439 T10873 N:127.0.0.1:51492_ c:collection1 oasr.ManagedResourceStorage.load Loaded null at path _rest_managed.json using ZooKeeperStorageIO:path=/configs/conf1
   [junit4]   2> 1572440 T10873 N:127.0.0.1:51492_ c:collection1 oasr.RestManager.init Initializing 0 registered ManagedResources
   [junit4]   2> 1572440 T10873 N:127.0.0.1:51492_ c:collection1 oash.ReplicationHandler.inform Commits will be reserved for  10000
   [junit4]   2> 1572441 T10873 N:127.0.0.1:51492_ c:collection1 oasc.CoreContainer.registerCore registering core: collection1
   [junit4]   2> 1572441 T10874 N:127.0.0.1:51492_ c:collection1 oasc.SolrCore.registerSearcher [collection1] Registered new searcher Searcher@6fa1f2[collection1] main{ExitableDirectoryReader(UninvertingDirectoryReader())}
   [junit4]   2> 1572445 T10877 N:127.0.0.1:51492_ C:control_collection S:shard1 c:collection1 oasc.ZkController.register Register replica - core:collection1 address:http://127.0.0.1:51492 collection:control_collection shard:shard1
   [junit4]   2> 1572445 T10843 N:127.0.0.1:51492_ oass.SolrDispatchFilter.init user.dir=/home/jenkins/workspace/Lucene-Solr-5.x-Linux/solr/build/solr-core/test/J2
   [junit4]   2> 1572445 T10877 N:127.0.0.1:51492_ C:control_collection S:shard1 c:collection1 oascc.SolrZkClient.makePath makePath: /collections/control_collection/leader_elect/shard1/election
   [junit4]   2> 1572445 T10843 N:127.0.0.1:51492_ oass.SolrDispatchFilter.init SolrDispatchFilter.init() done
   [junit4]   2> 1572447 T10843 oascc.SolrZkClient.createZkCredentialsToAddAutomatically Using default ZkCredentialsProvider
   [junit4]   2> 1572447 T10843 oascc.ConnectionManager.waitForConnected Waiting for client to connect to ZooKeeper
   [junit4]   2> 1572448 T10877 N:127.0.0.1:51492_ C:control_collection S:shard1 c:collection1 oasc.ShardLeaderElectionContext.runLeaderProcess Running the leader process for shard shard1
   [junit4]   2> 1572448 T10880 oascc.ConnectionManager.process Watcher org.apache.solr.common.cloud.ConnectionManager@ab126c name:ZooKeeperConnection Watcher:127.0.0.1:36195/solr got event WatchedEvent state:SyncConnected type:None path:null path:null type:None
   [junit4]   2> 1572449 T10843 oascc.ConnectionManager.waitForConnected Client is connected to ZooKeeper
   [junit4]   2> 1572449 T10869 N:127.0.0.1:51492_ oasc.DistributedQueue$LatchWatcher.process NodeChildrenChanged fired on path /overseer/queue state SyncConnected
   [junit4]   2> 1572449 T10843 oascc.SolrZkClient.createZkACLProvider Using default ZkACLProvider
   [junit4]   2> 1572450 T10843 oascc.ZkStateReader.createClusterStateWatchersAndUpdate Updating cluster state from ZooKeeper... 
   [junit4]   2> 1572449 T10877 N:127.0.0.1:51492_ C:control_collection S:shard1 c:collection1 oasc.ShardLeaderElectionContext.waitForReplicasToComeUp Enough replicas found to continue.
   [junit4]   2> 1572450 T10877 N:127.0.0.1:51492_ C:control_collection S:shard1 c:collection1 oasc.ShardLeaderElectionContext.runLeaderProcess I may be the new leader - try and sync
   [junit4]   2> 1572450 T10870 N:127.0.0.1:51492_ oasc.Overseer$ClusterStateUpdater.run processMessage: queueSize: 1, message = {
   [junit4]   2> 	  "operation":"leader",
   [junit4]   2> 	  "shard":"shard1",
   [junit4]   2> 	  "collection":"control_collection"} current state version: 1
   [junit4]   2> ASYNC  NEW_CORE C3762 name=collection1 org.apache.solr.core.SolrCore@1777f13 url=http://127.0.0.1:51492/collection1 node=127.0.0.1:51492_ C3762_STATE=coll:control_collection core:collection1 props:{core=collection1, state=down, node_name=127.0.0.1:51492_, base_url=http://127.0.0.1:51492}
   [junit4]   2> 1572450 T10877 N:127.0.0.1:51492_ C:control_collection S:shard1 c:collection1 C3762 oasc.SyncStrategy.sync Sync replicas to http://127.0.0.1:51492/collection1/
   [junit4]   2> 1572451 T10877 N:127.0.0.1:51492_ C:control_collection S:shard1 c:collection1 C3762 oasc.SyncStrategy.syncReplicas Sync Success - now sync replicas to me
   [junit4]   2> 1572451 T10843 oasc.ChaosMonkey.monkeyLog monkey: init - expire sessions:false cause connection loss:false
   [junit4]   2> 1572451 T10877 N:127.0.0.1:51492_ C:control_collection S:shard1 c:collection1 C3762 oasc.SyncStrategy.syncToMe http://127.0.0.1:51492/collection1/ has no replicas
   [junit4]   2> 1572452 T10877 N:127.0.0.1:51492_ C:control_collection S:shard1 c:collection1 oasc.ShardLeaderElectionContext.runLeaderProcess I am the new leader: http://127.0.0.1:51492/collection1/ shard1
   [junit4]   2> 1572452 T10877 N:127.0.0.1:51492_ C:control_collection S:shard1 c:collection1 oascc.SolrZkClient.makePath makePath: /collections/control_collection/leaders/shard1
   [junit4]   2> 1572454 T10869 N:127.0.0.1:51492_ oasc.DistributedQueue$LatchWatcher.process NodeChildrenChanged fired on path /overseer/queue state SyncConnected
   [junit4]   2> 1572454 T10870 N:127.0.0.1:51492_ oasc.Overseer$ClusterStateUpdater.run processMessage: queueSize: 1, message = {
   [junit4]   2> 	  "operation":"leader",
   [junit4]   2> 	  "shard":"shard1",
   [junit4]   2> 	  "collection":"control_collection",
   [junit4]   2> 	  "base_url":"http://127.0.0.1:51492",
   [junit4]   2> 	  "core":"collection1",
   [junit4]   2> 	  "state":"active"} current state version: 1
   [junit4]   2> 1572513 T10843 oas.SolrTestCaseJ4.writeCoreProperties Writing core.properties file to /home/jenkins/workspace/Lucene-Solr-5.x-Linux/solr/build/solr-core/test/J2/temp/solr.cloud.ChaosMonkeyNothingIsSafeTest 5E9436BB251C6AC9-001/shard-1-001/cores/collection1
   [junit4]   2> 1572514 T10843 oasc.AbstractFullDistribZkTestBase.createJettys create jetty 1 in directory /home/jenkins/workspace/Lucene-Solr-5.x-Linux/solr/build/solr-core/test/J2/temp/solr.cloud.ChaosMonkeyNothingIsSafeTest 5E9436BB251C6AC9-001/shard-1-001
   [junit4]   2> 1572515 T10843 oejs.Server.doStart jetty-8.1.10.v20130312
   [junit4]   2> 1572516 T10843 oejs.AbstractConnector.doStart Started SelectChannelConnector@127.0.0.1:43106
   [junit4]   2> 1572516 T10843 oascse.JettySolrRunner$1.lifeCycleStarted Jetty properties: {solrconfig=solrconfig.xml, coreRootDirectory=/home/jenkins/workspace/Lucene-Solr-5.x-Linux/solr/build/solr-core/test/J2/../../../../../../../../../home/jenkins/workspace/Lucene-Solr-5.x-Linux/solr/build/solr-core/test/J2/temp/solr.cloud.ChaosMonkeyNothingIsSafeTest 5E9436BB251C6AC9-001/shard-1-001/cores, solr.data.dir=/home/jenkins/workspace/Lucene-Solr-5.x-Linux/solr/build/solr-core/test/J2/temp/solr.cloud.ChaosMonkeyNothingIsSafeTest 5E9436BB251C6AC9-001/tempDir-001/jetty1, hostPort=43106, hostContext=/}
   [junit4]   2> 1572517 T10843 oass.SolrDispatchFilter.init SolrDispatchFilter.init()sun.misc.Launcher$AppClassLoader@29a046
   [junit4]   2> 1572517 T10843 oasc.SolrResourceLoader.<init> new SolrResourceLoader for directory: '/home/jenkins/workspace/Lucene-Solr-5.x-Linux/solr/build/solr-core/test/J2/../../../../../../../../../home/jenkins/workspace/Lucene-Solr-5.x-Linux/solr/build/solr-core/test/J2/temp/solr.cloud.ChaosMonkeyNothingIsSafeTest 5E9436BB251C6AC9-001/shard-1-001/'
   [junit4]   2> 1572529 T10843 oasc.SolrXmlConfig.fromFile Loading container configuration from /home/jenkins/workspace/Lucene-Solr-5.x-Linux/solr/build/solr-core/test/J2/../../../../../../../../../home/jenkins/workspace/Lucene-Solr-5.x-Linux/solr/build/solr-core/test/J2/temp/solr.cloud.ChaosMonkeyNothingIsSafeTest 5E9436BB251C6AC9-001/shard-1-001/solr.xml
   [junit4]   2> 1572540 T10843 oasc.CorePropertiesLocator.<init> Config-defined core root directory: /home/jenkins/workspace/Lucene-Solr-5.x-Linux/solr/build/solr-core/test/J2/../../../../../../../../../home/jenkins/workspace/Lucene-Solr-5.x-Linux/solr/build/solr-core/test/J2/temp/solr.cloud.ChaosMonkeyNothingIsSafeTest 5E9436BB251C6AC9-001/shard-1-001/cores
   [junit4]   2> 1572541 T10843 oasc.CoreContainer.<init> New CoreContainer 19771238
   [junit4]   2> 1572541 T10843 oasc.CoreContainer.load Loading cores into CoreContainer [instanceDir=/home/jenkins/workspace/Lucene-Solr-5.x-Linux/solr/build/solr-core/test/J2/../../../../../../../../../home/jenkins/workspace/Lucene-Solr-5.x-Linux/solr/build/solr-core/test/J2/temp/solr.cloud.ChaosMonkeyNothingIsSafeTest 5E9436BB251C6AC9-001/shard-1-001/]
   [junit4]   2> 1572542 T10843 oasc.CoreContainer.load loading shared library: /home/jenkins/workspace/Lucene-Solr-5.x-Linux/solr/build/solr-core/test/J2/../../../../../../../../../home/jenkins/workspace/Lucene-Solr-5.x-Linux/solr/build/solr-core/test/J2/temp/solr.cloud.ChaosMonkeyNothingIsSafeTest 5E9436BB251C6AC9-001/shard-1-001/lib
   [junit4]   2> 1572542 T10843 oasc.SolrResourceLoader.addToClassLoader WARN Can't find (or read) directory to add to classloader: lib (resolved as: /home/jenkins/workspace/Lucene-Solr-5.x-Linux/solr/build/solr-core/test/J2/../../../../../../../../../home/jenkins/workspace/Lucene-Solr-5.x-Linux/solr/build/solr-core/test/J2/temp/solr.cloud.ChaosMonkeyNothingIsSafeTest 5E9436BB251C6AC9-001/shard-1-001/lib).
   [junit4]   2> 1572547 T10843 oashc.HttpShardHandlerFactory.init created with socketTimeout : 90000,urlScheme : ,connTimeout : 15000,maxConnectionsPerHost : 20,maxConnections : 10000,corePoolSize : 0,maximumPoolSize : 2147483647,maxThreadIdleTime : 5,sizeOfQueue : -1,fairnessPolicy : false,useRetries : false,
   [junit4]   2> 1572549 T10843 oasu.UpdateShardHandler.<init> Creating UpdateShardHandler HTTP client with params: socketTimeout=340000&connTimeout=45000&retry=true
   [junit4]   2> 1572549 T10843 oasl.LogWatcher.createWatcher SLF4J impl is org.slf4j.impl.Log4jLoggerFactory
   [junit4]   2> 1572549 T10843 oasl.LogWatcher.newRegisteredLogWatcher Registering Log Listener [Log4j (org.slf4j.impl.Log4jLoggerFactory)]
   [junit4]   2> 1572550 T10843 oasc.CoreContainer.load Node Name: 127.0.0.1
   [junit4]   2> 1572550 T10843 oasc.ZkContainer.initZooKeeper Zookeeper client=127.0.0.1:36195/solr
   [junit4]   2> 1572550 T10843 oasc.ZkController.checkChrootPath zkHost includes chroot
   [junit4]   2> 1572551 T10843 oascc.SolrZkClient.createZkCredentialsToAddAutomatically Using default ZkCredentialsProvider
   [junit4]   2> 1572551 T10843 oascc.ConnectionManager.waitForConnected Waiting for client to connect to ZooKeeper
   [junit4]   2> 1572552 T10892 oascc.ConnectionManager.process Watcher org.apache.solr.common.cloud.ConnectionManager@e90362 name:ZooKeeperConnection Watcher:127.0.0.1:36195 got event WatchedEvent state:SyncConnected type:None path:null path:null type:None
   [junit4]   2> 1572552 T10843 oascc.ConnectionManager.waitForConnected Client is connected to ZooKeeper
   [junit4]   2> 1572553 T10843 oascc.SolrZkClient.createZkACLProvider Using default ZkACLProvider
   [junit4]   2> 1572554 T10843 N:127.0.0.1:43106_ oascc.ConnectionManager.waitForConnected Waiting for client to connect to ZooKeeper
   [junit4]   2> 1572554 T10895 N:127.0.0.1:43106_ oascc.ConnectionManager.process Watcher org.apache.solr.common.cloud.ConnectionManager@11b7130 name:ZooKeeperConnection Watcher:127.0.0.1:36195/solr got event WatchedEvent state:SyncConnected type:None path:null path:null type:None
   [junit4]   2> 1572555 T10843 N:127.0.0.1:43106_ oascc.ConnectionManager.waitForConnected Client is connected to ZooKeeper
   [junit4]   2> 1572556 T10869 N:127.0.0.1:51492_ oascc.ZkStateReader$2.process A cluster state change: WatchedEvent state:SyncConnected type:NodeDataChanged path:/clusterstate.json, has occurred - updating... (live nodes size: 1)
   [junit4]   2> 1572556 T10880 oascc.ZkStateReader$2.process A cluster state change: WatchedEvent state:SyncConnected type:NodeDataChanged path:/clusterstate.json, has occurred - updating... (live nodes size: 1)
   [junit4]   2> 1572559 T10843 N:127.0.0.1:43106_ oascc.ZkStateReader.createClusterStateWatchersAndUpdate Updating cluster state from ZooKeeper... 
   [junit4]   2> 1572605 T10877 N:127.0.0.1:51492_ C:control_collection S:shard1 c:collection1 oasc.ZkController.register We are http://127.0.0.1:51492/collection1/ and leader is http://127.0.0.1:51492/collection1/
   [junit4]   2> 1572605 T10877 N:127.0.0.1:51492_ C:control_collection S:shard1 c:collection1 oasc.ZkController.register No LogReplay needed for core=collection1 baseURL=http://127.0.0.1:51492
   [junit4]   2> 1572605 T10877 N:127.0.0.1:51492_ C:control_collection S:shard1 c:collection1 oasc.ZkController.checkRecovery I am the leader, no recovery necessary
   [junit4]   2> 1572605 T10877 N:127.0.0.1:51492_ C:control_collection S:shard1 c:collection1 oasc.ZkController.publish publishing core=collection1 state=active collection=control_collection
   [junit4]   2> 1572606 T10877 N:127.0.0.1:51492_ C:control_collection S:shard1 c:collection1 oasc.ZkController.publish numShards not found on descriptor - reading it from system property
   [junit4]   2> 1572606 T10869 N:127.0.0.1:51492_ oasc.DistributedQueue$LatchWatcher.process NodeChildrenChanged fired on path /overseer/queue state SyncConnected
   [junit4]   2> 1572607 T10870 N:127.0.0.1:51492_ oasc.Overseer$ClusterStateUpdater.run processMessage: queueSize: 1, message = {
   [junit4]   2> 	  "core_node_name":"core_node1",
   [junit4]   2> 	  "numShards":"1",
   [junit4]   2> 	  "shard":"shard1",
   [junit4]   2> 	  "core":"collection1",
   [junit4]   2> 	  "state":"active",
   [junit4]   2> 	  "node_name":"127.0.0.1:51492_",
   [junit4]   2> 	  "roles":null,
   [junit4]   2> 	  "collection":"control_collection",
   [junit4]   2> 	  "operation":"state",
   [junit4]   2> 	  "base_url":"http://127.0.0.1:51492"} current state version: 2
   [junit4]   2> 1572608 T10870 N:127.0.0.1:51492_ oasco.ReplicaMutator.updateState Update state numShards=1 message={
   [junit4]   2> 	  "core_node_name":"core_node1",
   [junit4]   2> 	  "numShards":"1",
   [junit4]   2> 	  "shard":"shard1",
   [junit4]   2> 	  "core":"collection1",
   [junit4]   2> 	  "state":"active",
   [junit4]   2> 	  "node_name":"127.0.0.1:51492_",
   [junit4]   2> 	  "roles":null,
   [junit4]   2> 	  "collection":"control_collection",
   [junit4]   2> 	  "operation":"state",
   [junit4]   2> 	  "base_url":"http://127.0.0.1:51492"}
   [junit4]   2> 1572709 T10869 N:127.0.0.1:51492_ oascc.ZkStateReader$2.process A cluster state change: WatchedEvent state:SyncConnected type:NodeDataChanged path:/clusterstate.json, has occurred - updating... (live nodes size: 1)
   [junit4]   2> 1572710 T10895 N:127.0.0.1:43106_ oascc.ZkStateReader$2.process A cluster state change: WatchedEvent state:SyncConnected type:NodeDataChanged path:/clusterstate.json, has occurred - updating... (live nodes size: 1)
   [junit4]   2> 1572710 T10880 oascc.ZkStateReader$2.process A cluster state change: WatchedEvent state:SyncConnected type:NodeDataChanged path:/clusterstate.json, has occurred - updating... (live nodes size: 1)
   [junit4]   2> 1573561 T10843 N:127.0.0.1:43106_ oasc.ZkController.createEphemeralLiveNode Register node as live in ZooKeeper:/live_nodes/127.0.0.1:43106_
   [junit4]   2> 1573562 T10843 N:127.0.0.1:43106_ oascc.SolrZkClient.makePath makePath: /live_nodes/127.0.0.1:43106_
   [junit4]   2> 1573563 T10843 N:127.0.0.1:43106_ oasc.Overseer.close Overseer (id=null) closing
   [junit4]   2> 1573565 T10843 N:127.0.0.1:43106_ oasc.CorePropertiesLocator.discover Looking for core definitions underneath /home/jenkins/workspace/Lucene-Solr-5.x-Linux/solr/build/solr-core/test/J2/../../../../../../../../../home/jenkins/workspace/Lucene-Solr-5.x-Linux/solr/build/solr-core/test/J2/temp/solr.cloud.ChaosMonkeyNothingIsSafeTest 5E9436BB251C6AC9-001/shard-1-001/cores
   [junit4]   2> 1573566 T10843 N:127.0.0.1:43106_ oasc.CoreDescriptor.<init> CORE DESCRIPTOR: {loadOnStartup=true, shard=, absoluteInstDir=/home/jenkins/workspace/Lucene-Solr-5.x-Linux/solr/build/solr-core/test/J2/../../../../../../../../../home/jenkins/workspace/Lucene-Solr-5.x-Linux/solr/build/solr-core/test/J2/temp/solr.cloud.ChaosMonkeyNothingIsSafeTest 5E9436BB251C6AC9-001/shard-1-001/cores/collection1/, collection=collection1, name=collection1, coreNodeName=, config=solrconfig.xml, dataDir=data/, transient=false, schema=schema.xml, instanceDir=/home/jenkins/workspace/Lucene-Solr-5.x-Linux/solr/build/solr-core/test/J2/../../../../../../../../../home/jenkins/workspace/Lucene-Solr-5.x-Linux/solr/build/solr-core/test/J2/temp/solr.cloud.ChaosMonkeyNothingIsSafeTest 5E9436BB251C6AC9-001/shard-1-001/cores/collection1}
   [junit4]   2> 1573566 T10843 N:127.0.0.1:43106_ oasc.CorePropertiesLocator.discoverUnder Found core collection1 in /home/jenkins/workspace/Lucene-Solr-5.x-Linux/solr/build/solr-core/test/J2/../../../../../../../../../home/jenkins/workspace/Lucene-Solr-5.x-Linux/solr/build/solr-core/test/J2/temp/solr.cloud.ChaosMonkeyNothingIsSafeTest 5E9436BB251C6AC9-001/shard-1-001/cores/collection1/
   [junit4]   2> 1573567 T10843 N:127.0.0.1:43106_ oasc.CorePropertiesLocator.discover Found 1 core definitions
   [junit4]   2> 1573567 T10896 N:127.0.0.1:43106_ C:collection1 c:collection1 oasc.ZkController.publish publishing core=collection1 state=down collection=collection1
   [junit4]   2> 1573567 T10896 N:127.0.0.1:43106_ C:collection1 c:collection1 oasc.ZkController.publish numShards not found on descriptor - reading it from system property
   [junit4]   2> 1573568 T10896 N:127.0.0.1:43106_ oasc.ZkController.waitForCoreNodeName look for our core node name
   [junit4]   2> 1573568 T10869 N:127.0.0.1:51492_ oasc.DistributedQueue$LatchWatcher.process NodeChildrenChanged fired on path /overseer/queue state SyncConnected
   [junit4]   2> 1573569 T10870 N:127.0.0.1:51492_ oasc.Overseer$ClusterStateUpdater.run processMessage: queueSize: 1, message = {
   [junit4]   2> 	  "numShards":"1",
   [junit4]   2> 	  "shard":null,
   [junit4]   2> 	  "core":"collection1",
   [junit4]   2> 	  "state":"down",
   [junit4]   2> 	  "node_name":"127.0.0.1:43106_",
   [junit4]   2> 	  "roles":null,
   [junit4]   2> 	  "collection":"collection1",
   [junit4]   2> 	  "operation":"state",
   [junit4]   2> 	  "base_url":"http://127.0.0.1:43106"} current state version: 3
   [junit4]   2> 1573569 T10870 N:127.0.0.1:51492_ oasco.ReplicaMutator.updateState Update state numShards=1 message={
   [junit4]   2> 	  "numShards":"1",
   [junit4]   2> 	  "shard":null,
   [junit4]   2> 	  "core":"collection1",
   [junit4]   2> 	  "state":"down",
   [junit4]   2> 	  "node_name":"127.0.0.1:43106_",
   [junit4]   2> 	  "roles":null,
   [junit4]   2> 	  "collection":"collection1",
   [junit4]   2> 	  "operation":"state",
   [junit4]   2> 	  "base_url":"http://127.0.0.1:43106"}
   [junit4]   2> 1573570 T10870 N:127.0.0.1:51492_ oasco.ClusterStateMutator.createCollection building a new cName: collection1
   [junit4]   2> 1573570 T10870 N:127.0.0.1:51492_ oasco.ReplicaMutator.updateState Assigning new node to shard shard=shard1
   [junit4]   2> 1573671 T10869 N:127.0.0.1:51492_ oascc.ZkStateReader$2.process A cluster state change: WatchedEvent state:SyncConnected type:NodeDataChanged path:/clusterstate.json, has occurred - updating... (live nodes size: 2)
   [junit4]   2> 1573672 T10895 N:127.0.0.1:43106_ oascc.ZkStateReader$2.process A cluster state change: WatchedEvent state:SyncConnected type:NodeDataChanged path:/clusterstate.json, has occurred - updating... (live nodes size: 2)
   [junit4]   2> 1573671 T10880 oascc.ZkStateReader$2.process A cluster state change: WatchedEvent state:SyncConnected type:NodeDataChanged path:/clusterstate.json, has occurred - updating... (live nodes size: 2)
   [junit4]   2> 1574568 T10896 N:127.0.0.1:43106_ oasc.ZkController.waitForShardId waiting to find shard id in clusterstate for collection1
   [junit4]   2> 1574569 T10896 N:127.0.0.1:43106_ oasc.ZkController.createCollectionZkNode Check for collection zkNode:collection1
   [junit4]   2> 1574569 T10896 N:127.0.0.1:43106_ oasc.ZkController.createCollectionZkNode Collection zkNode exists
   [junit4]   2> 1574569 T10896 N:127.0.0.1:43106_ oascc.ZkStateReader.readConfigName Load collection config from:/collections/collection1
   [junit4]   2> 1574570 T10896 N:127.0.0.1:43106_ oascc.ZkStateReader.readConfigName path=/collections/collection1 configName=conf1 specified config exists in ZooKeeper
   [junit4]   2> 1574570 T10896 N:127.0.0.1:43106_ oasc.SolrResourceLoader.<init> new SolrResourceLoader for directory: '/home/jenkins/workspace/Lucene-Solr-5.x-Linux/solr/build/solr-core/test/J2/../../../../../../../../../home/jenkins/workspace/Lucene-Solr-5.x-Linux/solr/build/solr-core/test/J2/temp/solr.cloud.ChaosMonkeyNothingIsSafeTest 5E9436BB251C6AC9-001/shard-1-001/cores/collection1/'
   [junit4]   2> 1574585 T10896 N:127.0.0.1:43106_ oasc.ZkController.watchZKConfDir watch zkdir /configs/conf1
   [junit4]   2> 1574586 T10896 N:127.0.0.1:43106_ oasc.Config.<init> loaded config solrconfig.xml with version 0 
   [junit4]   2> 1574591 T10896 N:127.0.0.1:43106_ oasc.SolrConfig.refreshRequestParams current version of requestparams : -1
   [junit4]   2> 1574601 T10896 N:127.0.0.1:43106_ oasc.SolrConfig.<init> Using Lucene MatchVersion: 5.2.0
   [junit4]   2> 1574630 T10896 N:127.0.0.1:43106_ oasc.SolrConfig.<init> Loaded SolrConfig: solrconfig.xml
   [junit4]   2> 1574631 T10896 N:127.0.0.1:43106_ oass.IndexSchema.readSchema Reading Solr Schema from /configs/conf1/schema.xml
   [junit4]   2> 1574636 T10896 N:127.0.0.1:43106_ oass.IndexSchema.readSchema [collection1] Schema name=test
   [junit4]   2> 1574816 T10896 N:127.0.0.1:43106_ oass.IndexSchema.readSchema default search field in schema is text
   [junit4]   2> 1574817 T10896 N:127.0.0.1:43106_ oass.IndexSchema.readSchema unique key field: id
   [junit4]   2> 1574818 T10896 N:127.0.0.1:43106_ oass.FileExchangeRateProvider.reload Reloading exchange rates from file currency.xml
   [junit4]   2> 1574820 T10896 N:127.0.0.1:43106_ oass.FileExchangeRateProvider.reload Reloading exchange rates from file currency.xml
   [junit4]   2> 1574827 T10896 N:127.0.0.1:43106_ oasc.CoreContainer.create Creating SolrCore 'collection1' using configuration from collection collection1
   [junit4]   2> 1574828 T10896 N:127.0.0.1:43106_ c:collection1 oasc.SolrCore.initDirectoryFactory solr.StandardDirectoryFactory
   [junit4]   2> 1574828 T10896 N:127.0.0.1:43106_ c:collection1 oasc.SolrCore.<init> [collection1] Opening new SolrCore at /home/jenkins/workspace/Lucene-Solr-5.x-Linux/solr/build/solr-core/test/J2/../../../../../../../../../home/jenkins/workspace/Lucene-Solr-5.x-Linux/solr/build/solr-core/test/J2/temp/solr.cloud.ChaosMonkeyNothingIsSafeTest 5E9436BB251C6AC9-001/shard-1-001/cores/collection1/, dataDir=/home/jenkins/workspace/Lucene-Solr-5.x-Linux/solr/build/solr-core/test/J2/temp/solr.cloud.ChaosMonkeyNothingIsSafeTest 5E9436BB251C6AC9-001/shard-1-001/cores/collection1/data/
   [junit4]   2> 1574829 T10896 N:127.0.0.1:43106_ c:collection1 oasc.JmxMonitoredMap.<init> JMX monitoring is enabled. Adding Solr mbeans to JMX Server: com.sun.jmx.mbeanserver.JmxMBeanServer@12678ab
   [junit4]   2> 1574829 T10896 N:127.0.0.1:43106_ c:collection1 oasc.CachingDirectoryFactory.get return new directory for /home/jenkins/workspace/Lucene-Solr-5.x-Linux/solr/build/solr-core/test/J2/temp/solr.cloud.ChaosMonkeyNothingIsSafeTest 5E9436BB251C6AC9-001/shard-1-001/cores/collection1/data
   [junit4]   2> 1574830 T10896 N:127.0.0.1:43106_ c:collection1 oasc.SolrCore.getNewIndexDir New index directory detected: old=null new=/home/jenkins/workspace/Lucene-Solr-5.x-Linux/solr/build/solr-core/test/J2/temp/solr.cloud.ChaosMonkeyNothingIsSafeTest 5E9436BB251C6AC9-001/shard-1-001/cores/collection1/data/index/
   [junit4]   2> 1574830 T10896 N:127.0.0.1:43106_ c:collection1 oasc.SolrCore.initIndex WARN [collection1] Solr index directory '/home/jenkins/workspace/Lucene-Solr-5.x-Linux/solr/build/solr-core/test/J2/temp/solr.cloud.ChaosMonkeyNothingIsSafeTest 5E9436BB251C6AC9-001/shard-1-001/cores/collection1/data/index' doesn't exist. Creating new index...
   [junit4]   2> 1574830 T10896 N:127.0.0.1:43106_ c:collection1 oasc.CachingDirectoryFactory.get return new directory for /home/jenkins/workspace/Lucene-Solr-5.x-Linux/solr/build/solr-core/test/J2/temp/solr.cloud.ChaosMonkeyNothingIsSafeTest 5E9436BB251C6AC9-001/shard-1-001/cores/collection1/data/index
   [junit4]   2> 1574831 T10896 N:127.0.0.1:43106_ c:collection1 oasu.RandomMergePolicy.<init> RandomMergePolicy wrapping class org.apache.lucene.index.TieredMergePolicy: [TieredMergePolicy: maxMergeAtOnce=42, maxMergeAtOnceExplicit=20, maxMergedSegmentMB=36.4677734375, floorSegmentMB=1.41796875, forceMergeDeletesPctAllowed=10.968807385802696, segmentsPerTier=17.0, maxCFSSegmentSizeMB=8.796093022207999E12, noCFSRatio=0.45962386867516924
   [junit4]   2> 1574870 T10896 N:127.0.0.1:43106_ c:collection1 oasc.SolrDeletionPolicy.onCommit SolrDeletionPolicy.onCommit: commits: num=1
   [junit4]   2> 		commit{dir=/home/jenkins/workspace/Lucene-Solr-5.x-Linux/solr/build/solr-core/test/J2/temp/solr.cloud.ChaosMonkeyNothingIsSafeTest 5E9436BB251C6AC9-001/shard-1-001/cores/collection1/data/index,segFN=segments_1,generation=1}
   [junit4]   2> 1574871 T10896 N:127.0.0.1:43106_ c:collection1 oasc.SolrDeletionPolicy.updateCommits newest commit generation = 1
   [junit4]   2> 1574874 T10896 N:127.0.0.1:43106_ c:collection1 oasup.UpdateRequestProcessorChain.init creating updateRequestProcessorChain "nodistrib"
   [junit4]   2> 1574875 T10896 N:127.0.0.1:43106_ c:collection1 oasup.UpdateRequestProcessorChain.init creating updateRequestProcessorChain "dedupe"
   [junit4]   2> 1574875 T10896 N:127.0.0.1:43106_ c:collection1 oasup.UpdateRequestProcessorChain.init inserting DistributedUpdateProcessorFactory into updateRequestProcessorChain "dedupe"
   [junit4]   2> 1574875 T10896 N:127.0.0.1:43106_ c:collection1 oasup.UpdateRequestProcessorChain.init creating updateRequestProcessorChain "stored_sig"
   [junit4]   2> 1574875 T10896 N:127.0.0.1:43106_ c:collection1 oasup.UpdateRequestProcessorChain.init inserting DistributedUpdateProcessorFactory into updateRequestProcessorChain "stored_sig"
   [junit4]   2> 1574875 T10896 N:127.0.0.1:43106_ c:collection1 oasup.UpdateRequestProcessorChain.init creating updateRequestProcessorChain "distrib-dup-test-chain-explicit"
   [junit4]   2> 1574876 T10896 N:127.0.0.1:43106_ c:collection1 oasup.UpdateRequestProcessorChain.init creating updateRequestProcessorChain "distrib-dup-test-chain-implicit"
   [junit4]   2> 1574876 T10896 N:127.0.0.1:43106_ c:collection1 oasup.UpdateRequestProcessorChain.init inserting DistributedUpdateProcessorFactory into updateRequestProcessorChain "distrib-dup-test-chain-implicit"
   [junit4]   2> 1574876 T10896 N:127.0.0.1:43106_ c:collection1 oasc.SolrCore.loadUpdateProcessorChains no updateRequestProcessorChain defined as default, creating implicit default
   [junit4]   2> 1574878 T10896 N:127.0.0.1:43106_ c:collection1 oashl.XMLLoader.init xsltCacheLifetimeSeconds=60
   [junit4]   2> 1574879 T10896 N:127.0.0.1:43106_ c:collection1 oashl.XMLLoader.init xsltCacheLifetimeSeconds=60
   [junit4]   2> 1574880 T10896 N:127.0.0.1:43106_ c:collection1 oashl.XMLLoader.init xsltCacheLifetimeSeconds=60
   [junit4]   2> 1574881 T10896 N:127.0.0.1:43106_ c:collection1 oashl.XMLLoader.init xsltCacheLifetimeSeconds=60
   [junit4]   2> 1574887 T10896 N:127.0.0.1:43106_ c:collection1 oasc.RequestHandlers.initHandlersFromConfig Registered paths: /admin/file,/admin/ping,/replication,/update/json,/update/csv,/admin/threads,/update/json/docs,/config,/admin/system,standard,/get,/update,/admin/luke,/admin/plugins,/admin/properties,/admin/logging,/admin/mbeans,/admin/segments,/schema
   [junit4]   2> 1574890 T10896 N:127.0.0.1:43106_ c:collection1 oasc.SolrCore.initStatsCache Using default statsCache cache: org.apache.solr.search.stats.LocalStatsCache
   [junit4]   2> 1574890 T10896 N:127.0.0.1:43106_ c:collection1 oasu.UpdateHandler.<init> Using UpdateLog implementation: org.apache.solr.update.UpdateLog
   [junit4]   2> 1574890 T10896 N:127.0.0.1:43106_ c:collection1 oasu.UpdateLog.init Initializing UpdateLog: dataDir= defaultSyncLevel=FLUSH numRecordsToKeep=100 maxNumLogsToKeep=10
   [junit4]   2> 1574891 T10896 N:127.0.0.1:43106_ c:collection1 oasu.CommitTracker.<init> Hard AutoCommit: disabled
   [junit4]   2> 1574891 T10896 N:127.0.0.1:43106_ c:collection1 oasu.CommitTracker.<init> Soft AutoCommit: disabled
   [junit4]   2> 1574892 T10896 N:127.0.0.1:43106_ c:collection1 oasu.RandomMergePolicy.<init> RandomMergePolicy wrapping class org.apache.lucene.index.TieredMergePolicy: [TieredMergePolicy: maxMergeAtOnce=27, maxMergeAtOnceExplicit=37, maxMergedSegmentMB=11.169921875, floorSegmentMB=0.2802734375, forceMergeDeletesPctAllowed=5.693830658168428, segmentsPerTier=27.0, maxCFSSegmentSizeMB=8.796093022207999E12, noCFSRatio=0.0
   [junit4]   2> 1574892 T10896 N:127.0.0.1:43106_ c:collection1 oasc.SolrDeletionPolicy.onInit SolrDeletionPolicy.onInit: commits: num=1
   [junit4]   2> 		commit{dir=/home/jenkins/workspace/Lucene-Solr-5.x-Linux/solr/build/solr-core/test/J2/temp/solr.cloud.ChaosMonkeyNothingIsSafeTest 5E9436BB251C6AC9-001/shard-1-001/cores/collection1/data/index,segFN=segments_1,generation=1}
   [junit4]   2> 1574892 T10896 N:127.0.0.1:43106_ c:collection1 oasc.SolrDeletionPolicy.updateCommits newest commit generation = 1
   [junit4]   2> 1574893 T10896 N:127.0.0.1:43106_ c:collection1 oass.SolrIndexSearcher.<init> Opening Searcher@14bb96b[collection1] main
   [junit4]   2> 1574893 T10896 N:127.0.0.1:43106_ c:collection1 oascc.ZkStateReader.readConfigName Load collection config from:/collections/collection1
   [junit4]   2> 1574894 T10896 N:127.0.0.1:43106_ c:collection1 oascc.ZkStateReader.readConfigName path=/collections/collection1 configName=conf1 specified config exists in ZooKeeper
   [junit4]   2> 1574894 T10896 N:127.0.0.1:43106_ c:collection1 oasr.ManagedResourceStorage.newStorageIO Setting up ZooKeeper-based storage for the RestManager with znodeBase: /configs/conf1
   [junit4]   2> 1574894 T10896 N:127.0.0.1:43106_ c:collection1 oasr.ManagedResourceStorage$ZooKeeperStorageIO.configure Configured ZooKeeperStorageIO with znodeBase: /configs/conf1
   [junit4]   2> 1574894 T10896 N:127.0.0.1:43106_ c:collection1 oasr.RestManager.init Initializing RestManager with initArgs: {}
   [junit4]   2> 1574895 T10896 N:127.0.0.1:43106_ c:collection1 oasr.ManagedResourceStorage.load Reading _rest_managed.json using ZooKeeperStorageIO:path=/configs/conf1
   [junit4]   2> 1574895 T10896 N:127.0.0.1:43106_ c:collection1 oasr.ManagedResourceStorage$ZooKeeperStorageIO.openInputStream No data found for znode /configs/conf1/_rest_managed.json
   [junit4]   2> 1574895 T10896 N:127.0.0.1:43106_ c:collection1 oasr.ManagedResourceStorage.load Loaded null at path _rest_managed.json using ZooKeeperStorageIO:path=/configs/conf1
   [junit4]   2> 1574896 T10896 N:127.0.0.1:43106_ c:collection1 oasr.RestManager.init Initializing 0 registered ManagedResources
   [junit4]   2> 1574896 T10896 N:127.0.0.1:43106_ c:collection1 oash.ReplicationHandler.inform Commits will be reserved for  10000
   [junit4]   2> 1574897 T10897 N:127.0.0.1:43106_ c:collection1 oasc.SolrCore.registerSearcher [collection1] Registered new searcher Searcher@14bb96b[collection1] main{ExitableDirectoryReader(UninvertingDirectoryReader())}
   [junit4]   2> 1574898 T10896 N:127.0.0.1:43106_ c:collection1 oasc.CoreContainer.registerCore registering core: collection1
   [junit4]   2> 1574898 T10900 N:127.0.0.1:43106_ C:collection1 S:shard1 c:collection1 oasc.ZkController.register Register replica - core:collection1 address:http://127.0.0.1:43106 collection:collection1 shard:shard1
   [junit4]   2> 1574898 T10843 N:127.0.0.1:43106_ oass.SolrDispatchFilter.init user.dir=/home/jenkins/workspace/Lucene-Solr-5.x-Linux/solr/build/solr-core/test/J2
   [junit4]   2> 1574899 T10900 N:127.0.0.1:43106_ C:collection1 S:shard1 c:collection1 oascc.SolrZkClient.makePath makePath: /collections/collection1/leader_elect/shard1/election
   [junit4]   2> 1574899 T10843 N:127.0.0.1:43106_ oass.SolrDispatchFilter.init SolrDispatchFilter.init() done
   [junit4]   2> 1574901 T10900 N:127.0.0.1:43106_ C:collection1 S:shard1 c:collection1 oasc.ShardLeaderElectionContext.runLeaderProcess Running the leader process for shard shard1
   [junit4]   2> 1574902 T10869 N:127.0.0.1:51492_ oasc.DistributedQueue$LatchWatcher.process NodeChildrenChanged fired on path /overseer/queue state SyncConnected
   [junit4]   2> 1574902 T10900 N:127.0.0.1:43106_ C:collection1 S:shard1 c:collection1 oasc.ShardLeaderElectionContext.waitForReplicasToComeUp Enough replicas found to continue.
   [junit4]   2> 1574902 T10900 N:127.0.0.1:43106_ C:collection1 S:shard1 c:collection1 oasc.ShardLeaderElectionContext.runLeaderProcess I may be the new leader - try and sync
   [junit4]   2> 1574903 T10870 N:127.0.0.1:51492_ oasc.Overseer$ClusterStateUpdater.run processMessage: queueSize: 1, message = {
   [junit4]   2> 	  "operation":"leader",
   [junit4]   2> 	  "shard":"shard1",
   [junit4]   2> 	  "collection":"collection1"} current state version: 4
   [junit4]   2> ASYNC  NEW_CORE C3763 name=collection1 org.apache.solr.core.SolrCore@145649 url=http://127.0.0.1:43106/collection1 node=127.0.0.1:43106_ C3763_STATE=coll:collection1 core:collection1 props:{core=collection1, state=down, node_name=127.0.0.1:43106_, base_url=http://127.0.0.1:43106}
   [junit4]   2> 1574903 T10900 N:127.0.0.1:43106_ C:collection1 S:shard1 c:collection1 C3763 oasc.SyncStrategy.sync Sync replicas to http://127.0.0.1:43106/collection1/
   [junit4]   2> 1574903 T10900 N:127.0.0.1:43106_ C:collection1 S:shard1 c:collection1 C3763 oasc.SyncStrategy.syncReplicas Sync Success - now sync replicas to me
   [junit4]   2> 1574903 T10900 N:127.0.0.1:43106_ C:collection1 S:shard1 c:collection1 C3763 oasc.SyncStrategy.syncToMe http://127.0.0.1:43106/collection1/ has no replicas
   [junit4]   2> 1574903 T10900 N:127.0.0.1:43106_ C:collection1 S:shard1 c:collection1 oasc.ShardLeaderElectionContext.runLeaderProcess I am the new leader: http://127.0.0.1:43106/collection1/ shard1
   [junit4]   2> 1574904 T10900 N:127.0.0.1:43106_ C:collection1 S:shard1 c:collection1 oascc.SolrZkClient.makePath makePath: /collections/collection1/leaders/shard1
   [junit4]   2> 1574906 T10869 N:127.0.0.1:51492_ oasc.DistributedQueue$LatchWatcher.process NodeChildrenChanged fired on path /overseer/queue state SyncConnected
   [junit4]   2> 1574906 T10870 N:127.0.0.1:51492_ oasc.Overseer$ClusterStateUpdater.run processMessage: queueSize: 1, message = {
   [junit4]   2> 	  "operation":"leader",
   [junit4]   2> 	  "shard":"shard1",
   [junit4]   2> 	  "collection":"collection1",
   [junit4]   2> 	  "base_url":"http://127.0.0.1:43106",
   [junit4]   2> 	  "core":"collection1",
   [junit4]   2> 	  "state":"active"} current state version: 4
   [junit4]   2> 1575006 T10843 oas.SolrTestCaseJ4.writeCoreProperties Writing core.properties file to /home/jenkins/workspace/Lucene-Solr-5.x-Linux/solr/build/solr-core/test/J2/temp/solr.cloud.ChaosMonkeyNothingIsSafeTest 5E9436BB251C6AC9-001/shard-2-001/cores/collection1
   [junit4]   2> 1575007 T10843 oasc.AbstractFullDistribZkTestBase.createJettys create jetty 2 in directory /home/jenkins/workspace/Lucene-Solr-5.x-Linux/solr/build/solr-core/test/J2/temp/solr.cloud.ChaosMonkeyNothingIsSafeTest 5E9436BB251C6AC9-001/shard-2-001
   [junit4]   2> 1575007 T10843 oejs.Server.doStart jetty-8.1.10.v20130312
   [junit4]   2> 1575008 T10869 N:127.0.0.1:51492_ oascc.ZkStateReader$2.process A cluster state change: WatchedEvent state:SyncConnected type:NodeDataChanged path:/clusterstate.json, has occurred - updating... (live nodes size: 2)
   [junit4]   2> 1575008 T10895 N:127.0.0.1:43106_ oascc.ZkStateReader$2.process A cluster state change: WatchedEvent state:SyncConnected type:NodeDataChanged path:/clusterstate.json, has occurred - updating... (live nodes size: 2)
   [junit4]   2> 1575009 T10843 oejs.AbstractConnector.doStart Started SelectChannelConnector@127.0.0.1:36393
   [junit4]   2> 1575008 T10880 oascc.ZkStateReader$2.process A cluster state change: WatchedEvent state:SyncConnected type:NodeDataChanged path:/clusterstate.json, has occurred - updating... (live nodes size: 2)
   [junit4]   2> 1575009 T10843 oascse.JettySolrRunner$1.lifeCycleStarted Jetty properties: {coreRootDirectory=/home/jenkins/workspace/Lucene-Solr-5.x-Linux/solr/build/solr-core/test/J2/temp/solr.cloud.ChaosMonkeyNothingIsSafeTest 5E9436BB251C6AC9-001/shard-2-001/cores, solrconfig=solrconfig.xml, hostPort=36393, hostContext=/, solr.data.dir=/home/jenkins/workspace/Lucene-Solr-5.x-Linux/solr/build/solr-core/test/J2/temp/solr.cloud.ChaosMonkeyNothingIsSafeTest 5E9436BB251C6AC9-001/tempDir-001/jetty2}
   [junit4]   2> 1575010 T10843 oass.SolrDispatchFilter.init SolrDispatchFilter.init()sun.misc.Launcher$AppClassLoader@29a046
   [junit4]   2> 1575010 T10843 oasc.SolrResourceLoader.<init> new SolrResourceLoader for directory: '/home/jenkins/workspace/Lucene-Solr-5.x-Linux/solr/build/solr-core/test/J2/temp/solr.cloud.ChaosMonkeyNothingIsSafeTest 5E9436BB251C6AC9-001/shard-2-001/'
   [junit4]   2> 1575022 T10843 oasc.SolrXmlConfig.fromFile Loading container configuration from /home/jenkins/workspace/Lucene-Solr-5.x-Linux/solr/build/solr-core/test/J2/temp/solr.cloud.ChaosMonkeyNothingIsSafeTest 5E9436BB251C6AC9-001/shard-2-001/solr.xml
   [junit4]   2> 1575034 T10843 oasc.CorePropertiesLocator.<init> Config-defined core root directory: /home/jenkins/workspace/Lucene-Solr-5.x-Linux/solr/build/solr-core/test/J2/temp/solr.cloud.ChaosMonkeyNothingIsSafeTest 5E9436BB251C6AC9-001/shard-2-001/cores
   [junit4]   2> 1575034 T10843 oasc.CoreContainer.<init> New CoreContainer 4561716
   [junit4]   2> 1575034 T10843 oasc.CoreContainer.load Loading cores into CoreContainer [instanceDir=/home/jenkins/workspace/Lucene-Solr-5.x-Linux/solr/build/solr-core/test/J2/temp/solr.cloud.ChaosMonkeyNothingIsSafeTest 5E9436BB251C6AC9-001/shard-2-001/]
   [junit4]   2> 1575035 T10843 oasc.CoreContainer.load loading shared library: /home/jenkins/workspace/Lucene-Solr-5.x-Linux/solr/build/solr-core/test/J2/temp/solr.cloud.ChaosMonkeyNothingIsSafeTest 5E9436BB251C6AC9-001/shard-2-001/lib
   [junit4]   2> 1575035 T10843 oasc.SolrResourceLoader.addToClassLoader WARN Can't find (or read) directory to add to classloader: lib (resolved as: /home/jenkins/workspace/Lucene-Solr-5.x-Linux/solr/build/solr-core/test/J2/temp/solr.cloud.ChaosMonkeyNothingIsSafeTest 5E9436BB251C6AC9-001/shard-2-001/lib).
   [junit4]   2> 1575041 T10843 oashc.HttpShardHandlerFactory.init created with socketTimeout : 90000,urlScheme : ,connTimeout : 15000,maxConnectionsPerHost : 20,maxConnections : 10000,corePoolSize : 0,maximumPoolSize : 2147483647,maxThreadIdleTime : 5,sizeOfQueue : -1,fairnessPolicy : false,useRetries : false,
   [junit4]   2> 1575042 T10843 oasu.UpdateShardHandler.<init> Creating UpdateShardHandler HTTP client with params: socketTimeout=340000&connTimeout=45000&retry=true
   [junit4]   2> 1575042 T10843 oasl.LogWatcher.createWatcher SLF4J impl is org.slf4j.impl.Log4jLoggerFactory
   [junit4]   2> 1575043 T10843 oasl.LogWatcher.newRegisteredLogWatcher Registering Log Listener [Log4j (org.slf4j.impl.Log4jLoggerFactory)]
   [junit4]   2> 1575043 T10843 oasc.CoreContainer.load Node Name: 127.0.0.1
   [junit4]   2> 1575043 T10843 oasc.ZkContainer.initZooKeeper Zookeeper client=127.0.0.1:36195/solr
   [junit4]   2> 1575043 T10843 oasc.ZkController.checkChrootPath zkHost includes chroot
   [junit4]   2> 1575044 T10843 oascc.SolrZkClient.createZkCredentialsToAddAutomatically Using default ZkCredentialsProvider
   [junit4]   2> 1575044 T10843 oascc.ConnectionManager.waitForConnected Waiting for client to connect to ZooKeeper
   [junit4]   2> 1575045 T10912 oascc.ConnectionManager.process Watcher org.apache.solr.common.cloud.ConnectionManager@1e8bd1b name:ZooKeeperConnection Watcher:127.0.0.1:36195 got event WatchedEvent state:SyncConnected type:None path:null path:null type:None
   [junit4]   2> 1575045 T10843 oascc.ConnectionManager.waitForConnected Client is connected to ZooKeeper
   [junit4]   2> 1575046 T10843 oascc.SolrZkClient.createZkACLProvider Using default ZkACLProvider
   [junit4]   2> 1575047 T10843 N:127.0.0.1:36393_ oascc.ConnectionManager.waitForConnected Waiting for client to connect to ZooKeeper
   [junit4]   2> 1575048 T10915 N:127.0.0.1:36393_ oascc.ConnectionManager.process Watcher org.apache.solr.common.cloud.ConnectionManager@10d841b name:ZooKeeperConnection Watcher:127.0.0.1:36195/solr got event WatchedEvent state:SyncConnected type:None path:null path:null type:None
   [junit4]   2> 1575048 T10843 N:127.0.0.1:36393_ oascc.ConnectionManager.waitForConnected Client is connected to ZooKeeper
   [junit4]   2> 1575050 T10843 N:127.0.0.1:36393_ oascc.ZkStateReader.createClusterStateWatchersAndUpdate Updating cluster state from ZooKeeper... 
   [junit4]   2> 1575056 T10900 N:127.0.0.1:43106_ C:collection1 S:shard1 c:collection1 oasc.ZkController.register We are http://127.0.0.1:43106/collection1/ and leader is http://127.0.0.1:43106/collection1/
   [junit4]   2> 1575057 T10900 N:127.0.0.1:43106_ C:collection1 S:shard1 c:collection1 oasc.ZkController.register No LogReplay needed for core=collection1 baseURL=http://127.0.0.1:43106
   [junit4]   2> 1575057 T10900 N:127.0.0.1:43106_ C:collection1 S:shard1 c:collection1 oasc.ZkController.checkRecovery I am the leader, no recovery necessary
   [junit4]   2> 1575057 T10900 N:127.0.0.1:43106_ C:collection1 S:shard1 c:collection1 oasc.ZkController.publish publishing core=collection1 state=active collection=collection1
   [junit4]   2> 1575057 T10900 N:127.0.0.1:43106_ C:collection1 S:shard1 c:collection1 oasc.ZkController.publish numShards not found on descriptor - reading it from system property
   [junit4]   2> 1575058 T10869 N:127.0.0.1:51492_ oasc.DistributedQueue$LatchWatcher.process NodeChildrenChanged fired on path /overseer/queue state SyncConnected
   [junit4]   2> 1575059 T10870 N:127.0.0.1:51492_ oasc.Overseer$ClusterStateUpdater.run processMessage: queueSize: 1, message = {
   [junit4]   2> 	  "core_node_name":"core_node1",
   [junit4]   2> 	  "numShards":"1",
   [junit4]   2> 	  "shard":"shard1",
   [junit4]   2> 	  "core":"collection1",
   [junit4]   2> 	  "state":"active",
   [junit4]   2> 	  "node_name":"127.0.0.1:43106_",
   [junit4]   2> 	  "roles":null,
   [junit4]   2> 	  "collection":"collection1",
   [junit4]   2> 	  "operation":"state",
   [junit4]   2> 	  "base_url":"http://127.0.0.1:43106"} current state version: 5
   [junit4]   2> 1575059 T10870 N:127.0.0.1:51492_ oasco.ReplicaMutator.updateState Update state numShards=1 message={
   [junit4]   2> 	  "core_node_name":"core_node1",
   [junit4]   2> 	  "numShards":"1",
   [junit4]   2> 	  "shard":"shard1",
   [junit4]   2> 	  "core":"collection1",
   [junit4]   2> 	  "state":"active",
   [junit4]   2> 	  "node_name":"127.0.0.1:43106_",
   [junit4]   2> 	  "roles":null,
   [junit4]   2> 	  "collection":"collection1",
   [junit4]   2> 	  "operation":"state",
   [junit4]   2> 	  "base_url":"http://127.0.0.1:43106"}
   [junit4]   2> 1575161 T10915 N:127.0.0.1:36393_ oascc.ZkStateReader$2.process A cluster state change: WatchedEvent state:SyncConnected type:NodeDataChanged path:/clusterstate.json, has occurred - updating... (live nodes size: 2)
   [junit4]   2> 1575161 T10869 N:127.0.0.1:51492_ oascc.ZkStateReader$2.process A cluster state change: WatchedEvent state:SyncConnected type:NodeDataChanged path:/clusterstate.json, has occurred - updating... (live nodes size: 2)
   [junit4]   2> 1575161 T10880 oascc.ZkStateReader$2.process A cluster state change: WatchedEvent state:SyncConnected type:NodeDataChanged path:/clusterstate.json, has occurred - updating... (live nodes size: 2)
   [junit4]   2> 1575161 T10895 N:127.0.0.1:43106_ oascc.ZkStateReader$2.process A cluster state change: WatchedEvent state:SyncConnected type:NodeDataChanged path:/clusterstate.json, has occurred - updating... (live nodes size: 2)
   [junit4]   2> 1576052 T10843 N:127.0.0.1:36393_ oasc.ZkController.createEphemeralLiveNode Register node as live in ZooKeeper:/live_nodes/127.0.0.1:36393_
   [junit4]   2> 1576053 T10843 N:127.0.0.1:36393_ oascc.SolrZkClient.makePath makePath: /live_nodes/127.0.0.1:36393_
   [junit4]   2> 1576054 T10843 N:127.0.0.1:36393_ oasc.Overseer.close Overseer (id=null) closing
   [junit4]   2> 1576055 T10843 N:127.0.0.1:36393_ oasc.CorePropertiesLocator.discover Looking for core definitions underneath /home/jenkins/workspace/Lucene-Solr-5.x-Linux/solr/build/solr-core/test/J2/temp/solr.cloud.ChaosMonkeyNothingIsSafeTest 5E9436BB251C6AC9-001/shard-2-001/cores
   [junit4]   2> 1576056 T10843 N:127.0.0.1:36393_ oasc.CoreDescriptor.<init> CORE DESCRIPTOR: {loadOnStartup=true, transient=false, coreNodeName=, dataDir=data/, name=collection1, shard=, absoluteInstDir=/home/jenkins/workspace/Lucene-Solr-5.x-Linux/solr/build/solr-core/test/J2/temp/solr.cloud.ChaosMonkeyNothingIsSafeTest 5E9436BB251C6AC9-001/shard-2-001/cores/collection1/, config=solrconfig.xml, instanceDir=/home/jenkins/workspace/Lucene-Solr-5.x-Linux/solr/build/solr-core/test/J2/temp/solr.cloud.ChaosMonkeyNothingIsSafeTest 5E9436BB251C6AC9-001/shard-2-001/cores/collection1, schema=schema.xml, collection=collection1}
   [junit4]   2> 1576056 T10843 N:127.0.0.1:36393_ oasc.CorePropertiesLocator.discoverUnder Found core collection1 in /home/jenkins/workspace/Lucene-Solr-5.x-Linux/solr/build/solr-core/test/J2/temp/solr.cloud.ChaosMonkeyNothingIsSafeTest 5E9436BB251C6AC9-001/shard-2-001/cores/collection1/
   [junit4]   2> 1576057 T10843 N:127.0.0.1:36393_ oasc.CorePropertiesLocator.discover Found 1 core definitions
   [junit4]   2> 1576057 T10916 N:127.0.0.1:36393_ C:collection1 c:collection1 oasc.ZkController.publish publishing core=collection1 state=down collection=collection1
   [junit4]   2> 1576058 T10916 N:127.0.0.1:36393_ C:collection1 c:collection1 oasc.ZkController.publish numShards not found on descriptor - reading it from system property
   [junit4]   2> 1576058 T10869 N:127.0.0.1:51492_ oasc.DistributedQueue$LatchWatcher.process NodeChildrenChanged fired on path /overseer/queue state SyncConnected
   [junit4]   2> 1576058 T10916 N:127.0.0.1:36393_ oasc.ZkController.waitForCoreNodeName look for our core node name
   [junit4]   2> 1576059 T10870 N:127.0.0.1:51492_ oasc.Overseer$ClusterStateUpdater.run processMessage: queueSize: 1, message = {
   [junit4]   2> 	  "numShards":"1",
   [junit4]   2> 	  "shard":null,
   [junit4]   2> 	  "core":"collection1",
   [junit4]   2> 	  "state":"down",
   [junit4]   2> 	  "node_name":"127.0.0.1:36393_",
   [junit4]   2> 	  "roles":null,
   [junit4]   2> 	  "collection":"collection1",
   [junit4]   2> 	  "operation":"state",
   [junit4]   2> 	  "base_url":"http://127.0.0.1:36393"} current state version: 6
   [junit4]   2> 1576059 T10870 N:127.0.0.1:51492_ oasco.ReplicaMutator.updateState Update state numShards=1 message={
   [junit4]   2> 	  "numShards":"1",
   [junit4]   2> 	  "shard":null,
   [junit4]   2> 	  "core":"collection1",
   [junit4]   2> 	  "state":"down",
   [junit4]   2> 	  "node_name":"127.0.0.1:36393_",
   [junit4]   2> 	  "roles":null,
   [junit4]   2> 	  "collection":"collection1",
   [junit4]   2> 	  "operation":"state",
   [junit4]   2> 	  "base_url":"http://127.0.0.1:36393"}
   [junit4]   2> 1576059 T10870 N:127.0.0.1:51492_ oasco.ReplicaMutator.updateState Collection already exists with numShards=1
   [junit4]   2> 1576059 T10870 N:127.0.0.1:51492_ oasco.ReplicaMutator.updateState Assigning new node to shard shard=shard1
   [junit4]   2> 1576161 T10880 oascc.ZkStateReader$2.process A cluster state change: WatchedEvent state:SyncConnected type:NodeDataChanged path:/clusterstate.json, has occurred - updating... (live nodes size: 3)
   [junit4]   2> 1576161 T10895 N:127.0.0.1:43106_ oascc.ZkStateReader$2.process A cluster state change: WatchedEvent state:SyncConnected type:NodeDataChanged path:/clusterstate.json, has occurred - updating... (live nodes size: 3)
   [junit4]   2> 1576161 T10869 N:127.0.0.1:51492_ oascc.ZkStateReader$2.process A cluster state change: WatchedEvent state:SyncConnected type:NodeDataChanged path:/clusterstate.json, has occurred - updating... (live nodes size: 3)
   [junit4]   2> 1576161 T10915 N:127.0.0.1:36393_ oascc.ZkStateReader$2.process A cluster state change: WatchedEvent state:SyncConnected type:NodeDataChanged path:/clusterstate.json, has occurred - updating... (live nodes size: 3)
   [junit4]   2> 1577059 T10916 N:127.0.0.1:36393_ oasc.ZkController.waitForShardId waiting to find shard id in clusterstate for collection1
   [junit4]   2> 1577059 T10916 N:127.0.0.1:36393_ oasc.ZkController.createCollectionZkNode Check for collection zkNode:collection1
   [junit4]   2> 1577059 T10916 N:127.0.0.1:36393_ oasc.ZkController.createCollectionZkNode Collection zkNode exists
   [junit4]   2> 1577060 T10916 N:127.0.0.1:36393_ oascc.ZkStateReader.readConfigName Load collection config from:/collections/collection1
   [junit4]   2> 1577065 T10916 N:127.0.0.1:36393_ oascc.ZkStateReader.readConfigName path=/collections/collection1 configName=conf1 specified config exists in ZooKeeper
   [junit4]   2> 1577065 T10916 N:127.0.0.1:36393_ oasc.SolrResourceLoader.<init> new SolrResourceLoader for directory: '/home/jenkins/workspace/Lucene-Solr-5.x-Linux/solr/build/solr-core/test/J2/temp/solr.cloud.ChaosMonkeyNothingIsSafeTest 5E9436BB251C6AC9-001/shard-2-001/cores/collection1/'
   [junit4]   2> 1577077 T10916 N:127.0.0.1:36393_ oasc.ZkController.watchZKConfDir watch zkdir /configs/conf1
   [junit4]   2> 1577078 T10916 N:127.0.0.1:36393_ oasc.Config.<init> loaded config solrconfig.xml with version 0 
   [junit4]   2> 1577082 T10916 N:127.0.0.1:36393_ oasc.SolrConfig.refreshRequestParams current version of requestparams : -1
   [junit4]   2> 1577093 T10916 N:127.0.0.1:36393_ oasc.SolrConfig.<init> Using Lucene MatchVersion: 5.2.0
   [junit4]   2> 1577116 T10916 N:127.0.0.1:36393_ oasc.SolrConfig.<init> Loaded SolrConfig: solrconfig.xml
   [junit4]   2> 1577117 T10916 N:127.0.0.1:36393_ oass.IndexSchema.readSchema Reading Solr Schema from /configs/conf1/schema.xml
   [junit4]   2> 1577123 T10916 N:127.0.0.1:36393_ oass.IndexSchema.readSchema [collection1] Schema name=test
   [junit4]   2> 1577282 T10916 N:127.0.0.1:36393_ oass.IndexSchema.readSchema default search field in schema is text
   [junit4]   2> 1577284 T10916 N:127.0.0.1:36393_ oass.IndexSchema.readSchema unique key field: id
   [junit4]   2> 1577285 T10916 N:127.0.0.1:36393_ oass.FileExchangeRateProvider.reload Reloading exchange rates from file currency.xml
   [junit4]   2> 1577288 T10916 N:127.0.0.1:36393_ oass.FileExchangeRateProvider.reload Reloading exchange rates from file currency.xml
   [junit4]   2> 1577297 T10916 N:127.0.0.1:36393_ oasc.CoreContainer.create Creating SolrCore 'collection1' using configuration from collection collection1
   [junit4]   2> 1577298 T10916 N:127.0.0.1:36393_ c:collection1 oasc.SolrCore.initDirectoryFactory solr.StandardDirectoryFactory
   [junit4]   2> 1577298 T10916 N:127.0.0.1:36393_ c:collection1 oasc.SolrCore.<init> [collection1] Opening new SolrCore at /home/jenkins/workspace/Lucene-Solr-5.x-Linux/solr/build/solr-core/test/J2/temp/solr.cloud.ChaosMonkeyNothingIsSafeTest 5E9436BB251C6AC9-001/shard-2-001/cores/collection1/, dataDir=/home/jenkins/workspace/Lucene-Solr-5.x-Linux/solr/build/solr-core/test/J2/temp/solr.cloud.ChaosMonkeyNothingIsSafeTest 5E9436BB251C6AC9-001/shard-2-001/cores/collection1/data/
   [junit4]   2> 1577298 T10916 N:127.0.0.1:36393_ c:collection1 oasc.JmxMonitoredMap.<init> JMX monitoring is enabled. Adding Solr mbeans to JMX Server: com.sun.jmx.mbeanserver.JmxMBeanServer@12678ab
   [junit4]   2> 1577301 T10916 N:127.0.0.1:36393_ c:collection1 oasc.CachingDirectoryFactory.get return new directory for /home/jenkins/workspace/Lucene-Solr-5.x-Linux/solr/build/solr-core/test/J2/temp/solr.cloud.ChaosMonkeyNothingIsSafeTest 5E9436BB251C6AC9-001/shard-2-001/cores/collection1/data
   [junit4]   2> 1577301 T10916 N:127.0.0.1:36393_ c:collection1 oasc.SolrCore.getNewIndexDir New index directory detected: old=null new=/home/jenkins/workspace/Lucene-Solr-5.x-Linux/solr/build/solr-core/test/J2/temp/solr.cloud.ChaosMonkeyNothingIsSafeTest 5E9436BB251C6AC9-001/shard-2-001/cores/collection1/data/index/
   [junit4]   2> 1577301 T10916 N:127.0.0.1:36393_ c:collection1 oasc.SolrCore.initIndex WARN [collection1] Solr index directory '/home/jenkins/workspace/Lucene-Solr-5.x-Linux/solr/build/solr-core/test/J2/temp/solr.cloud.ChaosMonkeyNothingIsSafeTest 5E9436BB251C6AC9-001/shard-2-001/cores/collection1/data/index' doesn't exist. Creating new index...
   [junit4]   2> 1577302 T10916 N:127.0.0.1:36393_ c:collection1 oasc.CachingDirectoryFactory.get return new directory for /home/jenkins/workspace/Lucene-Solr-5.x-Linux/solr/build/solr-core/test/J2/temp/solr.cloud.ChaosMonkeyNothingIsSafeTest 5E9436BB251C6AC9-001/shard-2-001/cores/collection1/data/index
   [junit4]   2> 1577302 T10916 N:127.0.0.1:36393_ c:collection1 oasu.RandomMergePolicy.<init> RandomMergePolicy wrapping class org.apache.lucene.index.TieredMergePolicy: [TieredMergePolicy: maxMergeAtOnce=42, maxMergeAtOnceExplicit=20, maxMergedSegmentMB=36.4677734375, floorSegmentMB=1.41796875, forceMergeDeletesPctAllowed=10.968807385802696, segmentsPerTier=17.0, maxCFSSegmentSizeMB=8.796093022207999E12, noCFSRatio=0.45962386867516924
   [junit4]   2> 1577332 T10916 N:127.0.0.1:36393_ c:collection1 oasc.SolrDeletionPolicy.onCommit SolrDeletionPolicy.onCommit: commits: num=1
   [junit4]   2> 		commit{dir=/home/jenkins/workspace/Lucene-Solr-5.x-Linux/solr/build/solr-core/test/J2/temp/solr.cloud.ChaosMonkeyNothingIsSafeTest 5E9436BB251C6AC9-001/shard-2-001/cores/collection1/data/index,segFN=segments_1,generation=1}
   [junit4]   2> 1577333 T10916 N:127.0.0.1:36393_ c:collection1 oasc.SolrDeletionPolicy.updateCommits newest commit generation = 1
   [junit4]   2> 1577345 T10916 N:127.0.0.1:36393_ c:collection1 oasup.UpdateRequestProcessorChain.init creating updateRequestProcessorChain "nodistrib"
   [junit4]   2> 1577346 T10916 N:127.0.0.1:36393_ c:collection1 oasup.UpdateRequestProcessorChain.init creating updateRequestProcessorChain "dedupe"
   [junit4]   2> 1577346 T10916 N:127.0.0.1:36393_ c:collection1 oasup.UpdateRequestProcessorChain.init inserting DistributedUpdateProcessorFactory into updateRequestProcessorChain "dedupe"
   [junit4]   2> 1577346 T10916 N:127.0.0.1:36393_ c:collection1 oasup.UpdateRequestProcessorChain.init creating updateRequestProcessorChain "stored_sig"
   [junit4]   2> 1577346 T10916 N:127.0.0.1:36393_ c:collection1 oasup.UpdateRequestProcessorChain.init inserting DistributedUpdateProcessorFactory into updateRequestProcessorChain "stored_sig"
   [junit4]   2> 1577347 T10916 N:127.0.0.1:36393_ c:collection1 oasup.UpdateRequestProcessorChain.init creating updateRequestProcessorChain "distrib-dup-test-chain-explicit"
   [junit4]   2> 1577347 T10916 N:127.0.0.1:36393_ c:collection1 oasup.UpdateRequestProcessorChain.init creating updateRequestProcessorChain "distrib-dup-test-chain-implicit"
   [junit4]   2> 1577347 T10916 N:127.0.0.1:36393_ c:collection1 oasup.UpdateRequestProcessorChain.init inserting DistributedUpdateProcessorFactory into updateRequestProcessorChain "distrib-dup-test-chain-implicit"
   [junit4]   2> 1577347 T10916 N:127.0.0.1:36393_ c:collection1 oasc.SolrCor

[...truncated too long message...]

olr/build/solr-core/test/J2/temp/solr.cloud.ChaosMonkeyNothingIsSafeTest 5E9436BB251C6AC9-001/shard-2-001/cores/collection1/data;done=false>>]
   [junit4]   2> 1610418 T10843 C:control_collection S:shard1 c:collection1 oasc.CachingDirectoryFactory.close Closing directory: /home/jenkins/workspace/Lucene-Solr-5.x-Linux/solr/build/solr-core/test/J2/temp/solr.cloud.ChaosMonkeyNothingIsSafeTest 5E9436BB251C6AC9-001/shard-2-001/cores/collection1/data
   [junit4]   2> 1610419 T10843 C:control_collection S:shard1 c:collection1 oasc.Overseer.close Overseer (id=93656293098061832-127.0.0.1:36393_-n_0000000002) closing
   [junit4]   2> 1610419 T11000 N:127.0.0.1:36393_ oasc.Overseer$ClusterStateUpdater.run Overseer Loop exiting : 127.0.0.1:36393_
   [junit4]   2> 1611919 T10915 N:127.0.0.1:36393_ oascc.ZkStateReader.getIndividualColls WARN Error reading collections nodes org.apache.zookeeper.KeeperException$SessionExpiredException: KeeperErrorCode = Session expired for /collections/control_collection/state.json
   [junit4]   2> 	at org.apache.zookeeper.KeeperException.create(KeeperException.java:127)
   [junit4]   2> 	at org.apache.zookeeper.KeeperException.create(KeeperException.java:51)
   [junit4]   2> 	at org.apache.zookeeper.ZooKeeper.exists(ZooKeeper.java:1045)
   [junit4]   2> 	at org.apache.solr.common.cloud.SolrZkClient$5.execute(SolrZkClient.java:311)
   [junit4]   2> 	at org.apache.solr.common.cloud.SolrZkClient$5.execute(SolrZkClient.java:308)
   [junit4]   2> 	at org.apache.solr.common.cloud.ZkCmdExecutor.retryOperation(ZkCmdExecutor.java:61)
   [junit4]   2> 	at org.apache.solr.common.cloud.SolrZkClient.exists(SolrZkClient.java:308)
   [junit4]   2> 	at org.apache.solr.common.cloud.ZkStateReader.getIndividualColls(ZkStateReader.java:498)
   [junit4]   2> 	at org.apache.solr.common.cloud.ZkStateReader.constructState(ZkStateReader.java:453)
   [junit4]   2> 	at org.apache.solr.common.cloud.ZkStateReader.access$200(ZkStateReader.java:54)
   [junit4]   2> 	at org.apache.solr.common.cloud.ZkStateReader$2.process(ZkStateReader.java:316)
   [junit4]   2> 	at org.apache.solr.common.cloud.SolrZkClient$3$1.run(SolrZkClient.java:264)
   [junit4]   2> 	at java.util.concurrent.Executors$RunnableAdapter.call(Executors.java:471)
   [junit4]   2> 	at java.util.concurrent.FutureTask.run(FutureTask.java:262)
   [junit4]   2> 	at org.apache.solr.common.util.ExecutorUtil$MDCAwareThreadPoolExecutor$1.run(ExecutorUtil.java:146)
   [junit4]   2> 	at java.util.concurrent.ThreadPoolExecutor.runWorker(ThreadPoolExecutor.java:1145)
   [junit4]   2> 	at java.util.concurrent.ThreadPoolExecutor$Worker.run(ThreadPoolExecutor.java:615)
   [junit4]   2> 	at java.lang.Thread.run(Thread.java:745)
   [junit4]   2> 
   [junit4]   2> 1611920 T10960 N:127.0.0.1:36393_ oascc.ZkStateReader$3.process WARN ZooKeeper watch triggered, but Solr cannot talk to ZK
   [junit4]   2> 1611951 T10843 oejsh.ContextHandler.doStop stopped o.e.j.s.ServletContextHandler{/,null}
   [junit4]   2> 1612142 T10843 C:control_collection S:shard1 c:collection1 oasc.ZkTestServer.send4LetterWord connecting to 127.0.0.1:36195 36195
   [junit4]   2> 1612172 T10984 oasc.ZkTestServer.send4LetterWord connecting to 127.0.0.1:36195 36195
   [junit4]   2> NOTE: reproduce with: ant test  -Dtestcase=ChaosMonkeyNothingIsSafeTest -Dtests.method=test -Dtests.seed=5E9436BB251C6AC9 -Dtests.multiplier=3 -Dtests.slow=true -Dtests.locale=es -Dtests.timezone=Etc/GMT+3 -Dtests.asserts=true -Dtests.file.encoding=ISO-8859-1
   [junit4] FAILURE 41.4s J2 | ChaosMonkeyNothingIsSafeTest.test <<<
   [junit4]    > Throwable #1: java.lang.AssertionError: There were too many update fails (36 > 20) - we expect it can happen, but shouldn't easily
   [junit4]    > 	at __randomizedtesting.SeedInfo.seed([5E9436BB251C6AC9:D6C009618BE00731]:0)
   [junit4]    > 	at org.apache.solr.cloud.ChaosMonkeyNothingIsSafeTest.test(ChaosMonkeyNothingIsSafeTest.java:230)
   [junit4]    > 	at org.apache.solr.BaseDistributedSearchTestCase$ShardsRepeatRule$ShardsFixedStatement.callStatement(BaseDistributedSearchTestCase.java:960)
   [junit4]    > 	at org.apache.solr.BaseDistributedSearchTestCase$ShardsRepeatRule$ShardsStatement.evaluate(BaseDistributedSearchTestCase.java:935)
   [junit4]    > 	at java.lang.Thread.run(Thread.java:745)
   [junit4]   2> 1612178 T10843 C:control_collection S:shard1 c:collection1 oas.SolrTestCaseJ4.deleteCore ###deleteCore
   [junit4]   2> NOTE: leaving temporary files on disk at: /home/jenkins/workspace/Lucene-Solr-5.x-Linux/solr/build/solr-core/test/J2/temp/solr.cloud.ChaosMonkeyNothingIsSafeTest 5E9436BB251C6AC9-001
   [junit4]   2> 41373 T10842 ccr.ThreadLeakControl.checkThreadLeaks WARNING Will linger awaiting termination of 1 leaked thread(s).
   [junit4]   2> NOTE: test params are: codec=CheapBastard, sim=RandomSimilarityProvider(queryNorm=true,coord=yes): {}, locale=es, timezone=Etc/GMT+3
   [junit4]   2> NOTE: Linux 3.13.0-49-generic i386/Oracle Corporation 1.7.0_80-ea (32-bit)/cpus=12,threads=1,free=404688552,total=518979584
   [junit4]   2> NOTE: All tests run in this JVM: [TestDynamicLoading, FacetPivotSmallTest, TestReplicaProperties, TestCSVResponseWriter, TestBM25SimilarityFactory, SuggestComponentTest, TestSolrJ, TestFileDictionaryLookup, OverseerCollectionProcessorTest, LeaderElectionTest, TestSolrQueryParser, OverseerStatusTest, QueryEqualityTest, SolrIndexSplitterTest, AnalysisErrorHandlingTest, TestGroupingSearch, ExitableDirectoryReaderTest, DirectUpdateHandlerOptimizeTest, TestPseudoReturnFields, TestHdfsUpdateLog, TestUtils, SOLR749Test, TestSurroundQueryParser, RecoveryAfterSoftCommitTest, MoreLikeThisHandlerTest, SearchHandlerTest, MergeStrategyTest, TestMiniSolrCloudClusterSSL, SoftAutoCommitTest, BadIndexSchemaTest, SynonymTokenizerTest, CloudExitableDirectoryReaderTest, TestReload, TriLevelCompositeIdRoutingTest, DistributedFacetPivotLargeTest, TestFieldResource, TestBinaryResponseWriter, UnloadDistributedZkTest, TestBlendedInfixSuggestions, TestXIncludeConfig, RegexBoostProcessorTest, CircularListTest, TestQueryTypes, CustomCollectionTest, TestReloadAndDeleteDocs, TestPivotHelperCode, ConnectionManagerTest, TestSystemIdResolver, TestPartialUpdateDeduplication, TestImplicitCoreProperties, TestInitParams, DateRangeFieldTest, SolrInfoMBeanTest, HdfsLockFactoryTest, AliasIntegrationTest, DeleteShardTest, TestAddFieldRealTimeGet, TestQuerySenderNoQuery, TestPerFieldSimilarity, TestBulkSchemaConcurrent, RecoveryZkTest, DistanceUnitsTest, TestInfoStreamLogging, TestTrie, TestFastOutputStream, TestSearcherReuse, TestShortCircuitedRequests, SimpleFacetsTest, PluginInfoTest, BinaryUpdateRequestHandlerTest, SortByFunctionTest, EnumFieldTest, TestSolrXml, TestRestoreCore, TestManagedResource, BasicDistributedZk2Test, CollectionsAPIDistributedZkTest, OpenCloseCoreStressTest, OverseerTest, TestReplicationHandler, ZkSolrClientTest, TestZkChroot, AutoCommitTest, TestDistributedGrouping, TestFaceting, TestRecovery, TestHashPartitioner, DistributedSpellCheckComponentTest, ZkControllerTest, TestRealTimeGet, HardAutoCommitTest, DistributedTermsComponentTest, TestSolr4Spatial, SpellCheckComponentTest, SolrCmdDistributorTest, TestSort, TestLazyCores, DirectUpdateHandlerTest, TestIndexSearcher, DistributedQueryElevationComponentTest, CurrencyFieldXmlFileTest, AnalysisAfterCoreReloadTest, TestExtendedDismaxParser, SpellCheckCollatorTest, SuggesterFSTTest, SolrRequestParserTest, TestFoldingMultitermQuery, SuggesterTSTTest, TestStressLucene, PolyFieldTest, SchemaVersionSpecificBehaviorTest, TestAtomicUpdateErrorCases, DefaultValueUpdateProcessorTest, TestRemoteStreaming, DebugComponentTest, IndexBasedSpellCheckerTest, TestQueryUtils, TestWriterPerf, TestReversedWildcardFilterFactory, PrimitiveFieldTypeTest, FileBasedSpellCheckerTest, TestValueSourceCache, TestIndexingPerformance, TestArbitraryIndexDir, IndexSchemaTest, MBeansHandlerTest, TestAnalyzedSuggestions, PingRequestHandlerTest, CSVRequestHandlerTest, CopyFieldTest, BadComponentTest, TestSolrDeletionPolicy2, SampleTest, TestDocSet, TestBinaryField, NumericFieldsTest, MinimalSchemaTest, TestElisionMultitermQuery, OutputWriterTest, TestFuzzyAnalyzedSuggestions, TestSolrCoreProperties, TestPostingsSolrHighlighter, DirectSolrConnectionTest, NotRequiredUniqueKeyTest, TestLuceneMatchVersion, TestPhraseSuggestions, TestDFRSimilarityFactory, TestLMDirichletSimilarityFactory, TestDefaultSimilarityFactory, TestFastWriter, ResourceLoaderTest, OpenExchangeRatesOrgProviderTest, DateMathParserTest, ChaosMonkeyNothingIsSafeTest]
   [junit4] Completed [362/482] on J2 in 42.41s, 1 test, 1 failure <<< FAILURES!

[...truncated 385 lines...]
BUILD FAILED
/home/jenkins/workspace/Lucene-Solr-5.x-Linux/build.xml:536: The following error occurred while executing this line:
/home/jenkins/workspace/Lucene-Solr-5.x-Linux/build.xml:484: The following error occurred while executing this line:
/home/jenkins/workspace/Lucene-Solr-5.x-Linux/build.xml:61: The following error occurred while executing this line:
/home/jenkins/workspace/Lucene-Solr-5.x-Linux/extra-targets.xml:39: The following error occurred while executing this line:
/home/jenkins/workspace/Lucene-Solr-5.x-Linux/solr/build.xml:229: The following error occurred while executing this line:
/home/jenkins/workspace/Lucene-Solr-5.x-Linux/solr/common-build.xml:511: The following error occurred while executing this line:
/home/jenkins/workspace/Lucene-Solr-5.x-Linux/lucene/common-build.xml:1434: The following error occurred while executing this line:
/home/jenkins/workspace/Lucene-Solr-5.x-Linux/lucene/common-build.xml:991: There were test failures: 482 suites, 1915 tests, 1 failure, 50 ignored (22 assumptions)

Total time: 60 minutes 53 seconds
Build step 'Invoke Ant' marked build as failure
[description-setter] Description set: Java: 32bit/jdk1.7.0_80-ea-b05 -client -XX:+UseConcMarkSweepGC
Archiving artifacts
Recording test results
Email was triggered for: Failure - Any
Sending email for trigger: Failure - Any



Re: [JENKINS] Lucene-Solr-5.x-Linux (32bit/jdk1.7.0_80-ea-b05) - Build # 12143 - Still Failing!

Posted by Adrien Grand <jp...@gmail.com>.
I committed a fix.

On Wed, Apr 15, 2015 at 2:27 PM, Policeman Jenkins Server
<je...@thetaphi.de> wrote:
> Build: http://jenkins.thetaphi.de/job/Lucene-Solr-5.x-Linux/12143/
> Java: 32bit/jdk1.7.0_80-ea-b05 -client -XX:+UseConcMarkSweepGC
>
> All tests passed
>
> Build Log:
> [...truncated 53430 lines...]
> BUILD FAILED
> /home/jenkins/workspace/Lucene-Solr-5.x-Linux/build.xml:536: The following error occurred while executing this line:
> /home/jenkins/workspace/Lucene-Solr-5.x-Linux/build.xml:443: The following error occurred while executing this line:
> /home/jenkins/workspace/Lucene-Solr-5.x-Linux/extra-targets.xml:105: The following error occurred while executing this line:
> /home/jenkins/workspace/Lucene-Solr-5.x-Linux/extra-targets.xml:204: The following files are missing svn:eol-style (or binary svn:mime-type):
> * ./solr/core/src/java/org/apache/solr/response/WriteableValue.java
> * ./solr/core/src/java/org/apache/solr/response/transform/RawValueTransformerFactory.java
>
> Total time: 68 minutes 24 seconds
> Build step 'Invoke Ant' marked build as failure
> [description-setter] Description set: Java: 32bit/jdk1.7.0_80-ea-b05 -client -XX:+UseConcMarkSweepGC
> Archiving artifacts
> Recording test results
> Email was triggered for: Failure - Any
> Sending email for trigger: Failure - Any
>
>
>
>
> ---------------------------------------------------------------------
> To unsubscribe, e-mail: dev-unsubscribe@lucene.apache.org
> For additional commands, e-mail: dev-help@lucene.apache.org



-- 
Adrien

---------------------------------------------------------------------
To unsubscribe, e-mail: dev-unsubscribe@lucene.apache.org
For additional commands, e-mail: dev-help@lucene.apache.org


[JENKINS] Lucene-Solr-5.x-Linux (32bit/jdk1.7.0_80-ea-b05) - Build # 12143 - Still Failing!

Posted by Policeman Jenkins Server <je...@thetaphi.de>.
Build: http://jenkins.thetaphi.de/job/Lucene-Solr-5.x-Linux/12143/
Java: 32bit/jdk1.7.0_80-ea-b05 -client -XX:+UseConcMarkSweepGC

All tests passed

Build Log:
[...truncated 53430 lines...]
BUILD FAILED
/home/jenkins/workspace/Lucene-Solr-5.x-Linux/build.xml:536: The following error occurred while executing this line:
/home/jenkins/workspace/Lucene-Solr-5.x-Linux/build.xml:443: The following error occurred while executing this line:
/home/jenkins/workspace/Lucene-Solr-5.x-Linux/extra-targets.xml:105: The following error occurred while executing this line:
/home/jenkins/workspace/Lucene-Solr-5.x-Linux/extra-targets.xml:204: The following files are missing svn:eol-style (or binary svn:mime-type):
* ./solr/core/src/java/org/apache/solr/response/WriteableValue.java
* ./solr/core/src/java/org/apache/solr/response/transform/RawValueTransformerFactory.java

Total time: 68 minutes 24 seconds
Build step 'Invoke Ant' marked build as failure
[description-setter] Description set: Java: 32bit/jdk1.7.0_80-ea-b05 -client -XX:+UseConcMarkSweepGC
Archiving artifacts
Recording test results
Email was triggered for: Failure - Any
Sending email for trigger: Failure - Any



[JENKINS] Lucene-Solr-5.x-Linux (64bit/jdk1.9.0-ea-b54) - Build # 12142 - Still Failing!

Posted by Policeman Jenkins Server <je...@thetaphi.de>.
Build: http://jenkins.thetaphi.de/job/Lucene-Solr-5.x-Linux/12142/
Java: 64bit/jdk1.9.0-ea-b54 -XX:-UseCompressedOops -XX:+UseConcMarkSweepGC

All tests passed

Build Log:
[...truncated 1822 lines...]
   [junit4] JVM J0: stdout was not empty, see: /home/jenkins/workspace/Lucene-Solr-5.x-Linux/lucene/build/core/test/temp/junit4-J0-20150415_094157_968.sysout
   [junit4] >>> JVM J0: stdout (verbatim) ----
   [junit4] Default case invoked for: 
   [junit4]    opcode  = 0, "Node"
   [junit4] Default case invoked for: 
   [junit4]    opcode  = 0, "Node"
   [junit4] Default case invoked for: 
   [junit4]    opcode  = 201, "Phi"
   [junit4] <<< JVM J0: EOF ----

[...truncated 49479 lines...]
BUILD FAILED
/home/jenkins/workspace/Lucene-Solr-5.x-Linux/build.xml:536: The following error occurred while executing this line:
/home/jenkins/workspace/Lucene-Solr-5.x-Linux/build.xml:443: The following error occurred while executing this line:
/home/jenkins/workspace/Lucene-Solr-5.x-Linux/extra-targets.xml:105: The following error occurred while executing this line:
/home/jenkins/workspace/Lucene-Solr-5.x-Linux/extra-targets.xml:204: The following files are missing svn:eol-style (or binary svn:mime-type):
* ./solr/core/src/java/org/apache/solr/response/WriteableValue.java
* ./solr/core/src/java/org/apache/solr/response/transform/RawValueTransformerFactory.java

Total time: 54 minutes 43 seconds
Build step 'Invoke Ant' marked build as failure
[description-setter] Description set: Java: 64bit/jdk1.9.0-ea-b54 -XX:-UseCompressedOops -XX:+UseConcMarkSweepGC
Archiving artifacts
Recording test results
Email was triggered for: Failure - Any
Sending email for trigger: Failure - Any



[JENKINS] Lucene-Solr-5.x-Linux (64bit/jdk1.8.0_60-ea-b06) - Build # 12141 - Still Failing!

Posted by Policeman Jenkins Server <je...@thetaphi.de>.
Build: http://jenkins.thetaphi.de/job/Lucene-Solr-5.x-Linux/12141/
Java: 64bit/jdk1.8.0_60-ea-b06 -XX:-UseCompressedOops -XX:+UseG1GC

All tests passed

Build Log:
[...truncated 60250 lines...]
BUILD FAILED
/home/jenkins/workspace/Lucene-Solr-5.x-Linux/build.xml:536: The following error occurred while executing this line:
/home/jenkins/workspace/Lucene-Solr-5.x-Linux/build.xml:443: The following error occurred while executing this line:
/home/jenkins/workspace/Lucene-Solr-5.x-Linux/extra-targets.xml:105: The following error occurred while executing this line:
/home/jenkins/workspace/Lucene-Solr-5.x-Linux/extra-targets.xml:204: The following files are missing svn:eol-style (or binary svn:mime-type):
* ./solr/core/src/java/org/apache/solr/response/WriteableValue.java
* ./solr/core/src/java/org/apache/solr/response/transform/RawValueTransformerFactory.java

Total time: 56 minutes 48 seconds
Build step 'Invoke Ant' marked build as failure
[description-setter] Description set: Java: 64bit/jdk1.8.0_60-ea-b06 -XX:-UseCompressedOops -XX:+UseG1GC
Archiving artifacts
Recording test results
Email was triggered for: Failure - Any
Sending email for trigger: Failure - Any