You are viewing a plain text version of this content. The canonical link for it is here.
Posted to builds@beam.apache.org by Apache Jenkins Server <je...@builds.apache.org> on 2019/03/15 09:05:09 UTC
Build failed in Jenkins: beam_Release_NightlySnapshot #364
See <https://builds.apache.org/job/beam_Release_NightlySnapshot/364/display/redirect?page=changes>
Changes:
[kcweaver] [BEAM-6327] move pipeline trimming logic from Flink runner to core
[lukasz.gajowy] [BEAM-6823] Change "triggerOnCommit" flag to "false" for CronJobs
[robertwb] Merge pull request #7936 Add matchers for python MetricResults, labels
[github] Revert "[BEAM-6527] Use Gradle to parallel Python tox tests"
------------------------------------------
[...truncated 4.27 MB...]
> Task :beam-vendor-grpc-1_13_1:build
> Task :beam-vendor-guava-20_0:compileJava NO-SOURCE
> Task :beam-vendor-guava-20_0:processResources NO-SOURCE
> Task :beam-vendor-guava-20_0:classes UP-TO-DATE
> Task :beam-vendor-guava-20_0:jar SKIPPED
> Task :beam-vendor-guava-20_0:shadowJar
> Task :beam-vendor-guava-20_0:assemble
> Task :beam-vendor-guava-20_0:compileTestJava NO-SOURCE
> Task :beam-vendor-guava-20_0:processTestResources NO-SOURCE
> Task :beam-vendor-guava-20_0:testClasses UP-TO-DATE
> Task :beam-vendor-guava-20_0:test NO-SOURCE
> Task :beam-vendor-guava-20_0:validateVendoring
> Task :beam-vendor-guava-20_0:check
> Task :beam-vendor-guava-20_0:build
> Task :beam-vendor-sdks-java-extensions-protobuf:jar
> Task :beam-vendor-sdks-java-extensions-protobuf:compileTestJava NO-SOURCE
> Task :beam-vendor-sdks-java-extensions-protobuf:processTestResources NO-SOURCE
> Task :beam-vendor-sdks-java-extensions-protobuf:testClasses UP-TO-DATE
> Task :beam-vendor-sdks-java-extensions-protobuf:packageTests
> Task :beam-vendor-sdks-java-extensions-protobuf:assemble
> Task :beam-vendor-sdks-java-extensions-protobuf:analyzeClassesDependencies SKIPPED
> Task :beam-vendor-sdks-java-extensions-protobuf:analyzeTestClassesDependencies SKIPPED
> Task :beam-vendor-sdks-java-extensions-protobuf:analyzeDependencies SKIPPED
> Task :beam-vendor-sdks-java-extensions-protobuf:checkstyleMain NO-SOURCE
> Task :beam-vendor-sdks-java-extensions-protobuf:checkstyleTest NO-SOURCE
> Task :beam-vendor-sdks-java-extensions-protobuf:javadoc NO-SOURCE
> Task :beam-vendor-sdks-java-extensions-protobuf:spotlessJava
> Task :beam-vendor-sdks-java-extensions-protobuf:spotlessJavaCheck
> Task :beam-vendor-sdks-java-extensions-protobuf:spotlessCheck
> Task :beam-vendor-sdks-java-extensions-protobuf:test NO-SOURCE
> Task :beam-vendor-sdks-java-extensions-protobuf:validateShadedJarDoesntLeakNonProjectClasses
> Task :beam-website:assemble UP-TO-DATE
> Task :beam-website:setupBuildDir
> Task :beam-website:buildDockerImage
Sending build context to Docker daemon 26.44MB
Step 1/7 : FROM ruby:2.5
2.5: Pulling from library/ruby
22dbe790f715: Already exists
0250231711a0: Already exists
6fba9447437b: Already exists
c2b4d327b352: Already exists
270e1baa5299: Already exists
01cbe6152974: Pulling fs layer
bcbdbe002cb6: Pulling fs layer
0f8aa6b13bf2: Pulling fs layer
01cbe6152974: Download complete
0f8aa6b13bf2: Verifying Checksum
0f8aa6b13bf2: Download complete
01cbe6152974: Pull complete
bcbdbe002cb6: Verifying Checksum
bcbdbe002cb6: Download complete
bcbdbe002cb6: Pull complete
0f8aa6b13bf2: Pull complete
Digest: sha256:1788df20b6c061b1ef6fa9dff139bdb038d32fae57af37c7ebb97679cd871353
Status: Downloaded newer image for ruby:2.5
---> 5814c443b95e
Step 2/7 : WORKDIR /ruby
---> 28bcd2bcb3b1
Removing intermediate container c1e8548eafe5
Step 3/7 : RUN gem install bundler
---> Running in 2c306d677d9a
Successfully installed bundler-2.0.1
1 gem installed
---> 2e7c364b5198
Removing intermediate container 2c306d677d9a
Step 4/7 : ADD Gemfile Gemfile.lock /ruby/
---> 8606f3139601
Removing intermediate container 1feda9a2e314
Step 5/7 : RUN bundle install --deployment --path $GEM_HOME
---> Running in 20420d76b444
Fetching gem metadata from https://rubygems.org/.........
Fetching rake 12.3.0
Installing rake 12.3.0
Fetching concurrent-ruby 1.1.4
Installing concurrent-ruby 1.1.4
Fetching i18n 0.9.5
Installing i18n 0.9.5
Fetching minitest 5.11.3
Installing minitest 5.11.3
Fetching thread_safe 0.3.6
Installing thread_safe 0.3.6
Fetching tzinfo 1.2.5
Installing tzinfo 1.2.5
Fetching activesupport 4.2.11
Installing activesupport 4.2.11
Fetching public_suffix 3.0.3
Installing public_suffix 3.0.3
Fetching addressable 2.5.2
Installing addressable 2.5.2
Using bundler 1.17.3
Fetching colorator 1.1.0
Installing colorator 1.1.0
Fetching colorize 0.8.1
Installing colorize 0.8.1
Fetching ffi 1.9.25
Installing ffi 1.9.25 with native extensions
Fetching ethon 0.11.0
Installing ethon 0.11.0
Fetching forwardable-extended 2.6.0
Installing forwardable-extended 2.6.0
Fetching mercenary 0.3.6
Installing mercenary 0.3.6
Fetching mini_portile2 2.3.0
Installing mini_portile2 2.3.0
Fetching nokogiri 1.8.5
Installing nokogiri 1.8.5 with native extensions
> Task :beam-vendor-sdks-java-extensions-protobuf:spotbugsMain
> Task :beam-website:buildDockerImage
Fetching parallel 1.12.1
Installing parallel 1.12.1
Fetching typhoeus 1.3.1
Installing typhoeus 1.3.1
Fetching yell 2.0.7
Installing yell 2.0.7
Fetching html-proofer 3.9.3
Installing html-proofer 3.9.3
Fetching rb-fsevent 0.10.2
Installing rb-fsevent 0.10.2
Fetching rb-inotify 0.9.10
Installing rb-inotify 0.9.10
Fetching sass-listen 4.0.0
Installing sass-listen 4.0.0
Fetching sass 3.5.5
Installing sass 3.5.5
Fetching jekyll-sass-converter 1.5.2
Installing jekyll-sass-converter 1.5.2
Fetching ruby_dep 1.5.0
Installing ruby_dep 1.5.0
Fetching listen 3.1.5
Installing listen 3.1.5
Fetching jekyll-watch 1.5.1
Installing jekyll-watch 1.5.1
Fetching kramdown 1.16.2
Installing kramdown 1.16.2
Fetching liquid 3.0.6
Installing liquid 3.0.6
Fetching pathutil 0.16.1
Installing pathutil 0.16.1
Fetching rouge 1.11.1
Installing rouge 1.11.1
Fetching safe_yaml 1.0.4
Installing safe_yaml 1.0.4
Fetching jekyll 3.2.0
Installing jekyll 3.2.0
Fetching jekyll-redirect-from 0.11.0
Installing jekyll-redirect-from 0.11.0
Fetching jekyll_github_sample 0.3.1
Installing jekyll_github_sample 0.3.1
Bundle complete! 7 Gemfile dependencies, 38 gems now installed.
Bundled gems are installed into `/usr/local/bundle`
---> 115f4edd2e86
Removing intermediate container 20420d76b444
Step 6/7 : ENV LC_ALL C.UTF-8
---> Running in 241a87c256b9
---> a2fcc75c4ba1
Removing intermediate container 241a87c256b9
Step 7/7 : CMD sleep 3600
---> Running in d20e6aefcf84
---> c96cff82ed90
Removing intermediate container d20e6aefcf84
Successfully built c96cff82ed90
Successfully tagged beam-website:latest
> Task :beam-website:createDockerContainer
> Task :beam-website:startDockerContainer
871e27cf69cf02064925085fcbcd1d0aa890bb6d7f611509e287bf7f884d4747
> Task :beam-website:buildLocalWebsite
`/` is not writable.
Bundler will use `/tmp/bundler/home/unknown' as your home directory temporarily.
Configuration file: /repo/website/_config.yml
Configuration file: /repo/website/_config_test.yml
Source: /repo/website/src
Destination: generated-local-content
Incremental build: enabled
Generating...
done in 13.632 seconds.
Auto-regeneration: disabled. Use --watch to enable.
> Task :beam-website:testWebsite
`/` is not writable.
Bundler will use `/tmp/bundler/home/unknown' as your home directory temporarily.
Running ["HtmlCheck", "LinkCheck", "ImageCheck", "ScriptCheck"] on ["./generated-local-content"] on *.html...
Checking 891 external links...
Ran on 191 files!
HTML-Proofer finished successfully.
> Task :beam-website:stopAndRemoveDockerContainer
871e27cf69cf02064925085fcbcd1d0aa890bb6d7f611509e287bf7f884d4747
> Task :beam-website:buildWebsite
> Task :beam-website:check
> Task :beam-website:build
> Task :release:compileJava NO-SOURCE
> Task :release:compileGroovy FROM-CACHE
> Task :release:processResources NO-SOURCE
> Task :release:classes UP-TO-DATE
> Task :release:jar
> Task :release:assemble
> Task :release:compileTestJava NO-SOURCE
> Task :release:compileTestGroovy NO-SOURCE
> Task :release:processTestResources NO-SOURCE
> Task :release:testClasses UP-TO-DATE
> Task :release:test NO-SOURCE
> Task :release:check UP-TO-DATE
> Task :release:build
> Task :beam-sdks-java-load-tests:check
> Task :beam-sdks-java-load-tests:build
> Task :beam-vendor-sdks-java-extensions-protobuf:check
> Task :beam-vendor-sdks-java-extensions-protobuf:build
> Task :beam-sdks-java-test-utils:check
> Task :beam-sdks-java-test-utils:build
> Task :beam-sdks-java-io-synthetic:check
> Task :beam-sdks-java-io-synthetic:build
FAILURE: Build failed with an exception.
* Where:
Build file '<https://builds.apache.org/job/beam_Release_NightlySnapshot/ws/src/sdks/python/build.gradle'> line: 60
* What went wrong:
Execution failed for task ':beam-sdks-python:testPython36'.
> Process 'command 'sh'' finished with non-zero exit value 1
* Try:
Run with --stacktrace option to get the stack trace. Run with --info or --debug option to get more log output. Run with --scan to get full insights.
* Get more help at https://help.gradle.org
Deprecated Gradle features were used in this build, making it incompatible with Gradle 6.0.
Use '--warning-mode all' to show the individual deprecation warnings.
See https://docs.gradle.org/5.2.1/userguide/command_line_interface.html#sec:command_line_warnings
BUILD FAILED in 2h 0m 59s
1060 actionable tasks: 925 executed, 135 from cache
Publishing build scan...
https://gradle.com/s/7ibczddzv4mtg
Build step 'Invoke Gradle script' changed build result to FAILURE
Build step 'Invoke Gradle script' marked build as failure
---------------------------------------------------------------------
To unsubscribe, e-mail: builds-unsubscribe@beam.apache.org
For additional commands, e-mail: builds-help@beam.apache.org
Build failed in Jenkins: beam_Release_NightlySnapshot #365
Posted by Apache Jenkins Server <je...@builds.apache.org>.
See <https://builds.apache.org/job/beam_Release_NightlySnapshot/365/display/redirect>
------------------------------------------
[...truncated 4.84 MB...]
Resolving cached github.com/VividCortex/gohistogram: commit='LATEST_COMMIT', urls=[https://github.com/VividCortex/gohistogram.git, git@github.com:VividCortex/gohistogram.git]
Resolving cached github.com/afex/hystrix-go: commit='LATEST_COMMIT', urls=[https://github.com/afex/hystrix-go.git, git@github.com:afex/hystrix-go.git]
Resolving cached github.com/aws/aws-sdk-go: commit='LATEST_COMMIT', urls=[https://github.com/aws/aws-sdk-go.git, git@github.com:aws/aws-sdk-go.git]
Resolving cached github.com/aws/aws-sdk-go-v2: commit='LATEST_COMMIT', urls=[https://github.com/aws/aws-sdk-go-v2.git, git@github.com:aws/aws-sdk-go-v2.git]
Resolving cached github.com/casbin/casbin: commit='LATEST_COMMIT', urls=[https://github.com/casbin/casbin.git, git@github.com:casbin/casbin.git]
Resolving cached github.com/davecgh/go-spew: commit='LATEST_COMMIT', urls=[https://github.com/davecgh/go-spew.git, git@github.com:davecgh/go-spew.git]
Resolving cached github.com/dgrijalva/jwt-go: commit='LATEST_COMMIT', urls=[https://github.com/dgrijalva/jwt-go.git, git@github.com:dgrijalva/jwt-go.git]
Resolving cached github.com/go-logfmt/logfmt: commit='LATEST_COMMIT', urls=[https://github.com/go-logfmt/logfmt.git, git@github.com:go-logfmt/logfmt.git]
Resolving cached github.com/golang/protobuf: commit='LATEST_COMMIT', urls=[https://github.com/golang/protobuf.git, git@github.com:golang/protobuf.git]
Resolving cached github.com/gorilla/mux: commit='LATEST_COMMIT', urls=[https://github.com/gorilla/mux.git, git@github.com:gorilla/mux.git]
Resolving cached github.com/hashicorp/consul: commit='LATEST_COMMIT', urls=[https://github.com/hashicorp/consul.git, git@github.com:hashicorp/consul.git]
Resolving cached github.com/hudl/fargo: commit='LATEST_COMMIT', urls=[https://github.com/hudl/fargo.git, git@github.com:hudl/fargo.git]
Resolving cached github.com/influxdata/influxdb1-client: commit='LATEST_COMMIT', urls=[https://github.com/influxdata/influxdb1-client.git, git@github.com:influxdata/influxdb1-client.git]
Resolving cached github.com/lightstep/lightstep-tracer-go: commit='LATEST_COMMIT', urls=[https://github.com/lightstep/lightstep-tracer-go.git, git@github.com:lightstep/lightstep-tracer-go.git]
Resolving cached github.com/nats-io/go-nats: commit='LATEST_COMMIT', urls=[https://github.com/nats-io/go-nats.git, git@github.com:nats-io/go-nats.git]
Resolving cached github.com/oklog/oklog: commit='LATEST_COMMIT', urls=[https://github.com/oklog/oklog.git, git@github.com:oklog/oklog.git]
Resolving cached github.com/opentracing/opentracing-go: commit='LATEST_COMMIT', urls=[https://github.com/opentracing/opentracing-go.git, git@github.com:opentracing/opentracing-go.git]
Resolving cached github.com/openzipkin-contrib/zipkin-go-opentracing: commit='LATEST_COMMIT', urls=[https://github.com/openzipkin-contrib/zipkin-go-opentracing.git, git@github.com:openzipkin-contrib/zipkin-go-opentracing.git]
Resolving cached github.com/openzipkin/zipkin-go: commit='LATEST_COMMIT', urls=[https://github.com/openzipkin/zipkin-go.git, git@github.com:openzipkin/zipkin-go.git]
Resolving cached github.com/pborman/uuid: commit='LATEST_COMMIT', urls=[https://github.com/pborman/uuid.git, git@github.com:pborman/uuid.git]
Resolving cached github.com/performancecopilot/speed: commit='LATEST_COMMIT', urls=[https://github.com/performancecopilot/speed.git, git@github.com:performancecopilot/speed.git]
Resolving cached github.com/pkg/errors: commit='LATEST_COMMIT', urls=[https://github.com/pkg/errors.git, git@github.com:pkg/errors.git]
Resolving cached github.com/prometheus/client_golang: commit='LATEST_COMMIT', urls=[https://github.com/prometheus/client_golang.git, git@github.com:prometheus/client_golang.git]
Resolving cached github.com/samuel/go-zookeeper: commit='LATEST_COMMIT', urls=[https://github.com/samuel/go-zookeeper.git, git@github.com:samuel/go-zookeeper.git]
Resolving cached github.com/sirupsen/logrus: commit='LATEST_COMMIT', urls=[https://github.com/sirupsen/logrus.git, git@github.com:sirupsen/logrus.git]
Resolving cached github.com/sony/gobreaker: commit='LATEST_COMMIT', urls=[https://github.com/sony/gobreaker.git, git@github.com:sony/gobreaker.git]
Resolving cached github.com/streadway/amqp: commit='LATEST_COMMIT', urls=[https://github.com/streadway/amqp.git, git@github.com:streadway/amqp.git]
Resolving cached github.com/streadway/handy: commit='LATEST_COMMIT', urls=[https://github.com/streadway/handy.git, git@github.com:streadway/handy.git]
Resolving cached go.etcd.io/etcd: commit='LATEST_COMMIT', urls=[https://github.com/etcd-io/etcd]
Resolving cached go.opencensus.io: commit='LATEST_COMMIT', urls=[https://github.com/census-instrumentation/opencensus-go]
Resolving cached golang.org/x/sync: commit='LATEST_COMMIT', urls=[https://go.googlesource.com/sync]
Resolving cached golang.org/x/time: commit='LATEST_COMMIT', urls=[https://go.googlesource.com/time]
Resolving cached golang.org/x/tools: commit='LATEST_COMMIT', urls=[https://go.googlesource.com/tools]
Resolving cached google.golang.org/grpc: commit='LATEST_COMMIT', urls=[https://github.com/grpc/grpc-go]
Resolving cached sourcegraph.com/sourcegraph/appdash: commit='LATEST_COMMIT', urls=[https://github.com/sourcegraph/appdash]
Resolving cached github.com/golang/protobuf: commit='LATEST_COMMIT', urls=[https://github.com/golang/protobuf.git, git@github.com:golang/protobuf.git]
Resolving cached github.com/prometheus/client_golang: commit='LATEST_COMMIT', urls=[https://github.com/prometheus/client_golang.git, git@github.com:prometheus/client_golang.git]
Resolving cached golang.org/x/net: commit='LATEST_COMMIT', urls=[https://go.googlesource.com/net]
Resolving cached github.com/cespare/xxhash: commit='LATEST_COMMIT', urls=[https://github.com/cespare/xxhash.git, git@github.com:cespare/xxhash.git]
Resolving cached github.com/go-kit/kit: commit='LATEST_COMMIT', urls=[https://github.com/go-kit/kit.git, git@github.com:go-kit/kit.git]
Resolving cached github.com/oklog/ulid: commit='LATEST_COMMIT', urls=[https://github.com/oklog/ulid.git, git@github.com:oklog/ulid.git]
Resolving cached github.com/pkg/errors: commit='LATEST_COMMIT', urls=[https://github.com/pkg/errors.git, git@github.com:pkg/errors.git]
Resolving cached github.com/prometheus/client_golang: commit='LATEST_COMMIT', urls=[https://github.com/prometheus/client_golang.git, git@github.com:prometheus/client_golang.git]
Resolving cached golang.org/x/sync: commit='LATEST_COMMIT', urls=[https://go.googlesource.com/sync]
Resolving cached golang.org/x/sys: commit='LATEST_COMMIT', urls=[https://go.googlesource.com/sys]
Resolving cached gopkg.in/alecthomas/kingpin.v2: commit='LATEST_COMMIT', urls=[https://gopkg.in/alecthomas/kingpin.v2]
Resolving github.com/codegangsta/inject: commit='33e0aa1cb7c019ccc3fbe049a8262a6403d30504', urls=[https://github.com/codegangsta/inject.git, git@github.com:codegangsta/inject.git]
Resolving cached github.com/go-martini/martini: commit='LATEST_COMMIT', urls=[https://github.com/go-martini/martini.git, git@github.com:go-martini/martini.git]
Resolving github.com/oxtoacart/bpool: commit='LATEST_COMMIT', urls=[https://github.com/oxtoacart/bpool.git, git@github.com:oxtoacart/bpool.git]
Resolving github.com/goji/param: commit='LATEST_COMMIT', urls=[https://github.com/goji/param.git, git@github.com:goji/param.git]
Resolving cached github.com/golang/snappy: commit='LATEST_COMMIT', urls=[https://github.com/golang/snappy.git, git@github.com:golang/snappy.git]
Resolving cached github.com/pkg/profile: commit='LATEST_COMMIT', urls=[https://github.com/pkg/profile.git, git@github.com:pkg/profile.git]
Resolving cached github.com/xdg/stringprep: commit='LATEST_COMMIT', urls=[https://github.com/xdg/stringprep.git, git@github.com:xdg/stringprep.git]
Resolving cached golang.org/x/crypto: commit='LATEST_COMMIT', urls=[https://go.googlesource.com/crypto]
Resolving cached golang.org/x/text: commit='LATEST_COMMIT', urls=[https://go.googlesource.com/text]
> Task :beam-test-tools:resolveTestDependencies
> Task :beam-test-tools:installDependencies
> Task :beam-test-tools:buildLinuxAmd64
> Task :beam-test-tools:goBuild
> Task :beam-test-tools:assemble
> Task :beam-test-tools:goVendor
> Task :beam-test-tools:goTest
Test for github.com/apache/beam/testing/tools finished, 3 completed, 0 failed.
> Task :beam-test-tools:goCover
> Task :beam-test-tools:goVet
> Task :beam-test-tools:gofmt
> Task :beam-test-tools:goCheck
> Task :beam-test-tools:check
> Task :beam-test-tools:build
> Task :beam-vendor-grpc-1_13_1:compileJava NO-SOURCE
> Task :beam-vendor-grpc-1_13_1:processResources NO-SOURCE
> Task :beam-vendor-grpc-1_13_1:classes UP-TO-DATE
> Task :beam-vendor-grpc-1_13_1:jar SKIPPED
> Task :beam-vendor-grpc-1_13_1:shadowJar
> Task :beam-vendor-grpc-1_13_1:assemble
> Task :beam-vendor-grpc-1_13_1:compileTestJava NO-SOURCE
> Task :beam-vendor-grpc-1_13_1:processTestResources NO-SOURCE
> Task :beam-vendor-grpc-1_13_1:testClasses UP-TO-DATE
> Task :beam-vendor-grpc-1_13_1:test NO-SOURCE
> Task :beam-vendor-grpc-1_13_1:validateVendoring
> Task :beam-vendor-grpc-1_13_1:check
> Task :beam-vendor-grpc-1_13_1:build
> Task :beam-vendor-guava-20_0:compileJava NO-SOURCE
> Task :beam-vendor-guava-20_0:processResources NO-SOURCE
> Task :beam-vendor-guava-20_0:classes UP-TO-DATE
> Task :beam-vendor-guava-20_0:jar SKIPPED
> Task :beam-vendor-guava-20_0:shadowJar
> Task :beam-vendor-guava-20_0:assemble
> Task :beam-vendor-guava-20_0:compileTestJava NO-SOURCE
> Task :beam-vendor-guava-20_0:processTestResources NO-SOURCE
> Task :beam-vendor-guava-20_0:testClasses UP-TO-DATE
> Task :beam-vendor-guava-20_0:test NO-SOURCE
> Task :beam-vendor-guava-20_0:validateVendoring
> Task :beam-vendor-guava-20_0:check
> Task :beam-vendor-guava-20_0:build
> Task :beam-vendor-sdks-java-extensions-protobuf:jar
> Task :beam-vendor-sdks-java-extensions-protobuf:compileTestJava NO-SOURCE
> Task :beam-vendor-sdks-java-extensions-protobuf:processTestResources NO-SOURCE
> Task :beam-vendor-sdks-java-extensions-protobuf:testClasses UP-TO-DATE
> Task :beam-vendor-sdks-java-extensions-protobuf:packageTests
> Task :beam-vendor-sdks-java-extensions-protobuf:assemble
> Task :beam-vendor-sdks-java-extensions-protobuf:analyzeClassesDependencies SKIPPED
> Task :beam-vendor-sdks-java-extensions-protobuf:analyzeTestClassesDependencies SKIPPED
> Task :beam-vendor-sdks-java-extensions-protobuf:analyzeDependencies SKIPPED
> Task :beam-vendor-sdks-java-extensions-protobuf:checkstyleMain NO-SOURCE
> Task :beam-vendor-sdks-java-extensions-protobuf:checkstyleTest NO-SOURCE
> Task :beam-vendor-sdks-java-extensions-protobuf:javadoc NO-SOURCE
> Task :beam-vendor-sdks-java-extensions-protobuf:spotlessJava
> Task :beam-vendor-sdks-java-extensions-protobuf:spotlessJavaCheck
> Task :beam-vendor-sdks-java-extensions-protobuf:spotlessCheck
> Task :beam-sdks-java-nexmark:check
> Task :beam-sdks-java-nexmark:build
> Task :beam-vendor-sdks-java-extensions-protobuf:test NO-SOURCE
> Task :beam-vendor-sdks-java-extensions-protobuf:validateShadedJarDoesntLeakNonProjectClasses
> Task :beam-website:assemble UP-TO-DATE
> Task :beam-website:setupBuildDir
> Task :beam-website:buildDockerImage
Sending build context to Docker daemon 26.44MB
Step 1/7 : FROM ruby:2.5
---> 5814c443b95e
Step 2/7 : WORKDIR /ruby
---> Using cache
---> 28bcd2bcb3b1
Step 3/7 : RUN gem install bundler
---> Using cache
---> 2e7c364b5198
Step 4/7 : ADD Gemfile Gemfile.lock /ruby/
---> Using cache
---> 8606f3139601
Step 5/7 : RUN bundle install --deployment --path $GEM_HOME
---> Using cache
---> 115f4edd2e86
Step 6/7 : ENV LC_ALL C.UTF-8
---> Using cache
---> a2fcc75c4ba1
Step 7/7 : CMD sleep 3600
---> Using cache
---> c96cff82ed90
Successfully built c96cff82ed90
Successfully tagged beam-website:latest
> Task :beam-website:createDockerContainer
> Task :beam-website:startDockerContainer
ad6e7d67b2907e76e4a4a154f4d6d163663a79ed07d49b6f746da2fc58f20b65
> Task :beam-website:buildLocalWebsite
`/` is not writable.
Bundler will use `/tmp/bundler/home/unknown' as your home directory temporarily.
Configuration file: /repo/website/_config.yml
Configuration file: /repo/website/_config_test.yml
Source: /repo/website/src
Destination: generated-local-content
Incremental build: enabled
Generating...
done in 13.109 seconds.
Auto-regeneration: disabled. Use --watch to enable.
> Task :beam-website:testWebsite
`/` is not writable.
Bundler will use `/tmp/bundler/home/unknown' as your home directory temporarily.
Running ["ScriptCheck", "ImageCheck", "HtmlCheck", "LinkCheck"] on ["./generated-local-content"] on *.html...
> Task :beam-vendor-sdks-java-extensions-protobuf:spotbugsMain
> Task :beam-website:testWebsite
Checking 891 external links...
Ran on 191 files!
- ./generated-local-content/documentation/sdks/python-pipeline-dependencies/index.html
* External link https://pythonhosted.org/an_example_pypi_project/setuptools.html failed: 504 No error
rake aborted!
HTML-Proofer found 1 failure!
/usr/local/bundle/ruby/2.5.0/gems/html-proofer-3.9.3/lib/html-proofer/runner.rb:167:in `print_failed_tests'
/usr/local/bundle/ruby/2.5.0/gems/html-proofer-3.9.3/lib/html-proofer/runner.rb:48:in `run'
/repo/build/website/Rakefile:23:in `block in <top (required)>'
/usr/local/bundle/ruby/2.5.0/gems/rake-12.3.0/exe/rake:27:in `<top (required)>'
/usr/local/bundle/bin/bundle:23:in `load'
/usr/local/bundle/bin/bundle:23:in `<main>'
Tasks: TOP => test
(See full trace by running task with --trace)
> Task :beam-website:testWebsite FAILED
> Task :beam-website:stopAndRemoveDockerContainer
ad6e7d67b2907e76e4a4a154f4d6d163663a79ed07d49b6f746da2fc58f20b65
> Task :beam-website:buildWebsite
> Task :release:compileJava NO-SOURCE
> Task :release:compileGroovy FROM-CACHE
> Task :release:processResources NO-SOURCE
> Task :release:classes UP-TO-DATE
> Task :release:jar
> Task :release:assemble
> Task :release:compileTestJava NO-SOURCE
> Task :release:compileTestGroovy NO-SOURCE
> Task :release:processTestResources NO-SOURCE
> Task :release:testClasses UP-TO-DATE
> Task :beam-vendor-sdks-java-extensions-protobuf:check
> Task :beam-vendor-sdks-java-extensions-protobuf:build
> Task :release:test NO-SOURCE
> Task :release:check UP-TO-DATE
> Task :release:build
> Task :beam-sdks-java-io-tika:check
> Task :beam-sdks-java-io-tika:build
FAILURE: Build completed with 2 failures.
1: Task failed with an exception.
-----------
* What went wrong:
Execution failed for task ':beam-sdks-python-test-suites-tox-py36:testPython36'.
> Process 'command 'sh'' finished with non-zero exit value 1
* Try:
Run with --stacktrace option to get the stack trace. Run with --info or --debug option to get more log output. Run with --scan to get full insights.
==============================================================================
2: Task failed with an exception.
-----------
* What went wrong:
Execution failed for task ':beam-website:testWebsite'.
> Process 'command 'docker'' finished with non-zero exit value 1
* Try:
Run with --stacktrace option to get the stack trace. Run with --info or --debug option to get more log output. Run with --scan to get full insights.
==============================================================================
* Get more help at https://help.gradle.org
Deprecated Gradle features were used in this build, making it incompatible with Gradle 6.0.
Use '--warning-mode all' to show the individual deprecation warnings.
See https://docs.gradle.org/5.2.1/userguide/command_line_interface.html#sec:command_line_warnings
BUILD FAILED in 2h 5m 59s
1064 actionable tasks: 1032 executed, 32 from cache
Publishing build scan...
https://gradle.com/s/h5qmm6nzqgzis
Build step 'Invoke Gradle script' changed build result to FAILURE
Build step 'Invoke Gradle script' marked build as failure
---------------------------------------------------------------------
To unsubscribe, e-mail: builds-unsubscribe@beam.apache.org
For additional commands, e-mail: builds-help@beam.apache.org