You are viewing a plain text version of this content. The canonical link for it is here.
Posted to commits@flex.apache.org by fl...@gmail.com on 2014/02/09 14:57:54 UTC

flex-sdk_mustella - Build # 708 - Still Failing!

flex-sdk_mustella - Build # 708 - Still Failing:

http://flex-mustella.cloudapp.net/job/flex-sdk_mustella/708/

Changes for Build #706

Changes for Build #707

Changes for Build #708


--------------------------------

Started by user flexpmc
[EnvInject] - Loading node environment variables.
Building remotely on WindowsSlave in workspace c:\jenkins_slave\workspace\flex-sdk_mustella
Fetching changes from the remote Git repository
Fetching upstream changes from https://git-wip-us.apache.org/repos/asf/flex-sdk.git
Checking out Revision 5d0b30c7935f2e4a21c85fe6e7d18f4fdd61b5aa (origin/develop)
FATAL: Could not checkout null with start point 5d0b30c7935f2e4a21c85fe6e7d18f4fdd61b5aa
hudson.plugins.git.GitException: Could not checkout null with start point 5d0b30c7935f2e4a21c85fe6e7d18f4fdd61b5aa
	at org.jenkinsci.plugins.gitclient.CliGitAPIImpl.checkoutBranch(CliGitAPIImpl.java:1274)
	at sun.reflect.NativeMethodAccessorImpl.invoke0(Native Method)
	at sun.reflect.NativeMethodAccessorImpl.invoke(NativeMethodAccessorImpl.java:39)
	at sun.reflect.DelegatingMethodAccessorImpl.invoke(DelegatingMethodAccessorImpl.java:25)
	at java.lang.reflect.Method.invoke(Method.java:597)
	at hudson.remoting.RemoteInvocationHandler$RPCRequest.perform(RemoteInvocationHandler.java:275)
	at hudson.remoting.RemoteInvocationHandler$RPCRequest.call(RemoteInvocationHandler.java:256)
	at hudson.remoting.RemoteInvocationHandler$RPCRequest.call(RemoteInvocationHandler.java:215)
	at hudson.remoting.UserRequest.perform(UserRequest.java:118)
	at hudson.remoting.UserRequest.perform(UserRequest.java:48)
	at hudson.remoting.Request$2.run(Request.java:326)
	at hudson.remoting.InterceptingExecutorService$1.call(InterceptingExecutorService.java:72)
	at java.util.concurrent.FutureTask$Sync.innerRun(FutureTask.java:303)
	at java.util.concurrent.FutureTask.run(FutureTask.java:138)
	at java.util.concurrent.ThreadPoolExecutor$Worker.runTask(ThreadPoolExecutor.java:885)
	at java.util.concurrent.ThreadPoolExecutor$Worker.run(ThreadPoolExecutor.java:907)
	at hudson.remoting.Engine$1$1.run(Engine.java:58)
	at java.lang.Thread.run(Thread.java:619)
Caused by: hudson.plugins.git.GitException: Command "git checkout -f 5d0b30c7935f2e4a21c85fe6e7d18f4fdd61b5aa" returned status code 1:
stdout: 
stderr: error: unable to create file mustella/jenkins.sh (Permission denied)
HEAD is now at 5d0b30c... Fixed 'typo' in version nr.

	at org.jenkinsci.plugins.gitclient.CliGitAPIImpl.launchCommandIn(CliGitAPIImpl.java:1148)
	at org.jenkinsci.plugins.gitclient.CliGitAPIImpl.launchCommandIn(CliGitAPIImpl.java:1125)
	at org.jenkinsci.plugins.gitclient.CliGitAPIImpl.launchCommandIn(CliGitAPIImpl.java:1121)
	at org.jenkinsci.plugins.gitclient.CliGitAPIImpl.launchCommand(CliGitAPIImpl.java:937)
	at org.jenkinsci.plugins.gitclient.CliGitAPIImpl.launchCommand(CliGitAPIImpl.java:947)
	at org.jenkinsci.plugins.gitclient.CliGitAPIImpl.checkout(CliGitAPIImpl.java:1248)
	at hudson.plugins.git.GitAPI.checkout(GitAPI.java:208)
	at org.jenkinsci.plugins.gitclient.CliGitAPIImpl.checkoutBranch(CliGitAPIImpl.java:1258)
	... 17 more


(sent from ext-email)

flex-sdk_mustella - Build # 710 - Fixed!

Posted by fl...@gmail.com.
flex-sdk_mustella - Build # 710 - Fixed:

http://flex-mustella.cloudapp.net/job/flex-sdk_mustella/710/

Changes for Build #706

Changes for Build #707

Changes for Build #708

Changes for Build #709

Changes for Build #710


--------------------------------

[...truncated 82890 lines...]
     [java] 	C:\ApacheFlex\dependencies\FlashPlayer_Debug\flashplayer11_7r700_232_win_sa_debug.exe
     [java] 	C:\jenkins_slave\workspace\flex-sdk_mustella\mustella\tests\gumbo\components\Application\SWFs\Application_Properties_App1.swf
     [java] ******** moreParameters before: 
     [java] ******** cmdArr after: 
     [java] 	C:\ApacheFlex\dependencies\FlashPlayer_Debug\flashplayer11_7r700_232_win_sa_debug.exe
     [java] 	C:\jenkins_slave\workspace\flex-sdk_mustella\mustella\tests\gumbo\components\Application\SWFs\Application_Properties_App1.swf
     [java] getting directory from the swf file
     [java] derived directory: C:\jenkins_slave\workspace\flex-sdk_mustella\mustella\tests\gumbo\components\Application\SWFs
     [java] Launching: 
     [java]  C:\ApacheFlex\dependencies\FlashPlayer_Debug\flashplayer11_7r700_232_win_sa_debug.exe C:\jenkins_slave\workspace\flex-sdk_mustella\mustella\tests\gumbo\components\Application\SWFs\Application_Properties_App1.swf Launching: C:\ApacheFlex\dependencies\FlashPlayer_Debug\flashplayer11_7r700_232_win_sa_debug.exe C:\jenkins_slave\workspace\flex-sdk_mustella\mustella\tests\gumbo\components\Application\SWFs\Application_Properties_App1.swf
     [java] USING directory: C:\jenkins_slave\workspace\flex-sdk_mustella\mustella\tests\gumbo\components\Application\SWFs
     [java] time: 18:53:57.403
     [java] SCRIPTDONE! 18:54:00.944
     [java] GET /ScriptComplete?0 HTTP/1.1
     [java] Before Wait loop 18:54:00.944 waiting = 0
     [java] After Wait loop 18:54:00.944 waiting = 0
     [java] clobberProcess false
     [java] Total Results so far: 5
     [java] waited 1900
     [java] ClobberProcess, it was already null
     [java] Grab log, do parse = false
     [java] Grabbing the log from: C:\Users\ApacheFlex\AppData/Roaming\Macromedia/Flash Player/Logs/flashlog.txt to: C:\jenkins_slave\workspace\flex-sdk_mustella\mustella\tests\gumbo\components\Application\SWFs\Application_Properties_App1.log
     [java] new test file: C:\jenkins_slave\workspace\flex-sdk_mustella\mustella\tests\gumbo\components\Image\swfs\ImageMain.swf
     [java] ******** cmdArr before: 
     [java] 	C:\ApacheFlex\dependencies\FlashPlayer_Debug\flashplayer11_7r700_232_win_sa_debug.exe
     [java] 	C:\jenkins_slave\workspace\flex-sdk_mustella\mustella\tests\gumbo\components\Image\swfs\ImageMain.swf
     [java] ******** moreParameters before: 
     [java] ******** cmdArr after: 
     [java] 	C:\ApacheFlex\dependencies\FlashPlayer_Debug\flashplayer11_7r700_232_win_sa_debug.exe
     [java] 	C:\jenkins_slave\workspace\flex-sdk_mustella\mustella\tests\gumbo\components\Image\swfs\ImageMain.swf
     [java] getting directory from the swf file
     [java] derived directory: C:\jenkins_slave\workspace\flex-sdk_mustella\mustella\tests\gumbo\components\Image\swfs
     [java] Launching: 
     [java]  C:\ApacheFlex\dependencies\FlashPlayer_Debug\flashplayer11_7r700_232_win_sa_debug.exe C:\jenkins_slave\workspace\flex-sdk_mustella\mustella\tests\gumbo\components\Image\swfs\ImageMain.swf Launching: C:\ApacheFlex\dependencies\FlashPlayer_Debug\flashplayer11_7r700_232_win_sa_debug.exe C:\jenkins_slave\workspace\flex-sdk_mustella\mustella\tests\gumbo\components\Image\swfs\ImageMain.swf
     [java] USING directory: C:\jenkins_slave\workspace\flex-sdk_mustella\mustella\tests\gumbo\components\Image\swfs
     [java] time: 18:54:03.198
     [java] SCRIPTDONE! 18:54:07.029
     [java] GET /ScriptComplete?0 HTTP/1.1
     [java] Before Wait loop 18:54:07.029 waiting = 0
     [java] After Wait loop 18:54:07.029 waiting = 0
     [java] clobberProcess false
     [java] Total Results so far: 6
     [java] Grab log, do parse = false
     [java] Grabbing the log from: C:\Users\ApacheFlex\AppData/Roaming\Macromedia/Flash Player/Logs/flashlog.txt to: C:\jenkins_slave\workspace\flex-sdk_mustella\mustella\tests\gumbo\components\Image\swfs\ImageMain.log
     [java] new test file: C:\jenkins_slave\workspace\flex-sdk_mustella\mustella\tests\itemRenderers\Halo\List\SWFs\List_itemEditorTests.swf
     [java] ******** cmdArr before: 
     [java] 	C:\ApacheFlex\dependencies\FlashPlayer_Debug\flashplayer11_7r700_232_win_sa_debug.exe
     [java] 	C:\jenkins_slave\workspace\flex-sdk_mustella\mustella\tests\itemRenderers\Halo\List\SWFs\List_itemEditorTests.swf
     [java] ******** moreParameters before: 
     [java] ******** cmdArr after: 
     [java] 	C:\ApacheFlex\dependencies\FlashPlayer_Debug\flashplayer11_7r700_232_win_sa_debug.exe
     [java] 	C:\jenkins_slave\workspace\flex-sdk_mustella\mustella\tests\itemRenderers\Halo\List\SWFs\List_itemEditorTests.swf
     [java] getting directory from the swf file
     [java] derived directory: C:\jenkins_slave\workspace\flex-sdk_mustella\mustella\tests\itemRenderers\Halo\List\SWFs
     [java] Launching: 
     [java]  C:\ApacheFlex\dependencies\FlashPlayer_Debug\flashplayer11_7r700_232_win_sa_debug.exe C:\jenkins_slave\workspace\flex-sdk_mustella\mustella\tests\itemRenderers\Halo\List\SWFs\List_itemEditorTests.swf Launching: C:\ApacheFlex\dependencies\FlashPlayer_Debug\flashplayer11_7r700_232_win_sa_debug.exe C:\jenkins_slave\workspace\flex-sdk_mustella\mustella\tests\itemRenderers\Halo\List\SWFs\List_itemEditorTests.swf
     [java] USING directory: C:\jenkins_slave\workspace\flex-sdk_mustella\mustella\tests\itemRenderers\Halo\List\SWFs
     [java] time: 18:54:09.515
     [java] waited 2000
     [java] ClobberProcess, it was already null
     [java] SCRIPTDONE! 18:54:13.027
     [java] GET /ScriptComplete?0 HTTP/1.1
     [java] Before Wait loop 18:54:13.027 waiting = 0
     [java] After Wait loop 18:54:13.027 waiting = 0
     [java] clobberProcess false
     [java] Total Results so far: 7
     [java] Grab log, do parse = false
     [java] Grabbing the log from: C:\Users\ApacheFlex\AppData/Roaming\Macromedia/Flash Player/Logs/flashlog.txt to: C:\jenkins_slave\workspace\flex-sdk_mustella\mustella\tests\itemRenderers\Halo\List\SWFs\List_itemEditorTests.log
     [java] waited 1900
     [java] ClobberProcess, it was already null
     [java] new test file: C:\jenkins_slave\workspace\flex-sdk_mustella\mustella\tests\itemRenderers\Halo\List\SWFs\List_itemRendererTests.swf
     [java] ******** cmdArr before: 
     [java] 	C:\ApacheFlex\dependencies\FlashPlayer_Debug\flashplayer11_7r700_232_win_sa_debug.exe
     [java] 	C:\jenkins_slave\workspace\flex-sdk_mustella\mustella\tests\itemRenderers\Halo\List\SWFs\List_itemRendererTests.swf
     [java] ******** moreParameters before: 
     [java] ******** cmdArr after: 
     [java] 	C:\ApacheFlex\dependencies\FlashPlayer_Debug\flashplayer11_7r700_232_win_sa_debug.exe
     [java] 	C:\jenkins_slave\workspace\flex-sdk_mustella\mustella\tests\itemRenderers\Halo\List\SWFs\List_itemRendererTests.swf
     [java] getting directory from the swf file
     [java] derived directory: C:\jenkins_slave\workspace\flex-sdk_mustella\mustella\tests\itemRenderers\Halo\List\SWFs
     [java] Launching: 
     [java]  C:\ApacheFlex\dependencies\FlashPlayer_Debug\flashplayer11_7r700_232_win_sa_debug.exe C:\jenkins_slave\workspace\flex-sdk_mustella\mustella\tests\itemRenderers\Halo\List\SWFs\List_itemRendererTests.swf Launching: C:\ApacheFlex\dependencies\FlashPlayer_Debug\flashplayer11_7r700_232_win_sa_debug.exe C:\jenkins_slave\workspace\flex-sdk_mustella\mustella\tests\itemRenderers\Halo\List\SWFs\List_itemRendererTests.swf
     [java] USING directory: C:\jenkins_slave\workspace\flex-sdk_mustella\mustella\tests\itemRenderers\Halo\List\SWFs
     [java] time: 18:54:15.245
     [java] SCRIPTDONE! 18:54:18.847
     [java] GET /ScriptComplete?0 HTTP/1.1
     [java] Before Wait loop 18:54:18.847 waiting = 0
     [java] After Wait loop 18:54:18.847 waiting = 0
     [java] clobberProcess false
     [java] Total Results so far: 8
     [java] waited 1900
     [java] ClobberProcess, it was already null
     [java] Grab log, do parse = false
     [java] Grabbing the log from: C:\Users\ApacheFlex\AppData/Roaming\Macromedia/Flash Player/Logs/flashlog.txt to: C:\jenkins_slave\workspace\flex-sdk_mustella\mustella\tests\itemRenderers\Halo\List\SWFs\List_itemRendererTests.log
     [java] new test file: C:\jenkins_slave\workspace\flex-sdk_mustella\mustella\tests\itemRenderers\Spark\List\SWFs\List_itemRendererTests_spark.swf
     [java] ******** cmdArr before: 
     [java] 	C:\ApacheFlex\dependencies\FlashPlayer_Debug\flashplayer11_7r700_232_win_sa_debug.exe
     [java] 	C:\jenkins_slave\workspace\flex-sdk_mustella\mustella\tests\itemRenderers\Spark\List\SWFs\List_itemRendererTests_spark.swf
     [java] ******** moreParameters before: 
     [java] ******** cmdArr after: 
     [java] 	C:\ApacheFlex\dependencies\FlashPlayer_Debug\flashplayer11_7r700_232_win_sa_debug.exe
     [java] 	C:\jenkins_slave\workspace\flex-sdk_mustella\mustella\tests\itemRenderers\Spark\List\SWFs\List_itemRendererTests_spark.swf
     [java] getting directory from the swf file
     [java] derived directory: C:\jenkins_slave\workspace\flex-sdk_mustella\mustella\tests\itemRenderers\Spark\List\SWFs
     [java] Launching: 
     [java]  C:\ApacheFlex\dependencies\FlashPlayer_Debug\flashplayer11_7r700_232_win_sa_debug.exe C:\jenkins_slave\workspace\flex-sdk_mustella\mustella\tests\itemRenderers\Spark\List\SWFs\List_itemRendererTests_spark.swf Launching: C:\ApacheFlex\dependencies\FlashPlayer_Debug\flashplayer11_7r700_232_win_sa_debug.exe C:\jenkins_slave\workspace\flex-sdk_mustella\mustella\tests\itemRenderers\Spark\List\SWFs\List_itemRendererTests_spark.swf
     [java] USING directory: C:\jenkins_slave\workspace\flex-sdk_mustella\mustella\tests\itemRenderers\Spark\List\SWFs
     [java] time: 18:54:21.097
     [java] SCRIPTDONE! 18:54:24.977
     [java] GET /ScriptComplete?0 HTTP/1.1
     [java] Before Wait loop 18:54:24.977 waiting = 0
     [java] After Wait loop 18:54:24.977 waiting = 0
     [java] clobberProcess false
     [java] Total Results so far: 9
     [java] Grab log, do parse = false
     [java] Grabbing the log from: C:\Users\ApacheFlex\AppData/Roaming\Macromedia/Flash Player/Logs/flashlog.txt to: C:\jenkins_slave\workspace\flex-sdk_mustella\mustella\tests\itemRenderers\Spark\List\SWFs\List_itemRendererTests_spark.log
     [java] new test file: C:\jenkins_slave\workspace\flex-sdk_mustella\mustella\tests\mx\controls\MovieClipSWFLoader\SWFs\MovieClipSWFLoader_Main.swf
     [java] ******** cmdArr before: 
     [java] 	C:\ApacheFlex\dependencies\FlashPlayer_Debug\flashplayer11_7r700_232_win_sa_debug.exe
     [java] 	C:\jenkins_slave\workspace\flex-sdk_mustella\mustella\tests\mx\controls\MovieClipSWFLoader\SWFs\MovieClipSWFLoader_Main.swf
     [java] ******** moreParameters before: 
     [java] ******** cmdArr after: 
     [java] 	C:\ApacheFlex\dependencies\FlashPlayer_Debug\flashplayer11_7r700_232_win_sa_debug.exe
     [java] 	C:\jenkins_slave\workspace\flex-sdk_mustella\mustella\tests\mx\controls\MovieClipSWFLoader\SWFs\MovieClipSWFLoader_Main.swf
     [java] getting directory from the swf file
     [java] derived directory: C:\jenkins_slave\workspace\flex-sdk_mustella\mustella\tests\mx\controls\MovieClipSWFLoader\SWFs
     [java] Launching: 
     [java]  C:\ApacheFlex\dependencies\FlashPlayer_Debug\flashplayer11_7r700_232_win_sa_debug.exe C:\jenkins_slave\workspace\flex-sdk_mustella\mustella\tests\mx\controls\MovieClipSWFLoader\SWFs\MovieClipSWFLoader_Main.swf Launching: C:\ApacheFlex\dependencies\FlashPlayer_Debug\flashplayer11_7r700_232_win_sa_debug.exe C:\jenkins_slave\workspace\flex-sdk_mustella\mustella\tests\mx\controls\MovieClipSWFLoader\SWFs\MovieClipSWFLoader_Main.swf
     [java] USING directory: C:\jenkins_slave\workspace\flex-sdk_mustella\mustella\tests\mx\controls\MovieClipSWFLoader\SWFs
     [java] time: 18:54:27.249
     [java] waited 2000
     [java] ClobberProcess, it was already null
     [java] SCRIPTDONE! 18:54:30.439
     [java] GET /ScriptComplete?0 HTTP/1.1
     [java] Before Wait loop 18:54:30.439 waiting = 0
     [java] After Wait loop 18:54:30.439 waiting = 0
     [java] clobberProcess false
     [java] Total Results so far: 10
     [java] Grab log, do parse = false
     [java] Grabbing the log from: C:\Users\ApacheFlex\AppData/Roaming\Macromedia/Flash Player/Logs/flashlog.txt to: C:\jenkins_slave\workspace\flex-sdk_mustella\mustella\tests\mx\controls\MovieClipSWFLoader\SWFs\MovieClipSWFLoader_Main.log
     [java] new test file: C:\jenkins_slave\workspace\flex-sdk_mustella\mustella\tests\resources\ResourceManager\SWFs\ResourceManagerApp.swf
     [java] ******** cmdArr before: 
     [java] 	C:\ApacheFlex\dependencies\FlashPlayer_Debug\flashplayer11_7r700_232_win_sa_debug.exe
     [java] 	C:\jenkins_slave\workspace\flex-sdk_mustella\mustella\tests\resources\ResourceManager\SWFs\ResourceManagerApp.swf
     [java] ******** moreParameters before: 
     [java] ******** cmdArr after: 
     [java] 	C:\ApacheFlex\dependencies\FlashPlayer_Debug\flashplayer11_7r700_232_win_sa_debug.exe
     [java] 	C:\jenkins_slave\workspace\flex-sdk_mustella\mustella\tests\resources\ResourceManager\SWFs\ResourceManagerApp.swf
     [java] getting directory from the swf file
     [java] derived directory: C:\jenkins_slave\workspace\flex-sdk_mustella\mustella\tests\resources\ResourceManager\SWFs
     [java] Launching: 
     [java]  C:\ApacheFlex\dependencies\FlashPlayer_Debug\flashplayer11_7r700_232_win_sa_debug.exe C:\jenkins_slave\workspace\flex-sdk_mustella\mustella\tests\resources\ResourceManager\SWFs\ResourceManagerApp.swf Launching: C:\ApacheFlex\dependencies\FlashPlayer_Debug\flashplayer11_7r700_232_win_sa_debug.exe C:\jenkins_slave\workspace\flex-sdk_mustella\mustella\tests\resources\ResourceManager\SWFs\ResourceManagerApp.swf
     [java] USING directory: C:\jenkins_slave\workspace\flex-sdk_mustella\mustella\tests\resources\ResourceManager\SWFs
     [java] time: 18:54:32.648
     [java] waited 1900
     [java] ClobberProcess, it was already null
     [java] SCRIPTDONE! 18:54:35.670
     [java] GET /ScriptComplete?0 HTTP/1.1
     [java] Before Wait loop 18:54:35.670 waiting = 0
     [java] After Wait loop 18:54:35.670 waiting = 0
     [java] clobberProcess false
     [java] Total Results so far: 11
     [java] waited 1900
     [java] ClobberProcess, it was already null
     [java] Grab log, do parse = false
     [java] Grabbing the log from: C:\Users\ApacheFlex\AppData/Roaming\Macromedia/Flash Player/Logs/flashlog.txt to: C:\jenkins_slave\workspace\flex-sdk_mustella\mustella\tests\resources\ResourceManager\SWFs\ResourceManagerApp.log
     [java] at the end of main
     [java] Shutting down the results server
     [java] shutting down the baseline server
     [java] done waiting for results...bye
     [java] =====================================================
     [java]     Passes: 11
     [java]     Fails: 0
     [java] =====================================================
     [java] 
     [java] =====================================================
     [java] =====================================================
     [java] 	Passed: 
     [java] =====================================================
     [java] LangPacks/Japanese/tests/creditCardValidatorTests JA_CreditCardValidator_allowedFormatChars_Ja Passed  
     [java] MarshallPlan/Controls/MP_Controls_Tests MP_EditableList_trusted Passed  
     [java] MarshallPlan/Controls/MP_Controls_Tests2 MP_ComboBox_dropdown_trusted Passed  
     [java] containers/tabnavigator/Styles/TabNavigator_Styles_SkinStates TabNavigator_Styles_SkinStates_runtime_SWF_mouseOver_NonselectedTab Passed  
     [java] gumbo/components/Application/properties/Application_Properties Application_Properties_skin_test7 Passed  
     [java] gumbo/components/Image/styles/Image_styles_smoothingQuality Image_Scale_stretch_smoothingQuality_high Passed  
     [java] itemRenderers/Halo/List/test_scripts/List_itemEditor DateFieldItemEditor_Scrolling Passed  
     [java] itemRenderers/Halo/List/test_scripts/List_itemRenderer DateFieldRenderer_Scrolling Passed  
     [java] itemRenderers/Spark/List/test_scripts/List_itemRenderer_spark DateFieldRenderer_Scrolling Passed  
     [java] mx/controls/MovieClipSWFLoader/methods/MovieClipSWFLoader_Methods MovieClipSWFLoader_prevScene_playing Passed  
     [java] resources/ResourceManager/Integration/ResourceManager_Integration_UIComponent_resourcesChanged ResourceManager_Integration_UIComponent_resourcesChanged_localeChain Passed  
     [java] =====================================================
     [java] 	Failed: 
     [java] =====================================================
     [java] 
     [java] 
     [java] =====================================================
     [java]     Passes: 11
     [java]     Fails: 0
     [java] =====================================================
     [java] 
     [java] 
     [java] Wrote summary to results.txt
     [java] Wrote failures to failures.txt

call_runners:

run:

BUILD SUCCESSFUL
Total time: 4 minutes 1 second



============ JENKINS MUSTELLA RUN REPORT ============

Date/Time: 02-09-2014 23:54

Run duration: 0 days 9 hours 30 mins 54 seconds

Settings:
player.version = 11.7
air.version = 3.7
FLASHPLAYER_DEBUGGER = C:\ApacheFlex\dependencies\FlashPlayer_Debug\flashplayer11_7r700_232_win_sa_debug.exe
AIR_HOME = C:\ApacheFlex\dependencies\AdobeAIRSDK\3.7

Build: 
  type = main
  command = -timeout=60000
  set = -all

Log:
- Made Cygwin ignore carriage returns
- Cleaned up 'local.properties' files from previous runs
- Set FLASH_VERSION to '11.7' and AIR_VERSION to '3.7'
- Set AIR_HOME to 'C:\ApacheFlex\dependencies\AdobeAIRSDK\3.7'
- Set FLASHPLAYER_DEBUGGER to 'C:\ApacheFlex\dependencies\FlashPlayer_Debug\flashplayer11_7r700_232_win_sa_debug.exe'
- Ran 'clean', 'main' and 'other.locales' ant targets to prepare the SDK for testing
- Ran Mustella on the SDK with these parameters: '-timeout=60000 -all'
- Some tests failed: running '-failures'
- All tests passed after running '-failures'


=====================================================



Email was triggered for: Fixed
Trigger Success was overridden by another trigger and will not send an email.
Sending email for trigger: Fixed


(sent from ext-email)

flex-sdk_mustella - Build # 709 - Still Failing!

Posted by fl...@gmail.com.
flex-sdk_mustella - Build # 709 - Still Failing:

http://flex-mustella.cloudapp.net/job/flex-sdk_mustella/709/

Changes for Build #706

Changes for Build #707

Changes for Build #708

Changes for Build #709


--------------------------------

Started by user flexpmc
[EnvInject] - Loading node environment variables.
Building remotely on WindowsSlave in workspace c:\jenkins_slave\workspace\flex-sdk_mustella
Fetching changes from the remote Git repository
Fetching upstream changes from https://git-wip-us.apache.org/repos/asf/flex-sdk.git
Checking out Revision 5d0b30c7935f2e4a21c85fe6e7d18f4fdd61b5aa (origin/develop)
FATAL: Could not checkout null with start point 5d0b30c7935f2e4a21c85fe6e7d18f4fdd61b5aa
hudson.plugins.git.GitException: Could not checkout null with start point 5d0b30c7935f2e4a21c85fe6e7d18f4fdd61b5aa
	at org.jenkinsci.plugins.gitclient.CliGitAPIImpl.checkoutBranch(CliGitAPIImpl.java:1274)
	at sun.reflect.NativeMethodAccessorImpl.invoke0(Native Method)
	at sun.reflect.NativeMethodAccessorImpl.invoke(NativeMethodAccessorImpl.java:39)
	at sun.reflect.DelegatingMethodAccessorImpl.invoke(DelegatingMethodAccessorImpl.java:25)
	at java.lang.reflect.Method.invoke(Method.java:597)
	at hudson.remoting.RemoteInvocationHandler$RPCRequest.perform(RemoteInvocationHandler.java:275)
	at hudson.remoting.RemoteInvocationHandler$RPCRequest.call(RemoteInvocationHandler.java:256)
	at hudson.remoting.RemoteInvocationHandler$RPCRequest.call(RemoteInvocationHandler.java:215)
	at hudson.remoting.UserRequest.perform(UserRequest.java:118)
	at hudson.remoting.UserRequest.perform(UserRequest.java:48)
	at hudson.remoting.Request$2.run(Request.java:326)
	at hudson.remoting.InterceptingExecutorService$1.call(InterceptingExecutorService.java:72)
	at java.util.concurrent.FutureTask$Sync.innerRun(FutureTask.java:303)
	at java.util.concurrent.FutureTask.run(FutureTask.java:138)
	at java.util.concurrent.ThreadPoolExecutor$Worker.runTask(ThreadPoolExecutor.java:885)
	at java.util.concurrent.ThreadPoolExecutor$Worker.run(ThreadPoolExecutor.java:907)
	at hudson.remoting.Engine$1$1.run(Engine.java:58)
	at java.lang.Thread.run(Thread.java:619)
Caused by: hudson.plugins.git.GitException: Command "git checkout -f 5d0b30c7935f2e4a21c85fe6e7d18f4fdd61b5aa" returned status code 1:
stdout: 
stderr: error: unable to create file mustella/jenkins.sh (Permission denied)
HEAD is now at 5d0b30c... Fixed 'typo' in version nr.

	at org.jenkinsci.plugins.gitclient.CliGitAPIImpl.launchCommandIn(CliGitAPIImpl.java:1148)
	at org.jenkinsci.plugins.gitclient.CliGitAPIImpl.launchCommandIn(CliGitAPIImpl.java:1125)
	at org.jenkinsci.plugins.gitclient.CliGitAPIImpl.launchCommandIn(CliGitAPIImpl.java:1121)
	at org.jenkinsci.plugins.gitclient.CliGitAPIImpl.launchCommand(CliGitAPIImpl.java:937)
	at org.jenkinsci.plugins.gitclient.CliGitAPIImpl.launchCommand(CliGitAPIImpl.java:947)
	at org.jenkinsci.plugins.gitclient.CliGitAPIImpl.checkout(CliGitAPIImpl.java:1248)
	at hudson.plugins.git.GitAPI.checkout(GitAPI.java:208)
	at org.jenkinsci.plugins.gitclient.CliGitAPIImpl.checkoutBranch(CliGitAPIImpl.java:1258)
	... 17 more


(sent from ext-email)