You are viewing a plain text version of this content. The canonical link for it is here.
Posted to commits@tomee.apache.org by Apache Jenkins Server <je...@builds.apache.org> on 2021/05/02 16:19:48 UTC

Build failed in Jenkins: TomEE » jakarta-deploy #394

See <https://ci-builds.apache.org/job/Tomee/job/jakarta-deploy/394/display/redirect?page=changes>

Changes:

[David Blevins] Signature test fixes


------------------------------------------
[...truncated 251.74 KB...]
[INFO] [         Nested Actions ] [  51033 ]  Unchanged [  43663 ]  Changed [   7370 ]
[INFO] 
[INFO] --- tomee-patch-plugin:0.4-SNAPSHOT:run (default) @ tomee-plume-webapp ---
[INFO] Compiling 23 source files to <https://ci-builds.apache.org/job/Tomee/job/jakarta-deploy/ws/tomee/tomee-plume-webapp/target/patch-classes>
[INFO] -------------------------------------------------------------
[ERROR] COMPILATION ERROR : 
[INFO] -------------------------------------------------------------
[ERROR] <https://ci-builds.apache.org/job/Tomee/job/jakarta-deploy/ws/tomee/tomee-plume-webapp/target/patch-sources/jakarta/enterprise/util/AnnotationLiteral.java>:[217,28] error: cannot find symbol
  symbol:   variable memberNameHashCode
  location: class AnnotationLiteral<T>
  where T is a type-variable:
    T extends Annotation declared in class AnnotationLiteral
[INFO] 1 error
[INFO] -------------------------------------------------------------
[INFO] 
[INFO] ------------------------------------------------------------------------
[INFO] Skipping TomEE :: TomEE :: Apache TomEE
[INFO] This project has been banned from the build due to previous failures.
[INFO] ------------------------------------------------------------------------
[INFO] ------------------------------------------------------------------------
[INFO] Reactor Summary for TomEE :: TomEE :: Apache TomEE 9 9.0.0-M7-SNAPSHOT:
[INFO] 
[INFO] TomEE :: TomEE :: Apache TomEE 9 ................... SUCCESS [ 19.681 s]
[INFO] TomEE :: BOMs ...................................... SUCCESS [  7.608 s]
[INFO] TomEE :: BOMs :: JAXB Runtime ...................... SUCCESS [  6.435 s]
[INFO] TomEE :: TomEE ..................................... SUCCESS [ 24.846 s]
[INFO] TomEE :: Transform ................................. SUCCESS [ 10.664 s]
[INFO] TomEE :: TomEE :: WebProfile Webapp ................ FAILURE [02:39 min]
[INFO] TomEE :: TomEE :: MicroProfile Webapp .............. FAILURE [02:14 min]
[INFO] TomEE :: TomEE :: Plus Webapp ...................... FAILURE [01:54 min]
[INFO] TomEE :: TomEE :: Plume Webapp ..................... FAILURE [02:15 min]
[INFO] TomEE :: TomEE :: Apache TomEE ..................... SKIPPED
[INFO] ------------------------------------------------------------------------
[INFO] BUILD FAILURE
[INFO] ------------------------------------------------------------------------
[INFO] Total time:  11:13 min
[INFO] Finished at: 2021-05-02T16:17:35Z
[INFO] ------------------------------------------------------------------------
ERROR: Asynchronous execution failure
java.util.concurrent.ExecutionException: java.lang.NullPointerException
	at hudson.remoting.Channel$2.adapt(Channel.java:1039)
	at hudson.remoting.Channel$2.adapt(Channel.java:1033)
	at hudson.remoting.FutureAdapter.get(FutureAdapter.java:59)
	at hudson.maven.AbstractMavenBuilder.waitForAsynchronousExecutions(AbstractMavenBuilder.java:186)
	at hudson.maven.Maven3Builder.call(Maven3Builder.java:144)
	at hudson.maven.Maven3Builder.call(Maven3Builder.java:70)
	at hudson.remoting.UserRequest.perform(UserRequest.java:211)
	at hudson.remoting.UserRequest.perform(UserRequest.java:54)
	at hudson.remoting.Request$2.run(Request.java:375)
	at hudson.remoting.InterceptingExecutorService$1.call(InterceptingExecutorService.java:73)
	at java.util.concurrent.FutureTask.run(FutureTask.java:266)
	at java.util.concurrent.ThreadPoolExecutor.runWorker(ThreadPoolExecutor.java:1149)
	at java.util.concurrent.ThreadPoolExecutor$Worker.run(ThreadPoolExecutor.java:624)
	at java.lang.Thread.run(Thread.java:748)
Caused by: java.lang.NullPointerException
ERROR: Asynchronous execution failure
java.util.concurrent.ExecutionException: java.lang.NullPointerException
	at hudson.remoting.Channel$2.adapt(Channel.java:1039)
	at hudson.remoting.Channel$2.adapt(Channel.java:1033)
	at hudson.remoting.FutureAdapter.get(FutureAdapter.java:59)
	at hudson.maven.AbstractMavenBuilder.waitForAsynchronousExecutions(AbstractMavenBuilder.java:186)
	at hudson.maven.Maven3Builder.call(Maven3Builder.java:144)
	at hudson.maven.Maven3Builder.call(Maven3Builder.java:70)
	at hudson.remoting.UserRequest.perform(UserRequest.java:211)
	at hudson.remoting.UserRequest.perform(UserRequest.java:54)
	at hudson.remoting.Request$2.run(Request.java:375)
	at hudson.remoting.InterceptingExecutorService$1.call(InterceptingExecutorService.java:73)
	at java.util.concurrent.FutureTask.run(FutureTask.java:266)
	at java.util.concurrent.ThreadPoolExecutor.runWorker(ThreadPoolExecutor.java:1149)
	at java.util.concurrent.ThreadPoolExecutor$Worker.run(ThreadPoolExecutor.java:624)
	at java.lang.Thread.run(Thread.java:748)
Caused by: java.lang.NullPointerException
ERROR: Asynchronous execution failure
java.util.concurrent.ExecutionException: java.lang.NullPointerException
	at hudson.remoting.Channel$2.adapt(Channel.java:1039)
	at hudson.remoting.Channel$2.adapt(Channel.java:1033)
	at hudson.remoting.FutureAdapter.get(FutureAdapter.java:59)
	at hudson.maven.AbstractMavenBuilder.waitForAsynchronousExecutions(AbstractMavenBuilder.java:186)
	at hudson.maven.Maven3Builder.call(Maven3Builder.java:144)
	at hudson.maven.Maven3Builder.call(Maven3Builder.java:70)
	at hudson.remoting.UserRequest.perform(UserRequest.java:211)
	at hudson.remoting.UserRequest.perform(UserRequest.java:54)
	at hudson.remoting.Request$2.run(Request.java:375)
	at hudson.remoting.InterceptingExecutorService$1.call(InterceptingExecutorService.java:73)
	at java.util.concurrent.FutureTask.run(FutureTask.java:266)
	at java.util.concurrent.ThreadPoolExecutor.runWorker(ThreadPoolExecutor.java:1149)
	at java.util.concurrent.ThreadPoolExecutor$Worker.run(ThreadPoolExecutor.java:624)
	at java.lang.Thread.run(Thread.java:748)
Caused by: java.lang.NullPointerException
ERROR: Asynchronous execution failure
java.util.concurrent.ExecutionException: java.lang.NullPointerException
	at hudson.remoting.Channel$2.adapt(Channel.java:1039)
	at hudson.remoting.Channel$2.adapt(Channel.java:1033)
	at hudson.remoting.FutureAdapter.get(FutureAdapter.java:59)
	at hudson.maven.AbstractMavenBuilder.waitForAsynchronousExecutions(AbstractMavenBuilder.java:186)
	at hudson.maven.Maven3Builder.call(Maven3Builder.java:144)
	at hudson.maven.Maven3Builder.call(Maven3Builder.java:70)
	at hudson.remoting.UserRequest.perform(UserRequest.java:211)
	at hudson.remoting.UserRequest.perform(UserRequest.java:54)
	at hudson.remoting.Request$2.run(Request.java:375)
	at hudson.remoting.InterceptingExecutorService$1.call(InterceptingExecutorService.java:73)
	at java.util.concurrent.FutureTask.run(FutureTask.java:266)
	at java.util.concurrent.ThreadPoolExecutor.runWorker(ThreadPoolExecutor.java:1149)
	at java.util.concurrent.ThreadPoolExecutor$Worker.run(ThreadPoolExecutor.java:624)
	at java.lang.Thread.run(Thread.java:748)
Caused by: java.lang.NullPointerException
ERROR: Asynchronous execution failure
java.util.concurrent.ExecutionException: java.lang.NullPointerException
	at hudson.remoting.Channel$2.adapt(Channel.java:1039)
	at hudson.remoting.Channel$2.adapt(Channel.java:1033)
	at hudson.remoting.FutureAdapter.get(FutureAdapter.java:59)
	at hudson.maven.AbstractMavenBuilder.waitForAsynchronousExecutions(AbstractMavenBuilder.java:186)
	at hudson.maven.Maven3Builder.call(Maven3Builder.java:144)
	at hudson.maven.Maven3Builder.call(Maven3Builder.java:70)
	at hudson.remoting.UserRequest.perform(UserRequest.java:211)
	at hudson.remoting.UserRequest.perform(UserRequest.java:54)
	at hudson.remoting.Request$2.run(Request.java:375)
	at hudson.remoting.InterceptingExecutorService$1.call(InterceptingExecutorService.java:73)
	at java.util.concurrent.FutureTask.run(FutureTask.java:266)
	at java.util.concurrent.ThreadPoolExecutor.runWorker(ThreadPoolExecutor.java:1149)
	at java.util.concurrent.ThreadPoolExecutor$Worker.run(ThreadPoolExecutor.java:624)
	at java.lang.Thread.run(Thread.java:748)
Caused by: java.lang.NullPointerException
ERROR: Asynchronous execution failure
java.util.concurrent.ExecutionException: java.lang.NullPointerException
	at hudson.remoting.Channel$2.adapt(Channel.java:1039)
	at hudson.remoting.Channel$2.adapt(Channel.java:1033)
	at hudson.remoting.FutureAdapter.get(FutureAdapter.java:59)
	at hudson.maven.AbstractMavenBuilder.waitForAsynchronousExecutions(AbstractMavenBuilder.java:186)
	at hudson.maven.Maven3Builder.call(Maven3Builder.java:144)
	at hudson.maven.Maven3Builder.call(Maven3Builder.java:70)
	at hudson.remoting.UserRequest.perform(UserRequest.java:211)
	at hudson.remoting.UserRequest.perform(UserRequest.java:54)
	at hudson.remoting.Request$2.run(Request.java:375)
	at hudson.remoting.InterceptingExecutorService$1.call(InterceptingExecutorService.java:73)
	at java.util.concurrent.FutureTask.run(FutureTask.java:266)
	at java.util.concurrent.ThreadPoolExecutor.runWorker(ThreadPoolExecutor.java:1149)
	at java.util.concurrent.ThreadPoolExecutor$Worker.run(ThreadPoolExecutor.java:624)
	at java.lang.Thread.run(Thread.java:748)
Caused by: java.lang.NullPointerException
ERROR: Asynchronous execution failure
java.util.concurrent.ExecutionException: java.lang.NullPointerException
	at hudson.remoting.Channel$2.adapt(Channel.java:1039)
	at hudson.remoting.Channel$2.adapt(Channel.java:1033)
	at hudson.remoting.FutureAdapter.get(FutureAdapter.java:59)
	at hudson.maven.AbstractMavenBuilder.waitForAsynchronousExecutions(AbstractMavenBuilder.java:186)
	at hudson.maven.Maven3Builder.call(Maven3Builder.java:144)
	at hudson.maven.Maven3Builder.call(Maven3Builder.java:70)
	at hudson.remoting.UserRequest.perform(UserRequest.java:211)
	at hudson.remoting.UserRequest.perform(UserRequest.java:54)
	at hudson.remoting.Request$2.run(Request.java:375)
	at hudson.remoting.InterceptingExecutorService$1.call(InterceptingExecutorService.java:73)
	at java.util.concurrent.FutureTask.run(FutureTask.java:266)
	at java.util.concurrent.ThreadPoolExecutor.runWorker(ThreadPoolExecutor.java:1149)
	at java.util.concurrent.ThreadPoolExecutor$Worker.run(ThreadPoolExecutor.java:624)
	at java.lang.Thread.run(Thread.java:748)
Caused by: java.lang.NullPointerException
ERROR: Asynchronous execution failure
java.util.concurrent.ExecutionException: java.lang.NullPointerException
	at hudson.remoting.Channel$2.adapt(Channel.java:1039)
	at hudson.remoting.Channel$2.adapt(Channel.java:1033)
	at hudson.remoting.FutureAdapter.get(FutureAdapter.java:59)
	at hudson.maven.AbstractMavenBuilder.waitForAsynchronousExecutions(AbstractMavenBuilder.java:186)
	at hudson.maven.Maven3Builder.call(Maven3Builder.java:144)
	at hudson.maven.Maven3Builder.call(Maven3Builder.java:70)
	at hudson.remoting.UserRequest.perform(UserRequest.java:211)
	at hudson.remoting.UserRequest.perform(UserRequest.java:54)
	at hudson.remoting.Request$2.run(Request.java:375)
	at hudson.remoting.InterceptingExecutorService$1.call(InterceptingExecutorService.java:73)
	at java.util.concurrent.FutureTask.run(FutureTask.java:266)
	at java.util.concurrent.ThreadPoolExecutor.runWorker(ThreadPoolExecutor.java:1149)
	at java.util.concurrent.ThreadPoolExecutor$Worker.run(ThreadPoolExecutor.java:624)
	at java.lang.Thread.run(Thread.java:748)
Caused by: java.lang.NullPointerException
[ERROR] Failed to execute goal org.apache.tomee.patch:tomee-patch-plugin:0.4-SNAPSHOT:run (default) on project tomee-webprofile-webapp: Compilation failure
[ERROR] <https://ci-builds.apache.org/job/Tomee/job/jakarta-deploy/ws/tomee/tomee-webprofile-webapp/target/patch-sources/jakarta/enterprise/util/AnnotationLiteral.java>:[217,28] error: cannot find symbol
[ERROR] symbol:   variable memberNameHashCode
[ERROR] location: class AnnotationLiteral<T>
[ERROR] where T is a type-variable:
[ERROR] T extends Annotation declared in class AnnotationLiteral
[ERROR] -> [Help 1]
[ERROR] Failed to execute goal org.apache.tomee.patch:tomee-patch-plugin:0.4-SNAPSHOT:run (default) on project tomee-microprofile-webapp: Compilation failure
[ERROR] <https://ci-builds.apache.org/job/Tomee/job/jakarta-deploy/ws/tomee/tomee-microprofile-webapp/target/patch-sources/jakarta/enterprise/util/AnnotationLiteral.java>:[217,28] error: cannot find symbol
[ERROR] symbol:   variable memberNameHashCode
[ERROR] location: class AnnotationLiteral<T>
[ERROR] where T is a type-variable:
[ERROR] T extends Annotation declared in class AnnotationLiteral
[ERROR] -> [Help 1]
[ERROR] Failed to execute goal org.apache.tomee.patch:tomee-patch-plugin:0.4-SNAPSHOT:run (default) on project tomee-plus-webapp: Compilation failure
[ERROR] <https://ci-builds.apache.org/job/Tomee/job/jakarta-deploy/ws/tomee/tomee-plus-webapp/target/patch-sources/jakarta/enterprise/util/AnnotationLiteral.java>:[217,28] error: cannot find symbol
[ERROR] symbol:   variable memberNameHashCode
[ERROR] location: class AnnotationLiteral<T>
[ERROR] where T is a type-variable:
[ERROR] T extends Annotation declared in class AnnotationLiteral
[ERROR] -> [Help 1]
[ERROR] Failed to execute goal org.apache.tomee.patch:tomee-patch-plugin:0.4-SNAPSHOT:run (default) on project tomee-plume-webapp: Compilation failure
[ERROR] <https://ci-builds.apache.org/job/Tomee/job/jakarta-deploy/ws/tomee/tomee-plume-webapp/target/patch-sources/jakarta/enterprise/util/AnnotationLiteral.java>:[217,28] error: cannot find symbol
[ERROR] symbol:   variable memberNameHashCode
[ERROR] location: class AnnotationLiteral<T>
[ERROR] where T is a type-variable:
[ERROR] T extends Annotation declared in class AnnotationLiteral
[ERROR] -> [Help 1]
[ERROR] 
[ERROR] To see the full stack trace of the errors, re-run Maven with the -e switch.
[ERROR] Re-run Maven using the -X switch to enable full debug logging.
[ERROR] 
[ERROR] For more information about the errors and possible solutions, please read the following articles:
[ERROR] [Help 1] http://cwiki.apache.org/confluence/display/MAVEN/MojoFailureException
[ERROR] 
[ERROR] After correcting the problems, you can resume the build with the command
[ERROR]   mvn <goals> -rf :tomee-webprofile-webapp
[JENKINS] Archiving <https://ci-builds.apache.org/job/Tomee/job/jakarta-deploy/ws/pom.xml> to org.apache.tomee/tomee-project/9.0.0-M7-SNAPSHOT/tomee-project-9.0.0-M7-SNAPSHOT.pom
[Fast Archiver] Compressed 47.27 KB of artifacts by 67.7% relative to #393
[JENKINS] Archiving <https://ci-builds.apache.org/job/Tomee/job/jakarta-deploy/ws/tomee/tomee-webprofile-webapp/pom.xml> to org.apache.tomee/tomee-webprofile-webapp/9.0.0-M7-SNAPSHOT/tomee-webprofile-webapp-9.0.0-M7-SNAPSHOT.pom
[JENKINS] Archiving <https://ci-builds.apache.org/job/Tomee/job/jakarta-deploy/ws/tomee/tomee-webprofile-webapp/target/tomee-webprofile-webapp-9.0.0-M7-SNAPSHOT.jar> to org.apache.tomee/tomee-webprofile-webapp/9.0.0-M7-SNAPSHOT/tomee-webprofile-webapp-9.0.0-M7-SNAPSHOT.jar
[JENKINS] Archiving <https://ci-builds.apache.org/job/Tomee/job/jakarta-deploy/ws/tomee/tomee-webprofile-webapp/target/tomee-webprofile-webapp-9.0.0-M7-SNAPSHOT.war> to org.apache.tomee/tomee-webprofile-webapp/9.0.0-M7-SNAPSHOT/tomee-webprofile-webapp-9.0.0-M7-SNAPSHOT.war
[JENKINS] Archiving <https://ci-builds.apache.org/job/Tomee/job/jakarta-deploy/ws/tomee/tomee-webprofile-webapp/target/tomee-webprofile-webapp-transformed-9.0.0-M7-SNAPSHOT.jar> to org.apache.tomee/tomee-webprofile-webapp/9.0.0-M7-SNAPSHOT/tomee-webprofile-webapp-9.0.0-M7-SNAPSHOT-transformed.jar
[JENKINS] Archiving <https://ci-builds.apache.org/job/Tomee/job/jakarta-deploy/ws/tomee/tomee-webprofile-webapp/target/tomee-webprofile-webapp-transformed-9.0.0-M7-SNAPSHOT.war> to org.apache.tomee/tomee-webprofile-webapp/9.0.0-M7-SNAPSHOT/tomee-webprofile-webapp-9.0.0-M7-SNAPSHOT-transformed.war
[Fast Archiver] Compressed 76.87 MB of artifacts by 46.1% relative to #393
[JENKINS] Archiving <https://ci-builds.apache.org/job/Tomee/job/jakarta-deploy/ws/tomee/apache-tomee/pom.xml> to org.apache.tomee/apache-tomee/9.0.0-M7-SNAPSHOT/apache-tomee-9.0.0-M7-SNAPSHOT.pom
[JENKINS] Archiving <https://ci-builds.apache.org/job/Tomee/job/jakarta-deploy/ws/tomee/tomee-plume-webapp/pom.xml> to org.apache.tomee/tomee-plume-webapp/9.0.0-M7-SNAPSHOT/tomee-plume-webapp-9.0.0-M7-SNAPSHOT.pom
[JENKINS] Archiving <https://ci-builds.apache.org/job/Tomee/job/jakarta-deploy/ws/tomee/tomee-plume-webapp/target/tomee-plume-webapp-9.0.0-M7-SNAPSHOT.jar> to org.apache.tomee/tomee-plume-webapp/9.0.0-M7-SNAPSHOT/tomee-plume-webapp-9.0.0-M7-SNAPSHOT.jar
[JENKINS] Archiving <https://ci-builds.apache.org/job/Tomee/job/jakarta-deploy/ws/tomee/tomee-plume-webapp/target/tomee-plume-webapp-9.0.0-M7-SNAPSHOT.war> to org.apache.tomee/tomee-plume-webapp/9.0.0-M7-SNAPSHOT/tomee-plume-webapp-9.0.0-M7-SNAPSHOT.war
[JENKINS] Archiving <https://ci-builds.apache.org/job/Tomee/job/jakarta-deploy/ws/tomee/tomee-plume-webapp/target/tomee-plume-webapp-transformed-9.0.0-M7-SNAPSHOT.jar> to org.apache.tomee/tomee-plume-webapp/9.0.0-M7-SNAPSHOT/tomee-plume-webapp-9.0.0-M7-SNAPSHOT-transformed.jar
[JENKINS] Archiving <https://ci-builds.apache.org/job/Tomee/job/jakarta-deploy/ws/tomee/tomee-plume-webapp/target/tomee-plume-webapp-transformed-9.0.0-M7-SNAPSHOT.war> to org.apache.tomee/tomee-plume-webapp/9.0.0-M7-SNAPSHOT/tomee-plume-webapp-9.0.0-M7-SNAPSHOT-transformed.war
[Fast Archiver] Compressed 128.86 MB of artifacts by 46.2% relative to #393
[JENKINS] Archiving <https://ci-builds.apache.org/job/Tomee/job/jakarta-deploy/ws/boms/jaxb-runtime/pom.xml> to org.apache.tomee.bom/jaxb-runtime/9.0.0-M7-SNAPSHOT/jaxb-runtime-9.0.0-M7-SNAPSHOT.pom
[JENKINS] Archiving <https://ci-builds.apache.org/job/Tomee/job/jakarta-deploy/ws/tomee/pom.xml> to org.apache.tomee/tomee/9.0.0-M7-SNAPSHOT/tomee-9.0.0-M7-SNAPSHOT.pom
[JENKINS] Archiving <https://ci-builds.apache.org/job/Tomee/job/jakarta-deploy/ws/tomee/tomee-plus-webapp/pom.xml> to org.apache.tomee/tomee-plus-webapp/9.0.0-M7-SNAPSHOT/tomee-plus-webapp-9.0.0-M7-SNAPSHOT.pom
[JENKINS] Archiving <https://ci-builds.apache.org/job/Tomee/job/jakarta-deploy/ws/tomee/tomee-plus-webapp/target/tomee-plus-webapp-9.0.0-M7-SNAPSHOT.jar> to org.apache.tomee/tomee-plus-webapp/9.0.0-M7-SNAPSHOT/tomee-plus-webapp-9.0.0-M7-SNAPSHOT.jar
[JENKINS] Archiving <https://ci-builds.apache.org/job/Tomee/job/jakarta-deploy/ws/tomee/tomee-plus-webapp/target/tomee-plus-webapp-9.0.0-M7-SNAPSHOT.war> to org.apache.tomee/tomee-plus-webapp/9.0.0-M7-SNAPSHOT/tomee-plus-webapp-9.0.0-M7-SNAPSHOT.war
[JENKINS] Archiving <https://ci-builds.apache.org/job/Tomee/job/jakarta-deploy/ws/tomee/tomee-plus-webapp/target/tomee-plus-webapp-transformed-9.0.0-M7-SNAPSHOT.jar> to org.apache.tomee/tomee-plus-webapp/9.0.0-M7-SNAPSHOT/tomee-plus-webapp-9.0.0-M7-SNAPSHOT-transformed.jar
[JENKINS] Archiving <https://ci-builds.apache.org/job/Tomee/job/jakarta-deploy/ws/tomee/tomee-plus-webapp/target/tomee-plus-webapp-transformed-9.0.0-M7-SNAPSHOT.war> to org.apache.tomee/tomee-plus-webapp/9.0.0-M7-SNAPSHOT/tomee-plus-webapp-9.0.0-M7-SNAPSHOT-transformed.war
[Fast Archiver] Compressed 115.03 MB of artifacts by 45.8% relative to #393
[JENKINS] Archiving <https://ci-builds.apache.org/job/Tomee/job/jakarta-deploy/ws/tomee/tomee-microprofile-webapp/pom.xml> to org.apache.tomee/tomee-microprofile-webapp/9.0.0-M7-SNAPSHOT/tomee-microprofile-webapp-9.0.0-M7-SNAPSHOT.pom
[JENKINS] Archiving <https://ci-builds.apache.org/job/Tomee/job/jakarta-deploy/ws/tomee/tomee-microprofile-webapp/target/tomee-microprofile-webapp-9.0.0-M7-SNAPSHOT.jar> to org.apache.tomee/tomee-microprofile-webapp/9.0.0-M7-SNAPSHOT/tomee-microprofile-webapp-9.0.0-M7-SNAPSHOT.jar
[JENKINS] Archiving <https://ci-builds.apache.org/job/Tomee/job/jakarta-deploy/ws/tomee/tomee-microprofile-webapp/target/tomee-microprofile-webapp-9.0.0-M7-SNAPSHOT.war> to org.apache.tomee/tomee-microprofile-webapp/9.0.0-M7-SNAPSHOT/tomee-microprofile-webapp-9.0.0-M7-SNAPSHOT.war
[JENKINS] Archiving <https://ci-builds.apache.org/job/Tomee/job/jakarta-deploy/ws/tomee/tomee-microprofile-webapp/target/tomee-microprofile-webapp-transformed-9.0.0-M7-SNAPSHOT.jar> to org.apache.tomee/tomee-microprofile-webapp/9.0.0-M7-SNAPSHOT/tomee-microprofile-webapp-9.0.0-M7-SNAPSHOT-transformed.jar
[JENKINS] Archiving <https://ci-builds.apache.org/job/Tomee/job/jakarta-deploy/ws/tomee/tomee-microprofile-webapp/target/tomee-microprofile-webapp-transformed-9.0.0-M7-SNAPSHOT.war> to org.apache.tomee/tomee-microprofile-webapp/9.0.0-M7-SNAPSHOT/tomee-microprofile-webapp-9.0.0-M7-SNAPSHOT-transformed.war
[Fast Archiver] Compressed 105.67 MB of artifacts by 45.4% relative to #393
[JENKINS] Archiving <https://ci-builds.apache.org/job/Tomee/job/jakarta-deploy/ws/boms/pom.xml> to org.apache.tomee.bom/boms/9.0.0-M7-SNAPSHOT/boms-9.0.0-M7-SNAPSHOT.pom
[JENKINS] Archiving <https://ci-builds.apache.org/job/Tomee/job/jakarta-deploy/ws/transform/pom.xml> to org.apache.tomee/transform/9.0.0-M7-SNAPSHOT/transform-9.0.0-M7-SNAPSHOT.pom
[JENKINS] Archiving <https://ci-builds.apache.org/job/Tomee/job/jakarta-deploy/ws/transform/target/transform-9.0.0-M7-SNAPSHOT.jar> to org.apache.tomee/transform/9.0.0-M7-20210502.160741-202/transform-9.0.0-M7-20210502.160741-202.jar
Sending e-mails to: commits@tomee.apache.org
No mail will be sent out, as 'TomEE » jakarta-deploy » TomEE :: TomEE :: Apache TomEE #394' does not have a result yet. Please make sure you set a proper result in case of pipeline/build scripts.
Sending e-mails to: commits@tomee.apache.org
Sending e-mails to: commits@tomee.apache.org
Sending e-mails to: commits@tomee.apache.org
channel stopped

Jenkins build is back to normal : TomEE » jakarta-deploy #395

Posted by Apache Jenkins Server <je...@builds.apache.org>.
See <https://ci-builds.apache.org/job/Tomee/job/jakarta-deploy/395/display/redirect?page=changes>