You are viewing a plain text version of this content. The canonical link for it is here.
Posted to yarn-dev@hadoop.apache.org by Apache Jenkins Server <je...@builds.apache.org> on 2015/05/04 08:29:24 UTC

Failed: YARN-3069 PreCommit Build #7682

Jira: https://issues.apache.org/jira/browse/YARN-3069
Build: https://builds.apache.org/job/PreCommit-YARN-Build/7682/

###################################################################################
########################## LAST 60 LINES OF THE CONSOLE ###########################
[...truncated 264 lines...]
|  -1  |         whitespace  |  0m 1s     | The patch has 4 line(s) that end in 
|      |                     |            | whitespace. Use git apply
|      |                     |            | --whitespace=fix.
|  +1  |            install  |  1m 34s    | mvn install still works. 
|  +1  |    eclipse:eclipse  |  0m 33s    | The patch built with 
|      |                     |            | eclipse:eclipse.
|  +1  |           findbugs  |  1m 23s    | The patch does not introduce any 
|      |                     |            | new Findbugs (version 2.0.3)
|      |                     |            | warnings.
|  -1  |         yarn tests  |  1m 55s    | Tests failed in hadoop-yarn-common. 
|      |                     |  38m 49s   | 


             Reason | Tests
 Failed unit tests  |  hadoop.yarn.conf.TestYarnConfigurationFields 


|| Subsystem || Report/Notes ||
============================================================================
| Patch URL | http://issues.apache.org/jira/secure/attachment/12730122/YARN-3069.005.patch |
| Optional Tests | javadoc javac unit findbugs checkstyle |
| git revision | trunk / a319771 |
| whitespace | /home/jenkins/jenkins-slave/workspace/PreCommit-YARN-Build/../patchprocess/whitespace.txt |
| hadoop-yarn-common test log | /home/jenkins/jenkins-slave/workspace/PreCommit-YARN-Build/../patchprocess/testrun_hadoop-yarn-common.txt |
| Test Results | https://builds.apache.org/job/PreCommit-YARN-Build/7682/testReport/ |
| Java | 1.7.0_55 |
| uname | Linux asf904.gq1.ygridcore.net 3.13.0-36-lowlatency #63-Ubuntu SMP PREEMPT Wed Sep 3 21:56:12 UTC 2014 x86_64 x86_64 x86_64 GNU/Linux |


============================================================================
============================================================================
                          Adding comment to JIRA
============================================================================
============================================================================


Comment added.
7705d8aecfe15440b9b8861cfcd2c45679244985 logged out


============================================================================
============================================================================
                              Finished build.
============================================================================
============================================================================


Build step 'Execute shell' marked build as failure
Archiving artifacts
Sending artifact delta relative to PreCommit-YARN-Build #7681
Archived 21 artifacts
Archive block size is 32768
Received 59 blocks and 9702186 bytes
Compression is 16.6%
Took 1.9 sec
[description-setter] Could not determine description.
Recording test results
Email was triggered for: Failure
Sending email for trigger: Failure



###################################################################################
############################## FAILED TESTS (if any) ##############################
1 tests failed.
FAILED:  org.apache.hadoop.yarn.conf.TestYarnConfigurationFields.testCompareConfigurationClassAgainstXml

Error Message:
class org.apache.hadoop.yarn.conf.YarnConfiguration has 1 variables missing in yarn-default.xml

Stack Trace:
java.lang.AssertionError: class org.apache.hadoop.yarn.conf.YarnConfiguration has 1 variables missing in yarn-default.xml
	at org.junit.Assert.fail(Assert.java:88)
	at org.junit.Assert.assertTrue(Assert.java:41)
	at org.apache.hadoop.conf.TestConfigurationFieldsBase.testCompareConfigurationClassAgainstXml(TestConfigurationFieldsBase.java:375)
	at sun.reflect.NativeMethodAccessorImpl.invoke0(Native Method)
	at sun.reflect.NativeMethodAccessorImpl.invoke(NativeMethodAccessorImpl.java:57)
	at sun.reflect.DelegatingMethodAccessorImpl.invoke(DelegatingMethodAccessorImpl.java:43)
	at java.lang.reflect.Method.invoke(Method.java:606)
	at org.junit.runners.model.FrameworkMethod$1.runReflectiveCall(FrameworkMethod.java:47)
	at org.junit.internal.runners.model.ReflectiveCallable.run(ReflectiveCallable.java:12)
	at org.junit.runners.model.FrameworkMethod.invokeExplosively(FrameworkMethod.java:44)
	at org.junit.internal.runners.statements.InvokeMethod.evaluate(InvokeMethod.java:17)
	at org.junit.internal.runners.statements.RunBefores.evaluate(RunBefores.java:26)
	at org.junit.runners.ParentRunner.runLeaf(ParentRunner.java:271)
	at org.junit.runners.BlockJUnit4ClassRunner.runChild(BlockJUnit4ClassRunner.java:70)
	at org.junit.runners.BlockJUnit4ClassRunner.runChild(BlockJUnit4ClassRunner.java:50)
	at org.junit.runners.ParentRunner$3.run(ParentRunner.java:238)
	at org.junit.runners.ParentRunner$1.schedule(ParentRunner.java:63)
	at org.junit.runners.ParentRunner.runChildren(ParentRunner.java:236)
	at org.junit.runners.ParentRunner.access$000(ParentRunner.java:53)
	at org.junit.runners.ParentRunner$2.evaluate(ParentRunner.java:229)
	at org.junit.runners.ParentRunner.run(ParentRunner.java:309)
	at org.apache.maven.surefire.junit4.JUnit4Provider.execute(JUnit4Provider.java:264)
	at org.apache.maven.surefire.junit4.JUnit4Provider.executeTestSet(JUnit4Provider.java:153)
	at org.apache.maven.surefire.junit4.JUnit4Provider.invoke(JUnit4Provider.java:124)
	at org.apache.maven.surefire.booter.ForkedBooter.invokeProviderInSameClassLoader(ForkedBooter.java:200)
	at org.apache.maven.surefire.booter.ForkedBooter.runSuitesInProcess(ForkedBooter.java:153)
	at org.apache.maven.surefire.booter.ForkedBooter.main(ForkedBooter.java:103)



Failed: YARN-3523 PreCommit Build #7686

Posted by Apache Jenkins Server <je...@builds.apache.org>.
Jira: https://issues.apache.org/jira/browse/YARN-3523
Build: https://builds.apache.org/job/PreCommit-YARN-Build/7686/

###################################################################################
########################## LAST 60 LINES OF THE CONSOLE ###########################
[...truncated 268 lines...]
|  -1  |         checkstyle  |  1m 2s     | The applied patch generated 1 new 
|      |                     |            | checkstyle issues (total was 17, now
|      |                     |            | 18).
|  -1  |         whitespace  |  0m 0s     | The patch has 6 line(s) that end in 
|      |                     |            | whitespace. Use git apply
|      |                     |            | --whitespace=fix.
|  +1  |            install  |  1m 36s    | mvn install still works. 
|  +1  |    eclipse:eclipse  |  0m 32s    | The patch built with 
|      |                     |            | eclipse:eclipse.
|  +1  |           findbugs  |  1m 24s    | The patch does not introduce any 
|      |                     |            | new Findbugs (version 2.0.3)
|      |                     |            | warnings.
|  +1  |         yarn tests  |  0m 27s    | Tests passed in hadoop-yarn-api. 
|      |                     |  38m 5s    | 


|| Subsystem || Report/Notes ||
============================================================================
| Patch URL | http://issues.apache.org/jira/secure/attachment/12730182/YARN-3523.20150504-1.patch |
| Optional Tests | javadoc javac unit findbugs checkstyle |
| git revision | trunk / bb9ddef |
| checkstyle |  /home/jenkins/jenkins-slave/workspace/PreCommit-YARN-Build/../patchprocess/diffcheckstylehadoop-yarn-api.txt |
| whitespace | /home/jenkins/jenkins-slave/workspace/PreCommit-YARN-Build/../patchprocess/whitespace.txt |
| hadoop-yarn-api test log | /home/jenkins/jenkins-slave/workspace/PreCommit-YARN-Build/../patchprocess/testrun_hadoop-yarn-api.txt |
| Test Results | https://builds.apache.org/job/PreCommit-YARN-Build/7686/testReport/ |
| Java | 1.7.0_55 |
| uname | Linux asf904.gq1.ygridcore.net 3.13.0-36-lowlatency #63-Ubuntu SMP PREEMPT Wed Sep 3 21:56:12 UTC 2014 x86_64 x86_64 x86_64 GNU/Linux |


============================================================================
============================================================================
                          Adding comment to JIRA
============================================================================
============================================================================


Comment added.
2ac3d514d5f488cfd58b1f61aa71dfa99e67a2f9 logged out


============================================================================
============================================================================
                              Finished build.
============================================================================
============================================================================


Build step 'Execute shell' marked build as failure
Archiving artifacts
Sending artifact delta relative to PreCommit-YARN-Build #7681
Archived 26 artifacts
Archive block size is 32768
Received 57 blocks and 25909015 bytes
Compression is 6.7%
Took 5.6 sec
[description-setter] Could not determine description.
Recording test results
Email was triggered for: Failure
Sending email for trigger: Failure



###################################################################################
############################## FAILED TESTS (if any) ##############################
No tests ran.

Failed: YARN-3018 PreCommit Build #7685

Posted by Apache Jenkins Server <je...@builds.apache.org>.
Jira: https://issues.apache.org/jira/browse/YARN-3018
Build: https://builds.apache.org/job/PreCommit-YARN-Build/7685/

###################################################################################
########################## LAST 60 LINES OF THE CONSOLE ###########################
[...truncated 151 lines...]



+1 overall

| Vote |         Subsystem |  Runtime   | Comment
============================================================================
|   0  |        pre-patch  |  0m 0s     | Pre-patch trunk compilation is 
|      |                   |            | healthy.
|  +1  |          @author  |  0m 0s     | The patch does not contain any 
|      |                   |            | @author tags.
|  +1  |    release audit  |  0m 15s    | The applied patch does not increase 
|      |                   |            | the total number of release audit
|      |                   |            | warnings.
|  +1  |       whitespace  |  0m 0s     | The patch has no lines that end in 
|      |                   |            | whitespace.
|      |                   |  0m 18s    | 


|| Subsystem || Report/Notes ||
============================================================================
| Patch URL | http://issues.apache.org/jira/secure/attachment/12730144/YARN-3018-3.patch |
| Optional Tests |  |
| git revision | trunk / bb9ddef |
| Java | 1.7.0_55 |
| uname | Linux asf905.gq1.ygridcore.net 3.13.0-36-lowlatency #63-Ubuntu SMP PREEMPT Wed Sep 3 21:56:12 UTC 2014 x86_64 x86_64 x86_64 GNU/Linux |


============================================================================
============================================================================
                          Adding comment to JIRA
============================================================================
============================================================================


Comment added.
ca25b273f341dd5ff85de48857e3c794de0834ed logged out


============================================================================
============================================================================
                              Finished build.
============================================================================
============================================================================


Archiving artifacts
Sending artifact delta relative to PreCommit-YARN-Build #7681
Archived 4 artifacts
Archive block size is 32768
Received 2 blocks and 1511888 bytes
Compression is 4.2%
Took 2 sec
Description set: YARN-3018
Recording test results
No test report files were found. Configuration error?
Build step 'Publish JUnit test result report' changed build result to FAILURE
Email was triggered for: Failure
Sending email for trigger: Failure



###################################################################################
############################## FAILED TESTS (if any) ##############################
No tests ran.

Failed: YARN-3018 PreCommit Build #7684

Posted by Apache Jenkins Server <je...@builds.apache.org>.
Jira: https://issues.apache.org/jira/browse/YARN-3018
Build: https://builds.apache.org/job/PreCommit-YARN-Build/7684/

###################################################################################
########################## LAST 60 LINES OF THE CONSOLE ###########################
[...truncated 56 lines...]
  <property>
    <name>yarn.scheduler.capacity.node-locality-delay</name>
    <value>40</value>
    <description>
      Number of missed scheduling opportunities after which the CapacityScheduler
      attempts to schedule rack-local containers.
      Typically this should be set to number of nodes in the cluster, By default is setting
      approximately number of nodes in one rack which is 40.
    </description>
  </property>


error: patch failed: hadoop-yarn-project/hadoop-yarn/hadoop-yarn-server/hadoop-yarn-server-resourcemanager/conf/capacity-scheduler.xml:99
error: hadoop-yarn-project/hadoop-yarn/hadoop-yarn-server/hadoop-yarn-server-resourcemanager/conf/capacity-scheduler.xml: patch does not apply
PATCH APPLICATION FAILED

Elapsed time:   0m  0s



-1 overall

| Vote |    Subsystem |  Runtime   | Comment
============================================================================
|  -1  |       patch  |  0m 0s     | The patch command could not apply the 
|      |              |            | patch during dryrun.


|| Subsystem || Report/Notes ||
============================================================================
| Patch URL | http://issues.apache.org/jira/secure/attachment/12730139/YARN-3018-2.patch |
| Optional Tests |  |
| git revision | trunk / bb9ddef |


============================================================================
============================================================================
                          Adding comment to JIRA
============================================================================
============================================================================


Comment added.
fef733f2dc68ff064edb3bc0a4643c095e352e85 logged out


============================================================================
============================================================================
                              Finished build.
============================================================================
============================================================================


Build step 'Execute shell' marked build as failure
Archiving artifacts
[description-setter] Could not determine description.
Recording test results
Email was triggered for: Failure
Sending email for trigger: Failure



###################################################################################
############################## FAILED TESTS (if any) ##############################
No tests ran.

Failed: YARN-3018 PreCommit Build #7683

Posted by Apache Jenkins Server <je...@builds.apache.org>.
Jira: https://issues.apache.org/jira/browse/YARN-3018
Build: https://builds.apache.org/job/PreCommit-YARN-Build/7683/

###################################################################################
########################## LAST 60 LINES OF THE CONSOLE ###########################
[...truncated 157 lines...]


-1 overall

| Vote |         Subsystem |  Runtime   | Comment
============================================================================
|   0  |        pre-patch  |  0m 0s     | Pre-patch trunk compilation is 
|      |                   |            | healthy.
|  +1  |          @author  |  0m 0s     | The patch does not contain any 
|      |                   |            | @author tags.
|  +1  |    release audit  |  0m 14s    | The applied patch does not increase 
|      |                   |            | the total number of release audit
|      |                   |            | warnings.
|  -1  |       whitespace  |  0m 0s     | The patch has 2 line(s) that end in 
|      |                   |            | whitespace. Use git apply
|      |                   |            | --whitespace=fix.
|      |                   |  0m 19s    | 


|| Subsystem || Report/Notes ||
============================================================================
| Patch URL | http://issues.apache.org/jira/secure/attachment/12730124/YARN-3018-1.patch |
| Optional Tests |  |
| git revision | trunk / 3ba1836 |
| whitespace | /home/jenkins/jenkins-slave/workspace/PreCommit-YARN-Build/../patchprocess/whitespace.txt |
| Java | 1.7.0_55 |
| uname | Linux asf905.gq1.ygridcore.net 3.13.0-36-lowlatency #63-Ubuntu SMP PREEMPT Wed Sep 3 21:56:12 UTC 2014 x86_64 x86_64 x86_64 GNU/Linux |


============================================================================
============================================================================
                          Adding comment to JIRA
============================================================================
============================================================================


Comment added.
6fdbfada783d6eeae201e98109fe74beca6b0f7c logged out


============================================================================
============================================================================
                              Finished build.
============================================================================
============================================================================


Build step 'Execute shell' marked build as failure
Archiving artifacts
Sending artifact delta relative to PreCommit-YARN-Build #7681
Archived 4 artifacts
Archive block size is 32768
Received 2 blocks and 1512263 bytes
Compression is 4.2%
Took 0.48 sec
Description set: MAPREDUCE-5905
Recording test results
Email was triggered for: Failure
Sending email for trigger: Failure



###################################################################################
############################## FAILED TESTS (if any) ##############################
No tests ran.