You are viewing a plain text version of this content. The canonical link for it is here.
Posted to issues@tez.apache.org by Apache Jenkins Server <je...@builds.apache.org> on 2015/02/04 14:43:21 UTC

Failed: TEZ-2023 PreCommit Build #120

Jira: https://issues.apache.org/jira/browse/TEZ-2023
Build: https://builds.apache.org/job/PreCommit-TEZ-Build/120/

###################################################################################
########################## LAST 60 LINES OF THE CONSOLE ###########################
[...truncated 2597 lines...]



{color:red}-1 overall{color}.  Here are the results of testing the latest attachment
  http://issues.apache.org/jira/secure/attachment/12696453/TEZ-2023.4.patch
  against master revision cfa637a.

    {color:green}+1 @author{color}.  The patch does not contain any @author tags.

    {color:red}-1 tests included{color}.  The patch doesn't appear to include any new or modified tests.
                        Please justify why no new tests are needed for this patch.
                        Also please list what manual steps were performed to verify this patch.

    {color:green}+1 javac{color}.  The applied patch does not increase the total number of javac compiler warnings.

    {color:green}+1 javadoc{color}.  There were no new javadoc warning messages.

    {color:green}+1 findbugs{color}.  The patch does not introduce any new Findbugs (version 2.0.3) warnings.

    {color:green}+1 release audit{color}.  The applied patch does not increase the total number of release audit warnings.

    {color:green}+1 core tests{color}.  The patch passed unit tests in .

Test results: https://builds.apache.org/job/PreCommit-TEZ-Build/120//testReport/
Console output: https://builds.apache.org/job/PreCommit-TEZ-Build/120//console

This message is automatically generated.


======================================================================
======================================================================
    Adding comment to Jira.
======================================================================
======================================================================


Comment added.
8d65ac36f01d53a75583ef11524fe902ab176439 logged out


======================================================================
======================================================================
    Finished build.
======================================================================
======================================================================


Build step 'Execute shell' marked build as failure
Archiving artifacts
Sending artifact delta relative to PreCommit-TEZ-Build #113
Archived 41 artifacts
Archive block size is 32768
Received 4 blocks and 2498482 bytes
Compression is 5.0%
Took 1.3 sec
[description-setter] Could not determine description.
Recording test results
Email was triggered for: Failure
Sending email for trigger: Failure



###################################################################################
############################## FAILED TESTS (if any) ##############################
All tests passed

Success: TEZ-2018 PreCommit Build #122

Posted by Apache Jenkins Server <je...@builds.apache.org>.
Jira: https://issues.apache.org/jira/browse/TEZ-2018
Build: https://builds.apache.org/job/PreCommit-TEZ-Build/122/

###################################################################################
########################## LAST 60 LINES OF THE CONSOLE ###########################
[...truncated 2604 lines...]
[INFO] Final Memory: 65M/752M
[INFO] ------------------------------------------------------------------------




{color:green}+1 overall{color}.  Here are the results of testing the latest attachment
  http://issues.apache.org/jira/secure/attachment/12696491/TEZ-2018.3.patch
  against master revision cfa637a.

    {color:green}+1 @author{color}.  The patch does not contain any @author tags.

    {color:green}+1 tests included{color}.  The patch appears to include 4 new or modified test files.

    {color:green}+1 javac{color}.  The applied patch does not increase the total number of javac compiler warnings.

    {color:green}+1 javadoc{color}.  There were no new javadoc warning messages.

    {color:green}+1 findbugs{color}.  The patch does not introduce any new Findbugs (version 2.0.3) warnings.

    {color:green}+1 release audit{color}.  The applied patch does not increase the total number of release audit warnings.

    {color:green}+1 core tests{color}.  The patch passed unit tests in .

Test results: https://builds.apache.org/job/PreCommit-TEZ-Build/122//testReport/
Console output: https://builds.apache.org/job/PreCommit-TEZ-Build/122//console

This message is automatically generated.


======================================================================
======================================================================
    Adding comment to Jira.
======================================================================
======================================================================


Comment added.
cf216260775442f57939288dfc830e5db5961c05 logged out


======================================================================
======================================================================
    Finished build.
======================================================================
======================================================================


Archiving artifacts
Sending artifact delta relative to PreCommit-TEZ-Build #113
Archived 41 artifacts
Archive block size is 32768
Received 4 blocks and 2506613 bytes
Compression is 5.0%
Took 0.76 sec
Description set: TEZ-2018
Recording test results
Email was triggered for: Success
Sending email for trigger: Success



###################################################################################
############################## FAILED TESTS (if any) ##############################
All tests passed

Failed: TEZ-2018 PreCommit Build #121

Posted by Apache Jenkins Server <je...@builds.apache.org>.
Jira: https://issues.apache.org/jira/browse/TEZ-2018
Build: https://builds.apache.org/job/PreCommit-TEZ-Build/121/

###################################################################################
########################## LAST 60 LINES OF THE CONSOLE ###########################
[...truncated 2322 lines...]




{color:red}-1 overall{color}.  Here are the results of testing the latest attachment
  http://issues.apache.org/jira/secure/attachment/12696474/TEZ-2018.2.patch
  against master revision cfa637a.

    {color:green}+1 @author{color}.  The patch does not contain any @author tags.

    {color:green}+1 tests included{color}.  The patch appears to include 3 new or modified test files.

    {color:green}+1 javac{color}.  The applied patch does not increase the total number of javac compiler warnings.

    {color:green}+1 javadoc{color}.  There were no new javadoc warning messages.

    {color:green}+1 findbugs{color}.  The patch does not introduce any new Findbugs (version 2.0.3) warnings.

    {color:green}+1 release audit{color}.  The applied patch does not increase the total number of release audit warnings.

    {color:red}-1 core tests{color}.  The patch failed these unit tests in :
                   org.apache.tez.dag.app.rm.TestContainerReuse

Test results: https://builds.apache.org/job/PreCommit-TEZ-Build/121//testReport/
Console output: https://builds.apache.org/job/PreCommit-TEZ-Build/121//console

This message is automatically generated.


======================================================================
======================================================================
    Adding comment to Jira.
======================================================================
======================================================================


Comment added.
56afe98a3beaaaba6eff9eed4984b0632b59b166 logged out


======================================================================
======================================================================
    Finished build.
======================================================================
======================================================================


Build step 'Execute shell' marked build as failure
Archiving artifacts
Sending artifact delta relative to PreCommit-TEZ-Build #113
Archived 41 artifacts
Archive block size is 32768
Received 4 blocks and 2489376 bytes
Compression is 5.0%
Took 2.8 sec
[description-setter] Could not determine description.
Recording test results
Email was triggered for: Failure
Sending email for trigger: Failure



###################################################################################
############################## FAILED TESTS (if any) ##############################
7 tests failed.
REGRESSION:  org.apache.tez.dag.app.rm.TestContainerReuse.testSimpleReuse

Error Message:
null

Stack Trace:
java.lang.NullPointerException: null
	at org.apache.tez.dag.app.rm.TaskSchedulerEventHandler.getHistoryUrl(TaskSchedulerEventHandler.java:594)
	at org.apache.tez.dag.app.rm.TaskSchedulerEventHandler.<init>(TaskSchedulerEventHandler.java:119)
	at org.apache.tez.dag.app.rm.TestTaskSchedulerHelpers$TaskSchedulerEventHandlerForTest.<init>(TestTaskSchedulerHelpers.java:130)
	at org.apache.tez.dag.app.rm.TestContainerReuse.testSimpleReuse(TestContainerReuse.java:390)


REGRESSION:  org.apache.tez.dag.app.rm.TestContainerReuse.testReuseWithTaskSpecificLaunchCmdOption

Error Message:
null

Stack Trace:
java.lang.NullPointerException: null
	at org.apache.tez.dag.app.rm.TaskSchedulerEventHandler.getHistoryUrl(TaskSchedulerEventHandler.java:594)
	at org.apache.tez.dag.app.rm.TaskSchedulerEventHandler.<init>(TaskSchedulerEventHandler.java:119)
	at org.apache.tez.dag.app.rm.TestTaskSchedulerHelpers$TaskSchedulerEventHandlerForTest.<init>(TestTaskSchedulerHelpers.java:130)
	at org.apache.tez.dag.app.rm.TestContainerReuse.testReuseWithTaskSpecificLaunchCmdOption(TestContainerReuse.java:530)


REGRESSION:  org.apache.tez.dag.app.rm.TestContainerReuse.testReuseNonLocalRequest

Error Message:
null

Stack Trace:
java.lang.NullPointerException: null
	at org.apache.tez.dag.app.rm.TaskSchedulerEventHandler.getHistoryUrl(TaskSchedulerEventHandler.java:594)
	at org.apache.tez.dag.app.rm.TaskSchedulerEventHandler.<init>(TaskSchedulerEventHandler.java:119)
	at org.apache.tez.dag.app.rm.TestTaskSchedulerHelpers$TaskSchedulerEventHandlerForTest.<init>(TestTaskSchedulerHelpers.java:130)
	at org.apache.tez.dag.app.rm.TestContainerReuse.testReuseNonLocalRequest(TestContainerReuse.java:721)


REGRESSION:  org.apache.tez.dag.app.rm.TestContainerReuse.testReuseAcrossVertices

Error Message:
null

Stack Trace:
java.lang.NullPointerException: null
	at org.apache.tez.dag.app.rm.TaskSchedulerEventHandler.getHistoryUrl(TaskSchedulerEventHandler.java:594)
	at org.apache.tez.dag.app.rm.TaskSchedulerEventHandler.<init>(TaskSchedulerEventHandler.java:119)
	at org.apache.tez.dag.app.rm.TestTaskSchedulerHelpers$TaskSchedulerEventHandlerForTest.<init>(TestTaskSchedulerHelpers.java:130)
	at org.apache.tez.dag.app.rm.TestContainerReuse.testReuseAcrossVertices(TestContainerReuse.java:850)


REGRESSION:  org.apache.tez.dag.app.rm.TestContainerReuse.testReuseLocalResourcesChanged

Error Message:
null

Stack Trace:
java.lang.NullPointerException: null
	at org.apache.tez.dag.app.rm.TaskSchedulerEventHandler.getHistoryUrl(TaskSchedulerEventHandler.java:594)
	at org.apache.tez.dag.app.rm.TaskSchedulerEventHandler.<init>(TaskSchedulerEventHandler.java:119)
	at org.apache.tez.dag.app.rm.TestTaskSchedulerHelpers$TaskSchedulerEventHandlerForTest.<init>(TestTaskSchedulerHelpers.java:130)
	at org.apache.tez.dag.app.rm.TestContainerReuse.testReuseLocalResourcesChanged(TestContainerReuse.java:970)


REGRESSION:  org.apache.tez.dag.app.rm.TestContainerReuse.testDelayedReuseContainerNotAvailable

Error Message:
null

Stack Trace:
java.lang.NullPointerException: null
	at org.apache.tez.dag.app.rm.TaskSchedulerEventHandler.getHistoryUrl(TaskSchedulerEventHandler.java:594)
	at org.apache.tez.dag.app.rm.TaskSchedulerEventHandler.<init>(TaskSchedulerEventHandler.java:119)
	at org.apache.tez.dag.app.rm.TestTaskSchedulerHelpers$TaskSchedulerEventHandlerForTest.<init>(TestTaskSchedulerHelpers.java:130)
	at org.apache.tez.dag.app.rm.TestContainerReuse.testDelayedReuseContainerNotAvailable(TestContainerReuse.java:288)


REGRESSION:  org.apache.tez.dag.app.rm.TestContainerReuse.testDelayedReuseContainerBecomesAvailable

Error Message:
null

Stack Trace:
java.lang.NullPointerException: null
	at org.apache.tez.dag.app.rm.TaskSchedulerEventHandler.getHistoryUrl(TaskSchedulerEventHandler.java:594)
	at org.apache.tez.dag.app.rm.TaskSchedulerEventHandler.<init>(TaskSchedulerEventHandler.java:119)
	at org.apache.tez.dag.app.rm.TestTaskSchedulerHelpers$TaskSchedulerEventHandlerForTest.<init>(TestTaskSchedulerHelpers.java:130)
	at org.apache.tez.dag.app.rm.TestContainerReuse.testDelayedReuseContainerBecomesAvailable(TestContainerReuse.java:151)