You are viewing a plain text version of this content. The canonical link for it is here.
Posted to builds@beam.apache.org by Apache Jenkins Server <je...@builds.apache.org> on 2022/02/02 06:05:08 UTC

Build failed in Jenkins: beam_PostCommit_Go_VR_Flink #5768

See <https://ci-beam.apache.org/job/beam_PostCommit_Go_VR_Flink/5768/display/redirect?page=changes>

Changes:

[noreply] [BEAM-13574] Large Wordcount (#16455)

[noreply] [BEAM-13293] Refactor JDBC IO Go Wrapper (#16686)


------------------------------------------
[...truncated 56.15 KB...]
> Task :runners:flink:1.13:compileJava FROM-CACHE
> Task :runners:flink:1.13:classes
> Task :runners:flink:1.13:jar
> Task :runners:flink:1.13:job-server:compileJava NO-SOURCE
> Task :runners:flink:1.13:job-server:classes UP-TO-DATE
> Task :runners:direct-java:shadowJar FROM-CACHE
> Task :sdks:java:io:google-cloud-platform:compileJava FROM-CACHE
> Task :sdks:java:io:google-cloud-platform:classes UP-TO-DATE
> Task :sdks:java:io:google-cloud-platform:jar
> Task :sdks:java:extensions:sql:compileJava FROM-CACHE
> Task :sdks:java:extensions:sql:classes
> Task :sdks:java:extensions:sql:jar
> Task :sdks:java:harness:shadowJar FROM-CACHE
> Task :sdks:java:extensions:sql:zetasql:compileJava FROM-CACHE
> Task :sdks:java:extensions:sql:zetasql:classes UP-TO-DATE
> Task :sdks:java:extensions:sql:zetasql:jar
> Task :sdks:java:extensions:sql:expansion-service:compileJava FROM-CACHE
> Task :sdks:java:extensions:sql:expansion-service:classes UP-TO-DATE
> Task :sdks:java:extensions:sql:expansion-service:jar
> Task :sdks:java:container:java8:copyDockerfileDependencies
> Task :sdks:java:container:java11:copyDockerfileDependencies
> Task :sdks:java:testing:expansion-service:buildTestExpansionServiceJar FROM-CACHE

> Task :sdks:java:container:pullLicenses
INFO:root:Pulling license for 217 dependencies using 16 threads.
Traceback (most recent call last):
  File "<https://ci-beam.apache.org/job/beam_PostCommit_Go_VR_Flink/ws/src/sdks/java/container/license_scripts/pull_licenses_java.py",> line 53, in pull_from_url
    url_read = urlopen(url)
  File "/usr/lib/python3.8/urllib/request.py", line 222, in urlopen
    return opener.open(url, data, timeout)
  File "/usr/lib/python3.8/urllib/request.py", line 531, in open
    response = meth(req, response)
  File "/usr/lib/python3.8/urllib/request.py", line 640, in http_response
    response = self.parent.error(
  File "/usr/lib/python3.8/urllib/request.py", line 569, in error
    return self._call_chain(*args)
  File "/usr/lib/python3.8/urllib/request.py", line 502, in _call_chain
    result = func(*args)
  File "/usr/lib/python3.8/urllib/request.py", line 649, in http_error_default
    raise HTTPError(req.full_url, code, msg, hdrs, fp)
urllib.error.HTTPError: HTTP Error 500: Internal Server Error
ERROR:root:Invalid url for xz-1.5: https://git.tukaani.org/?p=xz-java.git;a=blob;f=COPYING;h=c1d404dc7a6f06a0437bf1055fedaa4a4c89d728;hb=9f1f97a26f090ffec6568c004a38c6534aa82b94. Retrying...

> Task :sdks:java:extensions:sql:expansion-service:shadowJar FROM-CACHE

> Task :sdks:java:container:pullLicenses
Traceback (most recent call last):
  File "<https://ci-beam.apache.org/job/beam_PostCommit_Go_VR_Flink/ws/src/sdks/java/container/license_scripts/pull_licenses_java.py",> line 53, in pull_from_url
    url_read = urlopen(url)
  File "/usr/lib/python3.8/urllib/request.py", line 222, in urlopen
    return opener.open(url, data, timeout)
  File "/usr/lib/python3.8/urllib/request.py", line 531, in open
    response = meth(req, response)
  File "/usr/lib/python3.8/urllib/request.py", line 640, in http_response
    response = self.parent.error(
  File "/usr/lib/python3.8/urllib/request.py", line 569, in error
    return self._call_chain(*args)
  File "/usr/lib/python3.8/urllib/request.py", line 502, in _call_chain
    result = func(*args)
  File "/usr/lib/python3.8/urllib/request.py", line 649, in http_error_default
    raise HTTPError(req.full_url, code, msg, hdrs, fp)
urllib.error.HTTPError: HTTP Error 500: Internal Server Error
ERROR:root:Invalid url for xz-1.5: https://git.tukaani.org/?p=xz-java.git;a=blob;f=COPYING;h=c1d404dc7a6f06a0437bf1055fedaa4a4c89d728;hb=9f1f97a26f090ffec6568c004a38c6534aa82b94. Retrying...
Traceback (most recent call last):
  File "<https://ci-beam.apache.org/job/beam_PostCommit_Go_VR_Flink/ws/src/sdks/java/container/license_scripts/pull_licenses_java.py",> line 53, in pull_from_url
    url_read = urlopen(url)
  File "/usr/lib/python3.8/urllib/request.py", line 222, in urlopen
    return opener.open(url, data, timeout)
  File "/usr/lib/python3.8/urllib/request.py", line 531, in open
    response = meth(req, response)
  File "/usr/lib/python3.8/urllib/request.py", line 640, in http_response
    response = self.parent.error(
  File "/usr/lib/python3.8/urllib/request.py", line 569, in error
    return self._call_chain(*args)
  File "/usr/lib/python3.8/urllib/request.py", line 502, in _call_chain
    result = func(*args)
  File "/usr/lib/python3.8/urllib/request.py", line 649, in http_error_default
    raise HTTPError(req.full_url, code, msg, hdrs, fp)
urllib.error.HTTPError: HTTP Error 500: Internal Server Error
ERROR:root:Invalid url for xz-1.5: https://git.tukaani.org/?p=xz-java.git;a=blob;f=COPYING;h=c1d404dc7a6f06a0437bf1055fedaa4a4c89d728;hb=9f1f97a26f090ffec6568c004a38c6534aa82b94. Retrying...
Traceback (most recent call last):
  File "<https://ci-beam.apache.org/job/beam_PostCommit_Go_VR_Flink/ws/src/sdks/java/container/license_scripts/pull_licenses_java.py",> line 53, in pull_from_url
    url_read = urlopen(url)
  File "/usr/lib/python3.8/urllib/request.py", line 222, in urlopen
    return opener.open(url, data, timeout)
  File "/usr/lib/python3.8/urllib/request.py", line 531, in open
    response = meth(req, response)
  File "/usr/lib/python3.8/urllib/request.py", line 640, in http_response
    response = self.parent.error(
  File "/usr/lib/python3.8/urllib/request.py", line 569, in error
    return self._call_chain(*args)
  File "/usr/lib/python3.8/urllib/request.py", line 502, in _call_chain
    result = func(*args)
  File "/usr/lib/python3.8/urllib/request.py", line 649, in http_error_default
    raise HTTPError(req.full_url, code, msg, hdrs, fp)
urllib.error.HTTPError: HTTP Error 500: Internal Server Error
ERROR:root:Invalid url for xz-1.5: https://git.tukaani.org/?p=xz-java.git;a=blob;f=COPYING;h=c1d404dc7a6f06a0437bf1055fedaa4a4c89d728;hb=9f1f97a26f090ffec6568c004a38c6534aa82b94. Retrying...
Traceback (most recent call last):
  File "<https://ci-beam.apache.org/job/beam_PostCommit_Go_VR_Flink/ws/src/sdks/java/container/license_scripts/pull_licenses_java.py",> line 53, in pull_from_url
    url_read = urlopen(url)
  File "/usr/lib/python3.8/urllib/request.py", line 222, in urlopen
    return opener.open(url, data, timeout)
  File "/usr/lib/python3.8/urllib/request.py", line 531, in open
    response = meth(req, response)
  File "/usr/lib/python3.8/urllib/request.py", line 640, in http_response
    response = self.parent.error(
  File "/usr/lib/python3.8/urllib/request.py", line 569, in error
    return self._call_chain(*args)
  File "/usr/lib/python3.8/urllib/request.py", line 502, in _call_chain
    result = func(*args)
  File "/usr/lib/python3.8/urllib/request.py", line 649, in http_error_default
    raise HTTPError(req.full_url, code, msg, hdrs, fp)
urllib.error.HTTPError: HTTP Error 500: Internal Server Error
ERROR:root:Invalid url for xz-1.5: https://git.tukaani.org/?p=xz-java.git;a=blob;f=COPYING;h=c1d404dc7a6f06a0437bf1055fedaa4a4c89d728;hb=9f1f97a26f090ffec6568c004a38c6534aa82b94. Retrying...

> Task :runners:flink:1.13:job-server:shadowJar FROM-CACHE

> Task :sdks:java:container:pullLicenses
Traceback (most recent call last):
  File "<https://ci-beam.apache.org/job/beam_PostCommit_Go_VR_Flink/ws/src/sdks/java/container/license_scripts/pull_licenses_java.py",> line 53, in pull_from_url
    url_read = urlopen(url)
  File "/usr/lib/python3.8/urllib/request.py", line 222, in urlopen
    return opener.open(url, data, timeout)
  File "/usr/lib/python3.8/urllib/request.py", line 531, in open
    response = meth(req, response)
  File "/usr/lib/python3.8/urllib/request.py", line 640, in http_response
    response = self.parent.error(
  File "/usr/lib/python3.8/urllib/request.py", line 569, in error
    return self._call_chain(*args)
  File "/usr/lib/python3.8/urllib/request.py", line 502, in _call_chain
    result = func(*args)
  File "/usr/lib/python3.8/urllib/request.py", line 649, in http_error_default
    raise HTTPError(req.full_url, code, msg, hdrs, fp)
urllib.error.HTTPError: HTTP Error 500: Internal Server Error
ERROR:root:Invalid url for xz-1.5: https://git.tukaani.org/?p=xz-java.git;a=blob;f=COPYING;h=c1d404dc7a6f06a0437bf1055fedaa4a4c89d728;hb=9f1f97a26f090ffec6568c004a38c6534aa82b94. Retrying...
Traceback (most recent call last):
  File "<https://ci-beam.apache.org/job/beam_PostCommit_Go_VR_Flink/ws/src/sdks/java/container/license_scripts/pull_licenses_java.py",> line 53, in pull_from_url
    url_read = urlopen(url)
  File "/usr/lib/python3.8/urllib/request.py", line 222, in urlopen
    return opener.open(url, data, timeout)
  File "/usr/lib/python3.8/urllib/request.py", line 531, in open
    response = meth(req, response)
  File "/usr/lib/python3.8/urllib/request.py", line 640, in http_response
    response = self.parent.error(
  File "/usr/lib/python3.8/urllib/request.py", line 569, in error
    return self._call_chain(*args)
  File "/usr/lib/python3.8/urllib/request.py", line 502, in _call_chain
    result = func(*args)
  File "/usr/lib/python3.8/urllib/request.py", line 649, in http_error_default
    raise HTTPError(req.full_url, code, msg, hdrs, fp)
urllib.error.HTTPError: HTTP Error 500: Internal Server Error
ERROR:root:Invalid url for xz-1.5: https://git.tukaani.org/?p=xz-java.git;a=blob;f=COPYING;h=c1d404dc7a6f06a0437bf1055fedaa4a4c89d728;hb=9f1f97a26f090ffec6568c004a38c6534aa82b94. Retrying...
Traceback (most recent call last):
  File "<https://ci-beam.apache.org/job/beam_PostCommit_Go_VR_Flink/ws/src/sdks/java/container/license_scripts/pull_licenses_java.py",> line 53, in pull_from_url
    url_read = urlopen(url)
  File "/usr/lib/python3.8/urllib/request.py", line 222, in urlopen
    return opener.open(url, data, timeout)
  File "/usr/lib/python3.8/urllib/request.py", line 531, in open
    response = meth(req, response)
  File "/usr/lib/python3.8/urllib/request.py", line 640, in http_response
    response = self.parent.error(
  File "/usr/lib/python3.8/urllib/request.py", line 569, in error
    return self._call_chain(*args)
  File "/usr/lib/python3.8/urllib/request.py", line 502, in _call_chain
    result = func(*args)
  File "/usr/lib/python3.8/urllib/request.py", line 649, in http_error_default
    raise HTTPError(req.full_url, code, msg, hdrs, fp)
urllib.error.HTTPError: HTTP Error 500: Internal Server Error
ERROR:root:Invalid url for xz-1.5: https://git.tukaani.org/?p=xz-java.git;a=blob;f=COPYING;h=c1d404dc7a6f06a0437bf1055fedaa4a4c89d728;hb=9f1f97a26f090ffec6568c004a38c6534aa82b94. Retrying...
Traceback (most recent call last):
  File "<https://ci-beam.apache.org/job/beam_PostCommit_Go_VR_Flink/ws/src/sdks/java/container/license_scripts/pull_licenses_java.py",> line 53, in pull_from_url
    url_read = urlopen(url)
  File "/usr/lib/python3.8/urllib/request.py", line 222, in urlopen
    return opener.open(url, data, timeout)
  File "/usr/lib/python3.8/urllib/request.py", line 531, in open
    response = meth(req, response)
  File "/usr/lib/python3.8/urllib/request.py", line 640, in http_response
    response = self.parent.error(
  File "/usr/lib/python3.8/urllib/request.py", line 569, in error
    return self._call_chain(*args)
  File "/usr/lib/python3.8/urllib/request.py", line 502, in _call_chain
    result = func(*args)
  File "/usr/lib/python3.8/urllib/request.py", line 649, in http_error_default
    raise HTTPError(req.full_url, code, msg, hdrs, fp)
urllib.error.HTTPError: HTTP Error 500: Internal Server Error
ERROR:root:Invalid url for xz-1.5: https://git.tukaani.org/?p=xz-java.git;a=blob;f=COPYING;h=c1d404dc7a6f06a0437bf1055fedaa4a4c89d728;hb=9f1f97a26f090ffec6568c004a38c6534aa82b94 after 9 retries.
ERROR:root:['xz-1.5']
ERROR:root:**************************************** Licenses were not able to be pulled automatically for some dependencies. Please search source code of the dependencies on the internet and add "license" and "notice" (if available) field to <https://ci-beam.apache.org/job/beam_PostCommit_Go_VR_Flink/ws/src/sdks/java/container/license_scripts/dep_urls_java.yaml> for each missing license. Dependency List: [xz-1.5]
INFO:root:pull_licenses_java.py failed. It took 49.105121 seconds with 16 threads.
Traceback (most recent call last):
  File "<https://ci-beam.apache.org/job/beam_PostCommit_Go_VR_Flink/ws/src/sdks/java/container/license_scripts/pull_licenses_java.py",> line 314, in <module>
    raise RuntimeError('{n} error(s) occurred.'.format(n=len(error_msg)),
RuntimeError: ('1 error(s) occurred.', ['**************************************** Licenses were not able to be pulled automatically for some dependencies. Please search source code of the dependencies on the internet and add "license" and "notice" (if available) field to <https://ci-beam.apache.org/job/beam_PostCommit_Go_VR_Flink/ws/src/sdks/java/container/license_scripts/dep_urls_java.yaml> for each missing license. Dependency List: [xz-1.5]'])

> Task :sdks:java:container:pullLicenses FAILED

> Task :release:go-licenses:java:dockerRun
+ go-licenses save github.com/apache/beam/sdks/java/container --save_path=/output/licenses

> Task :release:go-licenses:go:dockerRun
+ go-licenses save github.com/apache/beam/sdks/go/container --save_path=/output/licenses
+ go-licenses csv github.com/apache/beam/sdks/go/container
+ tee /output/licenses/list.csv
+ chmod -R a+w /output/licenses

> Task :release:go-licenses:go:createLicenses
> Task :sdks:go:container:copyGolangLicenses

> Task :release:go-licenses:java:dockerRun
+ go-licenses csv github.com/apache/beam/sdks/java/container
+ tee /output/licenses/list.csv
+ chmod -R a+w /output/licenses

> Task :sdks:go:container:dockerPrepare
> Task :release:go-licenses:java:createLicenses
> Task :sdks:java:container:java11:copyGolangLicenses
> Task :sdks:java:container:java8:copyGolangLicenses
> Task :sdks:go:container:docker

FAILURE: Build failed with an exception.

* What went wrong:
Execution failed for task ':sdks:java:container:pullLicenses'.
> Process 'command './license_scripts/license_script.sh'' finished with non-zero exit value 1

* Try:
> Run with --stacktrace option to get the stack trace.
> Run with --info or --debug option to get more log output.
> Run with --scan to get full insights.

* Get more help at https://help.gradle.org

Deprecated Gradle features were used in this build, making it incompatible with Gradle 8.0.

You can use '--warning-mode all' to show the individual deprecation warnings and determine if they come from your own scripts or plugins.

See https://docs.gradle.org/7.3.2/userguide/command_line_interface.html#sec:command_line_warnings

Execution optimizations have been disabled for 2 invalid unit(s) of work during this build to ensure correctness.
Please consult deprecation warnings for more details.

BUILD FAILED in 4m 36s
161 actionable tasks: 107 executed, 47 from cache, 7 up-to-date

Publishing build scan...
https://gradle.com/s/et3x3azp6kv3e

Build step 'Invoke Gradle script' changed build result to FAILURE
Build step 'Invoke Gradle script' marked build as failure

---------------------------------------------------------------------
To unsubscribe, e-mail: builds-unsubscribe@beam.apache.org
For additional commands, e-mail: builds-help@beam.apache.org


Jenkins build is back to normal : beam_PostCommit_Go_VR_Flink #5770

Posted by Apache Jenkins Server <je...@builds.apache.org>.
See <https://ci-beam.apache.org/job/beam_PostCommit_Go_VR_Flink/5770/display/redirect?page=changes>


---------------------------------------------------------------------
To unsubscribe, e-mail: builds-unsubscribe@beam.apache.org
For additional commands, e-mail: builds-help@beam.apache.org


Build failed in Jenkins: beam_PostCommit_Go_VR_Flink #5769

Posted by Apache Jenkins Server <je...@builds.apache.org>.
See <https://ci-beam.apache.org/job/beam_PostCommit_Go_VR_Flink/5769/display/redirect?page=changes>

Changes:

[noreply] Edit license script for Java, add manual licenses for xz (#16692)


------------------------------------------
[...truncated 5.28 MB...]
      "labels": {
        "PTRANSFORM": "passert.Equals/passert.failIfBadEntries"
      }
    }, {
      "urn": "beam:metric:pardo_execution_time:start_bundle_msecs:v1",
      "type": "beam:metrics:sum_int64:v1",
      "payload": "yAE=",
      "labels": {
        "PTRANSFORM": "passert.Equals/passert.failIfBadEntries"
      }
    }, {
      "urn": "beam:metric:pardo_execution_time:process_bundle_msecs:v1",
      "type": "beam:metrics:sum_int64:v1",
      "payload": "AA==",
      "labels": {
        "PTRANSFORM": "passert.Equals/passert.failIfBadEntries"
      }
    }, {
      "urn": "beam:metric:pardo_execution_time:finish_bundle_msecs:v1",
      "type": "beam:metrics:sum_int64:v1",
      "payload": "AA==",
      "labels": {
        "PTRANSFORM": "passert.Equals/passert.failIfBadEntries"
      }
    }, {
      "urn": "beam:metric:element_count:v1",
      "type": "beam:metrics:sum_int64:v1",
      "payload": "AQ==",
      "labels": {
        "PCOLLECTION": "n14"
      }
    }, {
      "urn": "beam:metric:sampled_byte_size:v1",
      "type": "beam:metrics:distribution_int64:v1",
      "payload": "AQEBAQ==",
      "labels": {
        "PCOLLECTION": "n14"
      }
    }, {
      "urn": "beam:metric:ptransform_execution_time:total_msecs:v1",
      "type": "beam:metrics:sum_int64:v1",
      "payload": "yAE=",
      "labels": {
        "PTRANSFORM": "beam.addFixedKeyFn"
      }
    }, {
      "urn": "beam:metric:pardo_execution_time:start_bundle_msecs:v1",
      "type": "beam:metrics:sum_int64:v1",
      "payload": "AA==",
      "labels": {
        "PTRANSFORM": "beam.createFn"
      }
    }, {
      "urn": "beam:metric:element_count:v1",
      "type": "beam:metrics:sum_int64:v1",
      "payload": "AQ==",
      "labels": {
        "PCOLLECTION": "n1"
      }
    }, {
      "urn": "beam:metric:element_count:v1",
      "type": "beam:metrics:sum_int64:v1",
      "payload": "BA==",
      "labels": {
        "PCOLLECTION": "n3"
      }
    }, {
      "urn": "beam:metric:ptransform_execution_time:total_msecs:v1",
      "type": "beam:metrics:sum_int64:v1",
      "payload": "AA==",
      "labels": {
        "PTRANSFORM": "beam.createFn"
      }
    }, {
      "urn": "beam:metric:pardo_execution_time:finish_bundle_msecs:v1",
      "type": "beam:metrics:sum_int64:v1",
      "payload": "AA==",
      "labels": {
        "PTRANSFORM": "beam.addFixedKeyFn"
      }
    }, {
      "urn": "beam:metric:element_count:v1",
      "type": "beam:metrics:sum_int64:v1",
      "payload": "BA==",
      "labels": {
        "PCOLLECTION": "n2"
      }
    }, {
      "urn": "beam:metric:pardo_execution_time:process_bundle_msecs:v1",
      "type": "beam:metrics:sum_int64:v1",
      "payload": "AA==",
      "labels": {
        "PTRANSFORM": "beam.createFn"
      }
    }, {
      "urn": "beam:metric:pardo_execution_time:start_bundle_msecs:v1",
      "type": "beam:metrics:sum_int64:v1",
      "payload": "yAE=",
      "labels": {
        "PTRANSFORM": "beam.addFixedKeyFn"
      }
    }, {
      "urn": "beam:metric:pardo_execution_time:finish_bundle_msecs:v1",
      "type": "beam:metrics:sum_int64:v1",
      "payload": "AA==",
      "labels": {
        "PTRANSFORM": "beam.createFn"
      }
    }, {
      "urn": "beam:metric:pardo_execution_time:process_bundle_msecs:v1",
      "type": "beam:metrics:sum_int64:v1",
      "payload": "AA==",
      "labels": {
        "PTRANSFORM": "beam.addFixedKeyFn"
      }
    }, {
      "urn": "beam:metric:data_channel:read_index:v1",
      "type": "beam:metrics:sum_int64:v1",
      "payload": "AQ==",
      "labels": {
        "PTRANSFORM": "fn/read/n1:0"
      }
    }, {
      "urn": "beam:metric:sampled_byte_size:v1",
      "type": "beam:metrics:distribution_int64:v1",
      "payload": "AQEBAQ==",
      "labels": {
        "PCOLLECTION": "n1"
      }
    }, {
      "urn": "beam:metric:sampled_byte_size:v1",
      "type": "beam:metrics:distribution_int64:v1",
      "payload": "BEQREQ==",
      "labels": {
        "PCOLLECTION": "n3"
      }
    }, {
      "urn": "beam:metric:sampled_byte_size:v1",
      "type": "beam:metrics:distribution_int64:v1",
      "payload": "BAgCAg==",
      "labels": {
        "PCOLLECTION": "n2"
      }
    }]
  }
}
Feb 02, 2022 12:12:24 PM org.apache.flink.runtime.taskexecutor.TaskExecutor$JobLeaderListenerImpl jobManagerLostLeadership
INFO: JobManager for job 043ebd2ee8c0df499cfb669621b7b981 with leader id ad13d22ab6229204c1758368224a48d3 lost leadership.
Feb 02, 2022 12:12:24 PM org.apache.flink.runtime.taskexecutor.DefaultJobLeaderService stop
INFO: Stop job leader service.
Feb 02, 2022 12:12:24 PM org.apache.flink.runtime.state.TaskExecutorLocalStateStoresManager shutdown
INFO: Shutting down TaskExecutorLocalStateStoresManager.
2022/02/02 12:12:24 Job state: DONE
Feb 02, 2022 12:12:24 PM org.apache.flink.runtime.io.disk.FileChannelManagerImpl lambda$getFileCloser$0
INFO: FileChannelManager removed spill file directory /tmp/flink-io-1d7cf00c-590e-44b0-a227-29a2398ed1c0
Feb 02, 2022 12:12:24 PM org.apache.beam.runners.jobsubmission.InMemoryJobService getJobMetrics
INFO: Getting job metrics for go0testemitpardoaftergbk-jenkins-0202121212-b62917c5_ef861ec2-4c63-4153-b873-9b39c0bfff6d
Feb 02, 2022 12:12:24 PM org.apache.flink.runtime.io.network.NettyShuffleEnvironment close
INFO: Shutting down the network environment and its components.
Feb 02, 2022 12:12:24 PM org.apache.beam.runners.jobsubmission.InMemoryJobService getJobMetrics
INFO: Finished getting job metrics for go0testemitpardoaftergbk-jenkins-0202121212-b62917c5_ef861ec2-4c63-4153-b873-9b39c0bfff6d
Feb 02, 2022 12:12:24 PM org.apache.flink.runtime.io.disk.FileChannelManagerImpl lambda$getFileCloser$0
INFO: FileChannelManager removed spill file directory /tmp/flink-netty-shuffle-308e3620-f6a7-4393-a471-5376de4fcff8
Feb 02, 2022 12:12:24 PM org.apache.flink.runtime.taskexecutor.KvStateService shutdown
INFO: Shutting down the kvState service and its components.
Feb 02, 2022 12:12:24 PM org.apache.flink.runtime.taskexecutor.DefaultJobLeaderService stop
INFO: Stop job leader service.
Feb 02, 2022 12:12:24 PM org.apache.flink.runtime.webmonitor.WebMonitorEndpoint lambda$shutDownInternal$5
INFO: Removing cache directory /tmp/flink-web-ui
Feb 02, 2022 12:12:24 PM org.apache.flink.runtime.filecache.FileCache shutdown
INFO: removed file cache directory /tmp/flink-dist-cache-e79068c9-5548-4ebd-8b3f-3c227b1ba535
Feb 02, 2022 12:12:24 PM org.apache.flink.runtime.rest.RestServerEndpoint lambda$closeAsync$1
INFO: Shut down complete.
Feb 02, 2022 12:12:24 PM org.apache.flink.runtime.taskexecutor.TaskExecutor handleOnStopException
INFO: Stopped TaskExecutor akka://flink/user/rpc/taskmanager_120.
Feb 02, 2022 12:12:24 PM org.apache.flink.runtime.resourcemanager.ResourceManager deregisterApplication
INFO: Shut down cluster because application is in CANCELED, diagnostics DispatcherResourceManagerComponent has been closed..
Feb 02, 2022 12:12:24 PM org.apache.flink.runtime.entrypoint.component.DispatcherResourceManagerComponent closeAsyncInternal
INFO: Closing components.
Feb 02, 2022 12:12:24 PM org.apache.flink.runtime.dispatcher.runner.AbstractDispatcherLeaderProcess closeInternal
INFO: Stopping SessionDispatcherLeaderProcess.
Feb 02, 2022 12:12:24 PM org.apache.flink.runtime.dispatcher.Dispatcher onStop
INFO: Stopping dispatcher akka://flink/user/rpc/dispatcher_122.
Feb 02, 2022 12:12:24 PM org.apache.flink.runtime.dispatcher.Dispatcher terminateRunningJobs
INFO: Stopping all currently running jobs of dispatcher akka://flink/user/rpc/dispatcher_122.
Feb 02, 2022 12:12:24 PM org.apache.flink.runtime.resourcemanager.slotmanager.DeclarativeSlotManager close
INFO: Closing the slot manager.
Feb 02, 2022 12:12:24 PM org.apache.flink.runtime.resourcemanager.slotmanager.DeclarativeSlotManager suspend
INFO: Suspending the slot manager.
Feb 02, 2022 12:12:24 PM org.apache.flink.runtime.dispatcher.Dispatcher lambda$onStop$0
INFO: Stopped dispatcher akka://flink/user/rpc/dispatcher_122.
--- PASS: TestEmitParDoAfterGBK (14.06s)
PASS
Feb 02, 2022 12:12:24 PM org.apache.flink.runtime.rpc.akka.AkkaRpcService stopService
INFO: Stopping Akka RPC service.
ok  	github.com/apache/beam/sdks/v2/go/test/regression	69.933s
Feb 02, 2022 12:12:24 PM org.apache.flink.runtime.rpc.akka.AkkaRpcService stopService
INFO: Stopping Akka RPC service.
Feb 02, 2022 12:12:24 PM org.apache.flink.runtime.rpc.akka.AkkaRpcService lambda$stopService$7
INFO: Stopped Akka RPC service.
FAIL
Feb 02, 2022 12:12:24 PM org.apache.flink.runtime.blob.AbstractBlobCache close
INFO: Shutting down BLOB cache
Feb 02, 2022 12:12:24 PM org.apache.flink.runtime.blob.AbstractBlobCache close
INFO: Shutting down BLOB cache
Feb 02, 2022 12:12:24 PM org.apache.flink.runtime.blob.BlobServer close
INFO: Stopped BLOB server at 0.0.0.0:33823
Feb 02, 2022 12:12:24 PM org.apache.flink.runtime.rpc.akka.AkkaRpcService lambda$stopService$7
INFO: Stopped Akka RPC service.
$ TEST_EXIT_CODE=0
$ cd ../..
$ exit 1
$ exit 1

> Task :sdks:go:test:flinkValidatesRunner FAILED

FAILURE: Build failed with an exception.

* Where:
Build file '<https://ci-beam.apache.org/job/beam_PostCommit_Go_VR_Flink/ws/src/sdks/go/test/build.gradle'> line: 64

* What went wrong:
Execution failed for task ':sdks:go:test:flinkValidatesRunner'.
> Process 'command 'sh'' finished with non-zero exit value 1

* Try:
> Run with --stacktrace option to get the stack trace.
> Run with --info or --debug option to get more log output.
> Run with --scan to get full insights.

* Get more help at https://help.gradle.org

Deprecated Gradle features were used in this build, making it incompatible with Gradle 8.0.

You can use '--warning-mode all' to show the individual deprecation warnings and determine if they come from your own scripts or plugins.

See https://docs.gradle.org/7.3.2/userguide/command_line_interface.html#sec:command_line_warnings

Execution optimizations have been disabled for 2 invalid unit(s) of work during this build to ensure correctness.
Please consult deprecation warnings for more details.

BUILD FAILED in 11m 58s
168 actionable tasks: 114 executed, 47 from cache, 7 up-to-date

Publishing build scan...
https://gradle.com/s/6bf66q2fu24aa

Build step 'Invoke Gradle script' changed build result to FAILURE
Build step 'Invoke Gradle script' marked build as failure

---------------------------------------------------------------------
To unsubscribe, e-mail: builds-unsubscribe@beam.apache.org
For additional commands, e-mail: builds-help@beam.apache.org