You are viewing a plain text version of this content. The canonical link for it is here.
Posted to dev@lucene.apache.org by Policeman Jenkins Server <je...@thetaphi.de> on 2017/07/03 17:40:10 UTC
[JENKINS-EA] Lucene-Solr-master-Linux (64bit/jdk-9-ea+175) - Build
# 20049 - Unstable!
Build: https://jenkins.thetaphi.de/job/Lucene-Solr-master-Linux/20049/
Java: 64bit/jdk-9-ea+175 -XX:-UseCompressedOops -XX:+UseConcMarkSweepGC --illegal-access=deny
1 tests failed.
FAILED: junit.framework.TestSuite.org.apache.solr.analytics.NoFacetCloudTest
Error Message:
org.apache.http.ParseException: Invalid content type:
Stack Trace:
org.apache.solr.client.solrj.SolrServerException: org.apache.http.ParseException: Invalid content type:
at __randomizedtesting.SeedInfo.seed([95492CBA12E644DB]:0)
at org.apache.solr.client.solrj.impl.LBHttpSolrClient.doRequest(LBHttpSolrClient.java:510)
at org.apache.solr.client.solrj.impl.LBHttpSolrClient.request(LBHttpSolrClient.java:400)
at org.apache.solr.client.solrj.impl.CloudSolrClient.sendRequest(CloudSolrClient.java:1102)
at org.apache.solr.client.solrj.impl.CloudSolrClient.requestWithRetryOnStaleState(CloudSolrClient.java:843)
at org.apache.solr.client.solrj.impl.CloudSolrClient.request(CloudSolrClient.java:774)
at org.apache.solr.client.solrj.SolrRequest.process(SolrRequest.java:178)
at org.apache.solr.client.solrj.SolrRequest.process(SolrRequest.java:195)
at org.apache.solr.analytics.AbstractAnalyticsStatsCloudTest.setupCluster(AbstractAnalyticsStatsCloudTest.java:75)
at org.apache.solr.analytics.NoFacetCloudTest.populate(NoFacetCloudTest.java:62)
at java.base/jdk.internal.reflect.NativeMethodAccessorImpl.invoke0(Native Method)
at java.base/jdk.internal.reflect.NativeMethodAccessorImpl.invoke(NativeMethodAccessorImpl.java:62)
at java.base/jdk.internal.reflect.DelegatingMethodAccessorImpl.invoke(DelegatingMethodAccessorImpl.java:43)
at java.base/java.lang.reflect.Method.invoke(Method.java:564)
at com.carrotsearch.randomizedtesting.RandomizedRunner.invoke(RandomizedRunner.java:1713)
at com.carrotsearch.randomizedtesting.RandomizedRunner$6.evaluate(RandomizedRunner.java:847)
at com.carrotsearch.randomizedtesting.RandomizedRunner$7.evaluate(RandomizedRunner.java:863)
at com.carrotsearch.randomizedtesting.rules.StatementAdapter.evaluate(StatementAdapter.java:36)
at com.carrotsearch.randomizedtesting.rules.SystemPropertiesRestoreRule$1.evaluate(SystemPropertiesRestoreRule.java:57)
at org.apache.lucene.util.AbstractBeforeAfterRule$1.evaluate(AbstractBeforeAfterRule.java:45)
at com.carrotsearch.randomizedtesting.rules.StatementAdapter.evaluate(StatementAdapter.java:36)
at org.apache.lucene.util.TestRuleStoreClassName$1.evaluate(TestRuleStoreClassName.java:41)
at com.carrotsearch.randomizedtesting.rules.NoShadowingOrOverridesOnMethodsRule$1.evaluate(NoShadowingOrOverridesOnMethodsRule.java:40)
at com.carrotsearch.randomizedtesting.rules.NoShadowingOrOverridesOnMethodsRule$1.evaluate(NoShadowingOrOverridesOnMethodsRule.java:40)
at com.carrotsearch.randomizedtesting.rules.StatementAdapter.evaluate(StatementAdapter.java:36)
at com.carrotsearch.randomizedtesting.rules.StatementAdapter.evaluate(StatementAdapter.java:36)
at org.apache.lucene.util.TestRuleAssertionsRequired$1.evaluate(TestRuleAssertionsRequired.java:53)
at org.apache.lucene.util.TestRuleMarkFailure$1.evaluate(TestRuleMarkFailure.java:47)
at org.apache.lucene.util.TestRuleIgnoreAfterMaxFailures$1.evaluate(TestRuleIgnoreAfterMaxFailures.java:64)
at org.apache.lucene.util.TestRuleIgnoreTestSuites$1.evaluate(TestRuleIgnoreTestSuites.java:54)
at com.carrotsearch.randomizedtesting.rules.StatementAdapter.evaluate(StatementAdapter.java:36)
at com.carrotsearch.randomizedtesting.ThreadLeakControl$StatementRunner.run(ThreadLeakControl.java:368)
at java.base/java.lang.Thread.run(Thread.java:844)
Caused by: org.apache.http.ParseException: Invalid content type:
at org.apache.http.entity.ContentType.parse(ContentType.java:273)
at org.apache.solr.client.solrj.impl.HttpSolrClient.executeMethod(HttpSolrClient.java:570)
at org.apache.solr.client.solrj.impl.HttpSolrClient.request(HttpSolrClient.java:250)
at org.apache.solr.client.solrj.impl.HttpSolrClient.request(HttpSolrClient.java:239)
at org.apache.solr.client.solrj.impl.LBHttpSolrClient.doRequest(LBHttpSolrClient.java:470)
... 31 more
Build Log:
[...truncated 1692 lines...]
[junit4] JVM J1: stderr was not empty, see: /home/jenkins/workspace/Lucene-Solr-master-Linux/lucene/build/core/test/temp/junit4-J1-20170703_163120_36115652553446757838644.syserr
[junit4] >>> JVM J1 emitted unexpected output (verbatim) ----
[junit4] Java HotSpot(TM) 64-Bit Server VM warning: Option UseConcMarkSweepGC was deprecated in version 9.0 and will likely be removed in a future release.
[junit4] <<< JVM J1: EOF ----
[...truncated 3 lines...]
[junit4] JVM J2: stderr was not empty, see: /home/jenkins/workspace/Lucene-Solr-master-Linux/lucene/build/core/test/temp/junit4-J2-20170703_163120_35712330920346807623076.syserr
[junit4] >>> JVM J2 emitted unexpected output (verbatim) ----
[junit4] Java HotSpot(TM) 64-Bit Server VM warning: Option UseConcMarkSweepGC was deprecated in version 9.0 and will likely be removed in a future release.
[junit4] <<< JVM J2: EOF ----
[...truncated 9 lines...]
[junit4] JVM J0: stderr was not empty, see: /home/jenkins/workspace/Lucene-Solr-master-Linux/lucene/build/core/test/temp/junit4-J0-20170703_163120_35313460754794055575202.syserr
[junit4] >>> JVM J0 emitted unexpected output (verbatim) ----
[junit4] Java HotSpot(TM) 64-Bit Server VM warning: Option UseConcMarkSweepGC was deprecated in version 9.0 and will likely be removed in a future release.
[junit4] <<< JVM J0: EOF ----
[...truncated 288 lines...]
[junit4] JVM J1: stderr was not empty, see: /home/jenkins/workspace/Lucene-Solr-master-Linux/lucene/build/test-framework/test/temp/junit4-J1-20170703_163845_41615180822592609175969.syserr
[junit4] >>> JVM J1 emitted unexpected output (verbatim) ----
[junit4] Java HotSpot(TM) 64-Bit Server VM warning: Option UseConcMarkSweepGC was deprecated in version 9.0 and will likely be removed in a future release.
[junit4] <<< JVM J1: EOF ----
[...truncated 3 lines...]
[junit4] JVM J0: stderr was not empty, see: /home/jenkins/workspace/Lucene-Solr-master-Linux/lucene/build/test-framework/test/temp/junit4-J0-20170703_163845_4161192019586936738955.syserr
[junit4] >>> JVM J0 emitted unexpected output (verbatim) ----
[junit4] Java HotSpot(TM) 64-Bit Server VM warning: Option UseConcMarkSweepGC was deprecated in version 9.0 and will likely be removed in a future release.
[junit4] <<< JVM J0: EOF ----
[...truncated 3 lines...]
[junit4] JVM J2: stderr was not empty, see: /home/jenkins/workspace/Lucene-Solr-master-Linux/lucene/build/test-framework/test/temp/junit4-J2-20170703_163845_41811675942007450032272.syserr
[junit4] >>> JVM J2 emitted unexpected output (verbatim) ----
[junit4] Java HotSpot(TM) 64-Bit Server VM warning: Option UseConcMarkSweepGC was deprecated in version 9.0 and will likely be removed in a future release.
[junit4] <<< JVM J2: EOF ----
[...truncated 1051 lines...]
[junit4] JVM J2: stderr was not empty, see: /home/jenkins/workspace/Lucene-Solr-master-Linux/lucene/build/analysis/common/test/temp/junit4-J2-20170703_163953_3702892261798381004799.syserr
[junit4] >>> JVM J2 emitted unexpected output (verbatim) ----
[junit4] Java HotSpot(TM) 64-Bit Server VM warning: Option UseConcMarkSweepGC was deprecated in version 9.0 and will likely be removed in a future release.
[junit4] <<< JVM J2: EOF ----
[...truncated 6 lines...]
[junit4] JVM J1: stderr was not empty, see: /home/jenkins/workspace/Lucene-Solr-master-Linux/lucene/build/analysis/common/test/temp/junit4-J1-20170703_163953_37011085232617607571476.syserr
[junit4] >>> JVM J1 emitted unexpected output (verbatim) ----
[junit4] Java HotSpot(TM) 64-Bit Server VM warning: Option UseConcMarkSweepGC was deprecated in version 9.0 and will likely be removed in a future release.
[junit4] <<< JVM J1: EOF ----
[junit4] JVM J0: stderr was not empty, see: /home/jenkins/workspace/Lucene-Solr-master-Linux/lucene/build/analysis/common/test/temp/junit4-J0-20170703_163953_3702916749325866149058.syserr
[junit4] >>> JVM J0 emitted unexpected output (verbatim) ----
[junit4] Java HotSpot(TM) 64-Bit Server VM warning: Option UseConcMarkSweepGC was deprecated in version 9.0 and will likely be removed in a future release.
[junit4] <<< JVM J0: EOF ----
[...truncated 218 lines...]
[junit4] JVM J2: stderr was not empty, see: /home/jenkins/workspace/Lucene-Solr-master-Linux/lucene/build/analysis/icu/test/temp/junit4-J2-20170703_164143_1888238162390011616667.syserr
[junit4] >>> JVM J2 emitted unexpected output (verbatim) ----
[junit4] Java HotSpot(TM) 64-Bit Server VM warning: Option UseConcMarkSweepGC was deprecated in version 9.0 and will likely be removed in a future release.
[junit4] <<< JVM J2: EOF ----
[...truncated 3 lines...]
[junit4] JVM J0: stderr was not empty, see: /home/jenkins/workspace/Lucene-Solr-master-Linux/lucene/build/analysis/icu/test/temp/junit4-J0-20170703_164143_1888892228495424631059.syserr
[junit4] >>> JVM J0 emitted unexpected output (verbatim) ----
[junit4] Java HotSpot(TM) 64-Bit Server VM warning: Option UseConcMarkSweepGC was deprecated in version 9.0 and will likely be removed in a future release.
[junit4] <<< JVM J0: EOF ----
[junit4] JVM J1: stderr was not empty, see: /home/jenkins/workspace/Lucene-Solr-master-Linux/lucene/build/analysis/icu/test/temp/junit4-J1-20170703_164143_18817492690368069340084.syserr
[junit4] >>> JVM J1 emitted unexpected output (verbatim) ----
[junit4] Java HotSpot(TM) 64-Bit Server VM warning: Option UseConcMarkSweepGC was deprecated in version 9.0 and will likely be removed in a future release.
[junit4] <<< JVM J1: EOF ----
[...truncated 234 lines...]
[junit4] JVM J0: stderr was not empty, see: /home/jenkins/workspace/Lucene-Solr-master-Linux/lucene/build/analysis/kuromoji/test/temp/junit4-J0-20170703_164154_23012334823909644472755.syserr
[junit4] >>> JVM J0 emitted unexpected output (verbatim) ----
[junit4] Java HotSpot(TM) 64-Bit Server VM warning: Option UseConcMarkSweepGC was deprecated in version 9.0 and will likely be removed in a future release.
[junit4] <<< JVM J0: EOF ----
[...truncated 3 lines...]
[junit4] JVM J2: stderr was not empty, see: /home/jenkins/workspace/Lucene-Solr-master-Linux/lucene/build/analysis/kuromoji/test/temp/junit4-J2-20170703_164154_2306248336031518813154.syserr
[junit4] >>> JVM J2 emitted unexpected output (verbatim) ----
[junit4] Java HotSpot(TM) 64-Bit Server VM warning: Option UseConcMarkSweepGC was deprecated in version 9.0 and will likely be removed in a future release.
[junit4] <<< JVM J2: EOF ----
[...truncated 6 lines...]
[junit4] JVM J1: stderr was not empty, see: /home/jenkins/workspace/Lucene-Solr-master-Linux/lucene/build/analysis/kuromoji/test/temp/junit4-J1-20170703_164154_2307794727262151901771.syserr
[junit4] >>> JVM J1 emitted unexpected output (verbatim) ----
[junit4] Java HotSpot(TM) 64-Bit Server VM warning: Option UseConcMarkSweepGC was deprecated in version 9.0 and will likely be removed in a future release.
[junit4] <<< JVM J1: EOF ----
[...truncated 146 lines...]
[junit4] JVM J1: stderr was not empty, see: /home/jenkins/workspace/Lucene-Solr-master-Linux/lucene/build/analysis/morfologik/test/temp/junit4-J1-20170703_164219_8971415181166653882674.syserr
[junit4] >>> JVM J1 emitted unexpected output (verbatim) ----
[junit4] Java HotSpot(TM) 64-Bit Server VM warning: Option UseConcMarkSweepGC was deprecated in version 9.0 and will likely be removed in a future release.
[junit4] <<< JVM J1: EOF ----
[...truncated 3 lines...]
[junit4] JVM J0: stderr was not empty, see: /home/jenkins/workspace/Lucene-Solr-master-Linux/lucene/build/analysis/morfologik/test/temp/junit4-J0-20170703_164219_89716033050534337030065.syserr
[junit4] >>> JVM J0 emitted unexpected output (verbatim) ----
[junit4] Java HotSpot(TM) 64-Bit Server VM warning: Option UseConcMarkSweepGC was deprecated in version 9.0 and will likely be removed in a future release.
[junit4] <<< JVM J0: EOF ----
[...truncated 3 lines...]
[junit4] JVM J2: stderr was not empty, see: /home/jenkins/workspace/Lucene-Solr-master-Linux/lucene/build/analysis/morfologik/test/temp/junit4-J2-20170703_164219_8978113665361237927760.syserr
[junit4] >>> JVM J2 emitted unexpected output (verbatim) ----
[junit4] Java HotSpot(TM) 64-Bit Server VM warning: Option UseConcMarkSweepGC was deprecated in version 9.0 and will likely be removed in a future release.
[junit4] <<< JVM J2: EOF ----
[...truncated 158 lines...]
[junit4] JVM J0: stderr was not empty, see: /home/jenkins/workspace/Lucene-Solr-master-Linux/lucene/build/analysis/phonetic/test/temp/junit4-J0-20170703_164224_7531044215176584919777.syserr
[junit4] >>> JVM J0 emitted unexpected output (verbatim) ----
[junit4] Java HotSpot(TM) 64-Bit Server VM warning: Option UseConcMarkSweepGC was deprecated in version 9.0 and will likely be removed in a future release.
[junit4] <<< JVM J0: EOF ----
[...truncated 3 lines...]
[junit4] JVM J2: stderr was not empty, see: /home/jenkins/workspace/Lucene-Solr-master-Linux/lucene/build/analysis/phonetic/test/temp/junit4-J2-20170703_164224_7551216988736159139864.syserr
[junit4] >>> JVM J2 emitted unexpected output (verbatim) ----
[junit4] Java HotSpot(TM) 64-Bit Server VM warning: Option UseConcMarkSweepGC was deprecated in version 9.0 and will likely be removed in a future release.
[junit4] <<< JVM J2: EOF ----
[...truncated 3 lines...]
[junit4] JVM J1: stderr was not empty, see: /home/jenkins/workspace/Lucene-Solr-master-Linux/lucene/build/analysis/phonetic/test/temp/junit4-J1-20170703_164224_753548469369332899520.syserr
[junit4] >>> JVM J1 emitted unexpected output (verbatim) ----
[junit4] Java HotSpot(TM) 64-Bit Server VM warning: Option UseConcMarkSweepGC was deprecated in version 9.0 and will likely be removed in a future release.
[junit4] <<< JVM J1: EOF ----
[...truncated 145 lines...]
[junit4] JVM J1: stderr was not empty, see: /home/jenkins/workspace/Lucene-Solr-master-Linux/lucene/build/analysis/smartcn/test/temp/junit4-J1-20170703_164235_6855205287706451335060.syserr
[junit4] >>> JVM J1 emitted unexpected output (verbatim) ----
[junit4] Java HotSpot(TM) 64-Bit Server VM warning: Option UseConcMarkSweepGC was deprecated in version 9.0 and will likely be removed in a future release.
[junit4] <<< JVM J1: EOF ----
[...truncated 3 lines...]
[junit4] JVM J0: stderr was not empty, see: /home/jenkins/workspace/Lucene-Solr-master-Linux/lucene/build/analysis/smartcn/test/temp/junit4-J0-20170703_164235_6853435506490087852150.syserr
[junit4] >>> JVM J0 emitted unexpected output (verbatim) ----
[junit4] Java HotSpot(TM) 64-Bit Server VM warning: Option UseConcMarkSweepGC was deprecated in version 9.0 and will likely be removed in a future release.
[junit4] <<< JVM J0: EOF ----
[...truncated 149 lines...]
[junit4] JVM J1: stderr was not empty, see: /home/jenkins/workspace/Lucene-Solr-master-Linux/lucene/build/analysis/stempel/test/temp/junit4-J1-20170703_164245_05192034905813226372.syserr
[junit4] >>> JVM J1 emitted unexpected output (verbatim) ----
[junit4] Java HotSpot(TM) 64-Bit Server VM warning: Option UseConcMarkSweepGC was deprecated in version 9.0 and will likely be removed in a future release.
[junit4] <<< JVM J1: EOF ----
[junit4] JVM J2: stderr was not empty, see: /home/jenkins/workspace/Lucene-Solr-master-Linux/lucene/build/analysis/stempel/test/temp/junit4-J2-20170703_164245_051763981071898198262.syserr
[junit4] >>> JVM J2 emitted unexpected output (verbatim) ----
[junit4] Java HotSpot(TM) 64-Bit Server VM warning: Option UseConcMarkSweepGC was deprecated in version 9.0 and will likely be removed in a future release.
[junit4] <<< JVM J2: EOF ----
[...truncated 3 lines...]
[junit4] JVM J0: stderr was not empty, see: /home/jenkins/workspace/Lucene-Solr-master-Linux/lucene/build/analysis/stempel/test/temp/junit4-J0-20170703_164245_05112634880733964141047.syserr
[junit4] >>> JVM J0 emitted unexpected output (verbatim) ----
[junit4] Java HotSpot(TM) 64-Bit Server VM warning: Option UseConcMarkSweepGC was deprecated in version 9.0 and will likely be removed in a future release.
[junit4] <<< JVM J0: EOF ----
[...truncated 161 lines...]
[junit4] JVM J0: stderr was not empty, see: /home/jenkins/workspace/Lucene-Solr-master-Linux/lucene/build/analysis/uima/test/temp/junit4-J0-20170703_164248_23213933393720147357773.syserr
[junit4] >>> JVM J0 emitted unexpected output (verbatim) ----
[junit4] Java HotSpot(TM) 64-Bit Server VM warning: Option UseConcMarkSweepGC was deprecated in version 9.0 and will likely be removed in a future release.
[junit4] <<< JVM J0: EOF ----
[...truncated 182 lines...]
[junit4] JVM J2: stderr was not empty, see: /home/jenkins/workspace/Lucene-Solr-master-Linux/lucene/build/backward-codecs/test/temp/junit4-J2-20170703_164256_18114540517522524836127.syserr
[junit4] >>> JVM J2 emitted unexpected output (verbatim) ----
[junit4] Java HotSpot(TM) 64-Bit Server VM warning: Option UseConcMarkSweepGC was deprecated in version 9.0 and will likely be removed in a future release.
[junit4] <<< JVM J2: EOF ----
[...truncated 22 lines...]
[junit4] JVM J0: stderr was not empty, see: /home/jenkins/workspace/Lucene-Solr-master-Linux/lucene/build/backward-codecs/test/temp/junit4-J0-20170703_164256_17917501244354863878522.syserr
[junit4] >>> JVM J0 emitted unexpected output (verbatim) ----
[junit4] Java HotSpot(TM) 64-Bit Server VM warning: Option UseConcMarkSweepGC was deprecated in version 9.0 and will likely be removed in a future release.
[junit4] <<< JVM J0: EOF ----
[...truncated 9 lines...]
[junit4] JVM J1: stderr was not empty, see: /home/jenkins/workspace/Lucene-Solr-master-Linux/lucene/build/backward-codecs/test/temp/junit4-J1-20170703_164256_18114620350273312388255.syserr
[junit4] >>> JVM J1 emitted unexpected output (verbatim) ----
[junit4] Java HotSpot(TM) 64-Bit Server VM warning: Option UseConcMarkSweepGC was deprecated in version 9.0 and will likely be removed in a future release.
[junit4] <<< JVM J1: EOF ----
[...truncated 1208 lines...]
[junit4] JVM J2: stderr was not empty, see: /home/jenkins/workspace/Lucene-Solr-master-Linux/lucene/build/benchmark/test/temp/junit4-J2-20170703_164444_82514994984274062969367.syserr
[junit4] >>> JVM J2 emitted unexpected output (verbatim) ----
[junit4] Java HotSpot(TM) 64-Bit Server VM warning: Option UseConcMarkSweepGC was deprecated in version 9.0 and will likely be removed in a future release.
[junit4] <<< JVM J2: EOF ----
[...truncated 3 lines...]
[junit4] JVM J1: stderr was not empty, see: /home/jenkins/workspace/Lucene-Solr-master-Linux/lucene/build/benchmark/test/temp/junit4-J1-20170703_164444_82512896823420485069296.syserr
[junit4] >>> JVM J1 emitted unexpected output (verbatim) ----
[junit4] Java HotSpot(TM) 64-Bit Server VM warning: Option UseConcMarkSweepGC was deprecated in version 9.0 and will likely be removed in a future release.
[junit4] <<< JVM J1: EOF ----
[...truncated 3 lines...]
[junit4] JVM J0: stderr was not empty, see: /home/jenkins/workspace/Lucene-Solr-master-Linux/lucene/build/benchmark/test/temp/junit4-J0-20170703_164444_8252363381367832497055.syserr
[junit4] >>> JVM J0 emitted unexpected output (verbatim) ----
[junit4] Java HotSpot(TM) 64-Bit Server VM warning: Option UseConcMarkSweepGC was deprecated in version 9.0 and will likely be removed in a future release.
[junit4] <<< JVM J0: EOF ----
[...truncated 220 lines...]
[junit4] JVM J0: stderr was not empty, see: /home/jenkins/workspace/Lucene-Solr-master-Linux/lucene/build/classification/test/temp/junit4-J0-20170703_164452_80915310720041005120945.syserr
[junit4] >>> JVM J0 emitted unexpected output (verbatim) ----
[junit4] Java HotSpot(TM) 64-Bit Server VM warning: Option UseConcMarkSweepGC was deprecated in version 9.0 and will likely be removed in a future release.
[junit4] <<< JVM J0: EOF ----
[...truncated 3 lines...]
[junit4] JVM J1: stderr was not empty, see: /home/jenkins/workspace/Lucene-Solr-master-Linux/lucene/build/classification/test/temp/junit4-J1-20170703_164452_8094237529366471482459.syserr
[junit4] >>> JVM J1 emitted unexpected output (verbatim) ----
[junit4] Java HotSpot(TM) 64-Bit Server VM warning: Option UseConcMarkSweepGC was deprecated in version 9.0 and will likely be removed in a future release.
[junit4] <<< JVM J1: EOF ----
[...truncated 3 lines...]
[junit4] JVM J2: stderr was not empty, see: /home/jenkins/workspace/Lucene-Solr-master-Linux/lucene/build/classification/test/temp/junit4-J2-20170703_164452_8093777480375060230774.syserr
[junit4] >>> JVM J2 emitted unexpected output (verbatim) ----
[junit4] Java HotSpot(TM) 64-Bit Server VM warning: Option UseConcMarkSweepGC was deprecated in version 9.0 and will likely be removed in a future release.
[junit4] <<< JVM J2: EOF ----
[...truncated 247 lines...]
[junit4] JVM J2: stderr was not empty, see: /home/jenkins/workspace/Lucene-Solr-master-Linux/lucene/build/codecs/test/temp/junit4-J2-20170703_164502_05411837410663003712614.syserr
[junit4] >>> JVM J2 emitted unexpected output (verbatim) ----
[junit4] Java HotSpot(TM) 64-Bit Server VM warning: Option UseConcMarkSweepGC was deprecated in version 9.0 and will likely be removed in a future release.
[junit4] <<< JVM J2: EOF ----
[...truncated 3 lines...]
[junit4] JVM J1: stderr was not empty, see: /home/jenkins/workspace/Lucene-Solr-master-Linux/lucene/build/codecs/test/temp/junit4-J1-20170703_164502_05415206649687423489701.syserr
[junit4] >>> JVM J1 emitted unexpected output (verbatim) ----
[junit4] Java HotSpot(TM) 64-Bit Server VM warning: Option UseConcMarkSweepGC was deprecated in version 9.0 and will likely be removed in a future release.
[junit4] <<< JVM J1: EOF ----
[...truncated 7 lines...]
[junit4] JVM J0: stderr was not empty, see: /home/jenkins/workspace/Lucene-Solr-master-Linux/lucene/build/codecs/test/temp/junit4-J0-20170703_164502_0543611556236460779631.syserr
[junit4] >>> JVM J0 emitted unexpected output (verbatim) ----
[junit4] Java HotSpot(TM) 64-Bit Server VM warning: Option UseConcMarkSweepGC was deprecated in version 9.0 and will likely be removed in a future release.
[junit4] <<< JVM J0: EOF ----
[...truncated 223 lines...]
[junit4] JVM J1: stderr was not empty, see: /home/jenkins/workspace/Lucene-Solr-master-Linux/lucene/build/demo/test/temp/junit4-J1-20170703_164732_013639614116904060381.syserr
[junit4] >>> JVM J1 emitted unexpected output (verbatim) ----
[junit4] Java HotSpot(TM) 64-Bit Server VM warning: Option UseConcMarkSweepGC was deprecated in version 9.0 and will likely be removed in a future release.
[junit4] <<< JVM J1: EOF ----
[...truncated 6 lines...]
[junit4] JVM J2: stderr was not empty, see: /home/jenkins/workspace/Lucene-Solr-master-Linux/lucene/build/demo/test/temp/junit4-J2-20170703_164732_0132273364538251566415.syserr
[junit4] >>> JVM J2 emitted unexpected output (verbatim) ----
[junit4] Java HotSpot(TM) 64-Bit Server VM warning: Option UseConcMarkSweepGC was deprecated in version 9.0 and will likely be removed in a future release.
[junit4] <<< JVM J2: EOF ----
[junit4] JVM J0: stderr was not empty, see: /home/jenkins/workspace/Lucene-Solr-master-Linux/lucene/build/demo/test/temp/junit4-J0-20170703_164732_01315776537447701552160.syserr
[junit4] >>> JVM J0 emitted unexpected output (verbatim) ----
[junit4] Java HotSpot(TM) 64-Bit Server VM warning: Option UseConcMarkSweepGC was deprecated in version 9.0 and will likely be removed in a future release.
[junit4] <<< JVM J0: EOF ----
[...truncated 162 lines...]
[junit4] JVM J2: stderr was not empty, see: /home/jenkins/workspace/Lucene-Solr-master-Linux/lucene/build/expressions/test/temp/junit4-J2-20170703_164734_7886755052491473630348.syserr
[junit4] >>> JVM J2 emitted unexpected output (verbatim) ----
[junit4] Java HotSpot(TM) 64-Bit Server VM warning: Option UseConcMarkSweepGC was deprecated in version 9.0 and will likely be removed in a future release.
[junit4] <<< JVM J2: EOF ----
[junit4] JVM J1: stderr was not empty, see: /home/jenkins/workspace/Lucene-Solr-master-Linux/lucene/build/expressions/test/temp/junit4-J1-20170703_164734_7886113284439098661241.syserr
[junit4] >>> JVM J1 emitted unexpected output (verbatim) ----
[junit4] Java HotSpot(TM) 64-Bit Server VM warning: Option UseConcMarkSweepGC was deprecated in version 9.0 and will likely be removed in a future release.
[junit4] <<< JVM J1: EOF ----
[...truncated 6 lines...]
[junit4] JVM J0: stderr was not empty, see: /home/jenkins/workspace/Lucene-Solr-master-Linux/lucene/build/expressions/test/temp/junit4-J0-20170703_164734_78815828785156672141067.syserr
[junit4] >>> JVM J0 emitted unexpected output (verbatim) ----
[junit4] Java HotSpot(TM) 64-Bit Server VM warning: Option UseConcMarkSweepGC was deprecated in version 9.0 and will likely be removed in a future release.
[junit4] <<< JVM J0: EOF ----
[...truncated 209 lines...]
[junit4] JVM J1: stderr was not empty, see: /home/jenkins/workspace/Lucene-Solr-master-Linux/lucene/build/facet/test/temp/junit4-J1-20170703_164739_61915094709274984875335.syserr
[junit4] >>> JVM J1 emitted unexpected output (verbatim) ----
[junit4] Java HotSpot(TM) 64-Bit Server VM warning: Option UseConcMarkSweepGC was deprecated in version 9.0 and will likely be removed in a future release.
[junit4] <<< JVM J1: EOF ----
[...truncated 3 lines...]
[junit4] JVM J2: stderr was not empty, see: /home/jenkins/workspace/Lucene-Solr-master-Linux/lucene/build/facet/test/temp/junit4-J2-20170703_164739_6195965835069694011496.syserr
[junit4] >>> JVM J2 emitted unexpected output (verbatim) ----
[junit4] Java HotSpot(TM) 64-Bit Server VM warning: Option UseConcMarkSweepGC was deprecated in version 9.0 and will likely be removed in a future release.
[junit4] <<< JVM J2: EOF ----
[...truncated 3 lines...]
[junit4] JVM J0: stderr was not empty, see: /home/jenkins/workspace/Lucene-Solr-master-Linux/lucene/build/facet/test/temp/junit4-J0-20170703_164739_61917805145928775944893.syserr
[junit4] >>> JVM J0 emitted unexpected output (verbatim) ----
[junit4] Java HotSpot(TM) 64-Bit Server VM warning: Option UseConcMarkSweepGC was deprecated in version 9.0 and will likely be removed in a future release.
[junit4] <<< JVM J0: EOF ----
[...truncated 171 lines...]
[junit4] JVM J2: stderr was not empty, see: /home/jenkins/workspace/Lucene-Solr-master-Linux/lucene/build/grouping/test/temp/junit4-J2-20170703_164808_691802632149939200442.syserr
[junit4] >>> JVM J2 emitted unexpected output (verbatim) ----
[junit4] Java HotSpot(TM) 64-Bit Server VM warning: Option UseConcMarkSweepGC was deprecated in version 9.0 and will likely be removed in a future release.
[junit4] <<< JVM J2: EOF ----
[...truncated 3 lines...]
[junit4] JVM J0: stderr was not empty, see: /home/jenkins/workspace/Lucene-Solr-master-Linux/lucene/build/grouping/test/temp/junit4-J0-20170703_164808_69111813673034646956981.syserr
[junit4] >>> JVM J0 emitted unexpected output (verbatim) ----
[junit4] Java HotSpot(TM) 64-Bit Server VM warning: Option UseConcMarkSweepGC was deprecated in version 9.0 and will likely be removed in a future release.
[junit4] <<< JVM J0: EOF ----
[...truncated 3 lines...]
[junit4] JVM J1: stderr was not empty, see: /home/jenkins/workspace/Lucene-Solr-master-Linux/lucene/build/grouping/test/temp/junit4-J1-20170703_164808_6915628345909495387804.syserr
[junit4] >>> JVM J1 emitted unexpected output (verbatim) ----
[junit4] Java HotSpot(TM) 64-Bit Server VM warning: Option UseConcMarkSweepGC was deprecated in version 9.0 and will likely be removed in a future release.
[junit4] <<< JVM J1: EOF ----
[...truncated 235 lines...]
[junit4] JVM J2: stderr was not empty, see: /home/jenkins/workspace/Lucene-Solr-master-Linux/lucene/build/highlighter/test/temp/junit4-J2-20170703_164822_1066108197186176993347.syserr
[junit4] >>> JVM J2 emitted unexpected output (verbatim) ----
[junit4] Java HotSpot(TM) 64-Bit Server VM warning: Option UseConcMarkSweepGC was deprecated in version 9.0 and will likely be removed in a future release.
[junit4] <<< JVM J2: EOF ----
[...truncated 3 lines...]
[junit4] JVM J1: stderr was not empty, see: /home/jenkins/workspace/Lucene-Solr-master-Linux/lucene/build/highlighter/test/temp/junit4-J1-20170703_164822_1063951380438898350789.syserr
[junit4] >>> JVM J1 emitted unexpected output (verbatim) ----
[junit4] Java HotSpot(TM) 64-Bit Server VM warning: Option UseConcMarkSweepGC was deprecated in version 9.0 and will likely be removed in a future release.
[junit4] <<< JVM J1: EOF ----
[...truncated 3 lines...]
[junit4] JVM J0: stderr was not empty, see: /home/jenkins/workspace/Lucene-Solr-master-Linux/lucene/build/highlighter/test/temp/junit4-J0-20170703_164822_1066468760460088126811.syserr
[junit4] >>> JVM J0 emitted unexpected output (verbatim) ----
[junit4] Java HotSpot(TM) 64-Bit Server VM warning: Option UseConcMarkSweepGC was deprecated in version 9.0 and will likely be removed in a future release.
[junit4] <<< JVM J0: EOF ----
[...truncated 152 lines...]
[junit4] JVM J1: stderr was not empty, see: /home/jenkins/workspace/Lucene-Solr-master-Linux/lucene/build/join/test/temp/junit4-J1-20170703_164838_78817219657815744116108.syserr
[junit4] >>> JVM J1 emitted unexpected output (verbatim) ----
[junit4] Java HotSpot(TM) 64-Bit Server VM warning: Option UseConcMarkSweepGC was deprecated in version 9.0 and will likely be removed in a future release.
[junit4] <<< JVM J1: EOF ----
[...truncated 6 lines...]
[junit4] JVM J0: stderr was not empty, see: /home/jenkins/workspace/Lucene-Solr-master-Linux/lucene/build/join/test/temp/junit4-J0-20170703_164838_788585090042366321457.syserr
[junit4] >>> JVM J0 emitted unexpected output (verbatim) ----
[junit4] Java HotSpot(TM) 64-Bit Server VM warning: Option UseConcMarkSweepGC was deprecated in version 9.0 and will likely be removed in a future release.
[junit4] <<< JVM J0: EOF ----
[...truncated 3 lines...]
[junit4] JVM J2: stderr was not empty, see: /home/jenkins/workspace/Lucene-Solr-master-Linux/lucene/build/join/test/temp/junit4-J2-20170703_164838_7883299648202018518655.syserr
[junit4] >>> JVM J2 emitted unexpected output (verbatim) ----
[junit4] Java HotSpot(TM) 64-Bit Server VM warning: Option UseConcMarkSweepGC was deprecated in version 9.0 and will likely be removed in a future release.
[junit4] <<< JVM J2: EOF ----
[...truncated 141 lines...]
[junit4] JVM J0: stderr was not empty, see: /home/jenkins/workspace/Lucene-Solr-master-Linux/lucene/build/memory/test/temp/junit4-J0-20170703_164902_14217156509647829152558.syserr
[junit4] >>> JVM J0 emitted unexpected output (verbatim) ----
[junit4] Java HotSpot(TM) 64-Bit Server VM warning: Option UseConcMarkSweepGC was deprecated in version 9.0 and will likely be removed in a future release.
[junit4] <<< JVM J0: EOF ----
[...truncated 3 lines...]
[junit4] JVM J1: stderr was not empty, see: /home/jenkins/workspace/Lucene-Solr-master-Linux/lucene/build/memory/test/temp/junit4-J1-20170703_164902_1424618083654673010490.syserr
[junit4] >>> JVM J1 emitted unexpected output (verbatim) ----
[junit4] Java HotSpot(TM) 64-Bit Server VM warning: Option UseConcMarkSweepGC was deprecated in version 9.0 and will likely be removed in a future release.
[junit4] <<< JVM J1: EOF ----
[...truncated 170 lines...]
[junit4] JVM J2: stderr was not empty, see: /home/jenkins/workspace/Lucene-Solr-master-Linux/lucene/build/misc/test/temp/junit4-J2-20170703_164911_2705132780854148402499.syserr
[junit4] >>> JVM J2 emitted unexpected output (verbatim) ----
[junit4] Java HotSpot(TM) 64-Bit Server VM warning: Option UseConcMarkSweepGC was deprecated in version 9.0 and will likely be removed in a future release.
[junit4] <<< JVM J2: EOF ----
[...truncated 5 lines...]
[junit4] JVM J1: stderr was not empty, see: /home/jenkins/workspace/Lucene-Solr-master-Linux/lucene/build/misc/test/temp/junit4-J1-20170703_164911_27012571746501359453699.syserr
[junit4] >>> JVM J1 emitted unexpected output (verbatim) ----
[junit4] Java HotSpot(TM) 64-Bit Server VM warning: Option UseConcMarkSweepGC was deprecated in version 9.0 and will likely be removed in a future release.
[junit4] <<< JVM J1: EOF ----
[...truncated 3 lines...]
[junit4] JVM J0: stderr was not empty, see: /home/jenkins/workspace/Lucene-Solr-master-Linux/lucene/build/misc/test/temp/junit4-J0-20170703_164911_2707536720685398247079.syserr
[junit4] >>> JVM J0 emitted unexpected output (verbatim) ----
[junit4] Java HotSpot(TM) 64-Bit Server VM warning: Option UseConcMarkSweepGC was deprecated in version 9.0 and will likely be removed in a future release.
[junit4] <<< JVM J0: EOF ----
[...truncated 304 lines...]
[junit4] JVM J0: stderr was not empty, see: /home/jenkins/workspace/Lucene-Solr-master-Linux/lucene/build/queries/test/temp/junit4-J0-20170703_164929_11017836171370356720642.syserr
[junit4] >>> JVM J0 emitted unexpected output (verbatim) ----
[junit4] Java HotSpot(TM) 64-Bit Server VM warning: Option UseConcMarkSweepGC was deprecated in version 9.0 and will likely be removed in a future release.
[junit4] <<< JVM J0: EOF ----
[...truncated 3 lines...]
[junit4] JVM J2: stderr was not empty, see: /home/jenkins/workspace/Lucene-Solr-master-Linux/lucene/build/queries/test/temp/junit4-J2-20170703_164929_1108074718615912052787.syserr
[junit4] >>> JVM J2 emitted unexpected output (verbatim) ----
[junit4] Java HotSpot(TM) 64-Bit Server VM warning: Option UseConcMarkSweepGC was deprecated in version 9.0 and will likely be removed in a future release.
[junit4] <<< JVM J2: EOF ----
[...truncated 3 lines...]
[junit4] JVM J1: stderr was not empty, see: /home/jenkins/workspace/Lucene-Solr-master-Linux/lucene/build/queries/test/temp/junit4-J1-20170703_164929_11012260442485785154560.syserr
[junit4] >>> JVM J1 emitted unexpected output (verbatim) ----
[junit4] Java HotSpot(TM) 64-Bit Server VM warning: Option UseConcMarkSweepGC was deprecated in version 9.0 and will likely be removed in a future release.
[junit4] <<< JVM J1: EOF ----
[...truncated 222 lines...]
[junit4] JVM J0: stderr was not empty, see: /home/jenkins/workspace/Lucene-Solr-master-Linux/lucene/build/queryparser/test/temp/junit4-J0-20170703_164939_0034865969489602047907.syserr
[junit4] >>> JVM J0 emitted unexpected output (verbatim) ----
[junit4] Java HotSpot(TM) 64-Bit Server VM warning: Option UseConcMarkSweepGC was deprecated in version 9.0 and will likely be removed in a future release.
[junit4] <<< JVM J0: EOF ----
[junit4] JVM J2: stderr was not empty, see: /home/jenkins/workspace/Lucene-Solr-master-Linux/lucene/build/queryparser/test/temp/junit4-J2-20170703_164939_00416988788904244131219.syserr
[junit4] >>> JVM J2 emitted unexpected output (verbatim) ----
[junit4] Java HotSpot(TM) 64-Bit Server VM warning: Option UseConcMarkSweepGC was deprecated in version 9.0 and will likely be removed in a future release.
[junit4] <<< JVM J2: EOF ----
[junit4] JVM J1: stderr was not empty, see: /home/jenkins/workspace/Lucene-Solr-master-Linux/lucene/build/queryparser/test/temp/junit4-J1-20170703_164939_00316854052984765152457.syserr
[junit4] >>> JVM J1 emitted unexpected output (verbatim) ----
[junit4] Java HotSpot(TM) 64-Bit Server VM warning: Option UseConcMarkSweepGC was deprecated in version 9.0 and will likely be removed in a future release.
[junit4] <<< JVM J1: EOF ----
[...truncated 191 lines...]
[junit4] JVM J1: stderr was not empty, see: /home/jenkins/workspace/Lucene-Solr-master-Linux/lucene/build/replicator/test/temp/junit4-J1-20170703_164947_12114417428501715633323.syserr
[junit4] >>> JVM J1 emitted unexpected output (verbatim) ----
[junit4] Java HotSpot(TM) 64-Bit Server VM warning: Option UseConcMarkSweepGC was deprecated in version 9.0 and will likely be removed in a future release.
[junit4] <<< JVM J1: EOF ----
[...truncated 8 lines...]
[junit4] JVM J2: stderr was not empty, see: /home/jenkins/workspace/Lucene-Solr-master-Linux/lucene/build/replicator/test/temp/junit4-J2-20170703_164947_1218147028919295221079.syserr
[junit4] >>> JVM J2 emitted unexpected output (verbatim) ----
[junit4] Java HotSpot(TM) 64-Bit Server VM warning: Option UseConcMarkSweepGC was deprecated in version 9.0 and will likely be removed in a future release.
[junit4] <<< JVM J2: EOF ----
[...truncated 6 lines...]
[junit4] JVM J0: stderr was not empty, see: /home/jenkins/workspace/Lucene-Solr-master-Linux/lucene/build/replicator/test/temp/junit4-J0-20170703_164947_12116278193030005078354.syserr
[junit4] >>> JVM J0 emitted unexpected output (verbatim) ----
[junit4] Java HotSpot(TM) 64-Bit Server VM warning: Option UseConcMarkSweepGC was deprecated in version 9.0 and will likely be removed in a future release.
[junit4] <<< JVM J0: EOF ----
[...truncated 197 lines...]
[junit4] JVM J0: stderr was not empty, see: /home/jenkins/workspace/Lucene-Solr-master-Linux/lucene/build/sandbox/test/temp/junit4-J0-20170703_165000_488114792410339256356.syserr
[junit4] >>> JVM J0 emitted unexpected output (verbatim) ----
[junit4] Java HotSpot(TM) 64-Bit Server VM warning: Option UseConcMarkSweepGC was deprecated in version 9.0 and will likely be removed in a future release.
[junit4] <<< JVM J0: EOF ----
[...truncated 3 lines...]
[junit4] JVM J1: stderr was not empty, see: /home/jenkins/workspace/Lucene-Solr-master-Linux/lucene/build/sandbox/test/temp/junit4-J1-20170703_165000_48811832806467777249574.syserr
[junit4] >>> JVM J1 emitted unexpected output (verbatim) ----
[junit4] Java HotSpot(TM) 64-Bit Server VM warning: Option UseConcMarkSweepGC was deprecated in version 9.0 and will likely be removed in a future release.
[junit4] <<< JVM J1: EOF ----
[...truncated 7 lines...]
[junit4] JVM J2: stderr was not empty, see: /home/jenkins/workspace/Lucene-Solr-master-Linux/lucene/build/sandbox/test/temp/junit4-J2-20170703_165000_4881446067515460787947.syserr
[junit4] >>> JVM J2 emitted unexpected output (verbatim) ----
[junit4] Java HotSpot(TM) 64-Bit Server VM warning: Option UseConcMarkSweepGC was deprecated in version 9.0 and will likely be removed in a future release.
[junit4] <<< JVM J2: EOF ----
[...truncated 213 lines...]
[junit4] JVM J2: stderr was not empty, see: /home/jenkins/workspace/Lucene-Solr-master-Linux/lucene/build/spatial-extras/test/temp/junit4-J2-20170703_165038_1979192595104669077249.syserr
[junit4] >>> JVM J2 emitted unexpected output (verbatim) ----
[junit4] Java HotSpot(TM) 64-Bit Server VM warning: Option UseConcMarkSweepGC was deprecated in version 9.0 and will likely be removed in a future release.
[junit4] <<< JVM J2: EOF ----
[junit4] JVM J0: stderr was not empty, see: /home/jenkins/workspace/Lucene-Solr-master-Linux/lucene/build/spatial-extras/test/temp/junit4-J0-20170703_165038_19713308457628133384928.syserr
[junit4] >>> JVM J0 emitted unexpected output (verbatim) ----
[junit4] Java HotSpot(TM) 64-Bit Server VM warning: Option UseConcMarkSweepGC was deprecated in version 9.0 and will likely be removed in a future release.
[junit4] <<< JVM J0: EOF ----
[junit4] JVM J1: stderr was not empty, see: /home/jenkins/workspace/Lucene-Solr-master-Linux/lucene/build/spatial-extras/test/temp/junit4-J1-20170703_165038_19713071222322715290428.syserr
[junit4] >>> JVM J1 emitted unexpected output (verbatim) ----
[junit4] Java HotSpot(TM) 64-Bit Server VM warning: Option UseConcMarkSweepGC was deprecated in version 9.0 and will likely be removed in a future release.
[junit4] <<< JVM J1: EOF ----
[...truncated 140 lines...]
[junit4] JVM J0: stderr was not empty, see: /home/jenkins/workspace/Lucene-Solr-master-Linux/lucene/build/spatial/test/temp/junit4-J0-20170703_165049_57611727232585736701576.syserr
[junit4] >>> JVM J0 emitted unexpected output (verbatim) ----
[junit4] Java HotSpot(TM) 64-Bit Server VM warning: Option UseConcMarkSweepGC was deprecated in version 9.0 and will likely be removed in a future release.
[junit4] <<< JVM J0: EOF ----
[...truncated 154 lines...]
[junit4] JVM J2: stderr was not empty, see: /home/jenkins/workspace/Lucene-Solr-master-Linux/lucene/build/spatial3d/test/temp/junit4-J2-20170703_165051_3968467866502485270210.syserr
[junit4] >>> JVM J2 emitted unexpected output (verbatim) ----
[junit4] Java HotSpot(TM) 64-Bit Server VM warning: Option UseConcMarkSweepGC was deprecated in version 9.0 and will likely be removed in a future release.
[junit4] <<< JVM J2: EOF ----
[junit4] JVM J0: stderr was not empty, see: /home/jenkins/workspace/Lucene-Solr-master-Linux/lucene/build/spatial3d/test/temp/junit4-J0-20170703_165051_3965393782040978613522.syserr
[junit4] >>> JVM J0 emitted unexpected output (verbatim) ----
[junit4] Java HotSpot(TM) 64-Bit Server VM warning: Option UseConcMarkSweepGC was deprecated in version 9.0 and will likely be removed in a future release.
[junit4] <<< JVM J0: EOF ----
[...truncated 8 lines...]
[junit4] JVM J1: stderr was not empty, see: /home/jenkins/workspace/Lucene-Solr-master-Linux/lucene/build/spatial3d/test/temp/junit4-J1-20170703_165051_39613756132583122343590.syserr
[junit4] >>> JVM J1 emitted unexpected output (verbatim) ----
[junit4] Java HotSpot(TM) 64-Bit Server VM warning: Option UseConcMarkSweepGC was deprecated in version 9.0 and will likely be removed in a future release.
[junit4] <<< JVM J1: EOF ----
[...truncated 303 lines...]
[junit4] JVM J1: stderr was not empty, see: /home/jenkins/workspace/Lucene-Solr-master-Linux/lucene/build/suggest/test/temp/junit4-J1-20170703_165151_33616388088152305402358.syserr
[junit4] >>> JVM J1 emitted unexpected output (verbatim) ----
[junit4] Java HotSpot(TM) 64-Bit Server VM warning: Option UseConcMarkSweepGC was deprecated in version 9.0 and will likely be removed in a future release.
[junit4] <<< JVM J1: EOF ----
[...truncated 3 lines...]
[junit4] JVM J0: stderr was not empty, see: /home/jenkins/workspace/Lucene-Solr-master-Linux/lucene/build/suggest/test/temp/junit4-J0-20170703_165151_33512355343558620545611.syserr
[junit4] >>> JVM J0 emitted unexpected output (verbatim) ----
[junit4] Java HotSpot(TM) 64-Bit Server VM warning: Option UseConcMarkSweepGC was deprecated in version 9.0 and will likely be removed in a future release.
[junit4] <<< JVM J0: EOF ----
[...truncated 3 lines...]
[junit4] JVM J2: stderr was not empty, see: /home/jenkins/workspace/Lucene-Solr-master-Linux/lucene/build/suggest/test/temp/junit4-J2-20170703_165151_335306870258338770394.syserr
[junit4] >>> JVM J2 emitted unexpected output (verbatim) ----
[junit4] Java HotSpot(TM) 64-Bit Server VM warning: Option UseConcMarkSweepGC was deprecated in version 9.0 and will likely be removed in a future release.
[junit4] <<< JVM J2: EOF ----
[...truncated 3784 lines...]
[junit4] JVM J1: stderr was not empty, see: /home/jenkins/workspace/Lucene-Solr-master-Linux/solr/build/solr-core/test/temp/junit4-J1-20170703_165242_0107648783425680545599.syserr
[junit4] >>> JVM J1 emitted unexpected output (verbatim) ----
[junit4] Java HotSpot(TM) 64-Bit Server VM warning: Option UseConcMarkSweepGC was deprecated in version 9.0 and will likely be removed in a future release.
[junit4] <<< JVM J1: EOF ----
[...truncated 6 lines...]
[junit4] JVM J0: stderr was not empty, see: /home/jenkins/workspace/Lucene-Solr-master-Linux/solr/build/solr-core/test/temp/junit4-J0-20170703_165242_01017282317989035772230.syserr
[junit4] >>> JVM J0 emitted unexpected output (verbatim) ----
[junit4] Java HotSpot(TM) 64-Bit Server VM warning: Option UseConcMarkSweepGC was deprecated in version 9.0 and will likely be removed in a future release.
[junit4] <<< JVM J0: EOF ----
[...truncated 6 lines...]
[junit4] JVM J2: stderr was not empty, see: /home/jenkins/workspace/Lucene-Solr-master-Linux/solr/build/solr-core/test/temp/junit4-J2-20170703_165242_0105751880345444894195.syserr
[junit4] >>> JVM J2 emitted unexpected output (verbatim) ----
[junit4] Java HotSpot(TM) 64-Bit Server VM warning: Option UseConcMarkSweepGC was deprecated in version 9.0 and will likely be removed in a future release.
[junit4] <<< JVM J2: EOF ----
[...truncated 798 lines...]
[junit4] JVM J0: stderr was not empty, see: /home/jenkins/workspace/Lucene-Solr-master-Linux/solr/build/solr-solrj/test/temp/junit4-J0-20170703_173322_73413928162099231588161.syserr
[junit4] >>> JVM J0 emitted unexpected output (verbatim) ----
[junit4] Java HotSpot(TM) 64-Bit Server VM warning: Option UseConcMarkSweepGC was deprecated in version 9.0 and will likely be removed in a future release.
[junit4] <<< JVM J0: EOF ----
[...truncated 3 lines...]
[junit4] JVM J1: stderr was not empty, see: /home/jenkins/workspace/Lucene-Solr-master-Linux/solr/build/solr-solrj/test/temp/junit4-J1-20170703_173322_7347184958277911928820.syserr
[junit4] >>> JVM J1 emitted unexpected output (verbatim) ----
[junit4] Java HotSpot(TM) 64-Bit Server VM warning: Option UseConcMarkSweepGC was deprecated in version 9.0 and will likely be removed in a future release.
[junit4] <<< JVM J1: EOF ----
[...truncated 12 lines...]
[junit4] JVM J2: stderr was not empty, see: /home/jenkins/workspace/Lucene-Solr-master-Linux/solr/build/solr-solrj/test/temp/junit4-J2-20170703_173322_73411744334844010311005.syserr
[junit4] >>> JVM J2 emitted unexpected output (verbatim) ----
[junit4] Java HotSpot(TM) 64-Bit Server VM warning: Option UseConcMarkSweepGC was deprecated in version 9.0 and will likely be removed in a future release.
[junit4] <<< JVM J2: EOF ----
[...truncated 1240 lines...]
[junit4] JVM J0: stderr was not empty, see: /home/jenkins/workspace/Lucene-Solr-master-Linux/solr/build/contrib/solr-analysis-extras/test/temp/junit4-J0-20170703_173614_8271123844664466009789.syserr
[junit4] >>> JVM J0 emitted unexpected output (verbatim) ----
[junit4] Java HotSpot(TM) 64-Bit Server VM warning: Option UseConcMarkSweepGC was deprecated in version 9.0 and will likely be removed in a future release.
[junit4] <<< JVM J0: EOF ----
[junit4] JVM J2: stderr was not empty, see: /home/jenkins/workspace/Lucene-Solr-master-Linux/solr/build/contrib/solr-analysis-extras/test/temp/junit4-J2-20170703_173614_828584778830087959877.syserr
[junit4] >>> JVM J2 emitted unexpected output (verbatim) ----
[junit4] Java HotSpot(TM) 64-Bit Server VM warning: Option UseConcMarkSweepGC was deprecated in version 9.0 and will likely be removed in a future release.
[junit4] <<< JVM J2: EOF ----
[...truncated 3 lines...]
[junit4] JVM J1: stderr was not empty, see: /home/jenkins/workspace/Lucene-Solr-master-Linux/solr/build/contrib/solr-analysis-extras/test/temp/junit4-J1-20170703_173614_82817960312290851011164.syserr
[junit4] >>> JVM J1 emitted unexpected output (verbatim) ----
[junit4] Java HotSpot(TM) 64-Bit Server VM warning: Option UseConcMarkSweepGC was deprecated in version 9.0 and will likely be removed in a future release.
[junit4] <<< JVM J1: EOF ----
[...truncated 532 lines...]
[junit4] Suite: org.apache.solr.analytics.NoFacetCloudTest
[junit4] 2> Creating dataDir: /home/jenkins/workspace/Lucene-Solr-master-Linux/solr/build/contrib/solr-analytics/test/J2/temp/solr.analytics.NoFacetCloudTest_95492CBA12E644DB-001/init-core-data-001
[junit4] 2> Jul 03, 2017 5:36:42 PM com.carrotsearch.randomizedtesting.ThreadLeakControl checkThreadLeaks
[junit4] 2> WARNING: Will linger awaiting termination of 1 leaked thread(s).
[junit4] 2> NOTE: test params are: codec=Asserting(Lucene70): {}, docValues:{}, maxPointsInLeafNode=329, maxMBSortInHeap=7.807023803898568, sim=RandomSimilarity(queryNorm=true): {}, locale=ks, timezone=America/Scoresbysund
[junit4] 2> NOTE: Linux 4.10.0-21-generic amd64/Oracle Corporation 9 (64-bit)/cpus=8,threads=1,free=399981016,total=518979584
[junit4] 2> NOTE: All tests run in this JVM: [FunctionTest, FieldFacetExtrasTest, FacetSortingTest, NoFacetCloudTest]
[junit4] 2> NOTE: reproduce with: ant test -Dtestcase=NoFacetCloudTest -Dtests.seed=95492CBA12E644DB -Dtests.multiplier=3 -Dtests.slow=true -Dtests.locale=ks -Dtests.timezone=America/Scoresbysund -Dtests.asserts=true -Dtests.file.encoding=US-ASCII
[junit4] ERROR 0.00s J2 | NoFacetCloudTest (suite) <<<
[junit4] > Throwable #1: org.apache.solr.client.solrj.SolrServerException: org.apache.http.ParseException: Invalid content type:
[junit4] > at __randomizedtesting.SeedInfo.seed([95492CBA12E644DB]:0)
[junit4] > at org.apache.solr.client.solrj.impl.LBHttpSolrClient.doRequest(LBHttpSolrClient.java:510)
[junit4] > at org.apache.solr.client.solrj.impl.LBHttpSolrClient.request(LBHttpSolrClient.java:400)
[junit4] > at org.apache.solr.client.solrj.impl.CloudSolrClient.sendRequest(CloudSolrClient.java:1102)
[junit4] > at org.apache.solr.client.solrj.impl.CloudSolrClient.requestWithRetryOnStaleState(CloudSolrClient.java:843)
[junit4] > at org.apache.solr.client.solrj.impl.CloudSolrClient.request(CloudSolrClient.java:774)
[junit4] > at org.apache.solr.client.solrj.SolrRequest.process(SolrRequest.java:178)
[junit4] > at org.apache.solr.client.solrj.SolrRequest.process(SolrRequest.java:195)
[junit4] > at org.apache.solr.analytics.AbstractAnalyticsStatsCloudTest.setupCluster(AbstractAnalyticsStatsCloudTest.java:75)
[junit4] > at org.apache.solr.analytics.NoFacetCloudTest.populate(NoFacetCloudTest.java:62)
[junit4] > at java.base/jdk.internal.reflect.NativeMethodAccessorImpl.invoke0(Native Method)
[junit4] > at java.base/jdk.internal.reflect.NativeMethodAccessorImpl.invoke(NativeMethodAccessorImpl.java:62)
[junit4] > at java.base/jdk.internal.reflect.DelegatingMethodAccessorImpl.invoke(DelegatingMethodAccessorImpl.java:43)
[junit4] > at java.base/java.lang.reflect.Method.invoke(Method.java:564)
[junit4] > at java.base/java.lang.Thread.run(Thread.java:844)
[junit4] > Caused by: org.apache.http.ParseException: Invalid content type:
[junit4] > at org.apache.http.entity.ContentType.parse(ContentType.java:273)
[junit4] > at org.apache.solr.client.solrj.impl.HttpSolrClient.executeMethod(HttpSolrClient.java:570)
[junit4] > at org.apache.solr.client.solrj.impl.HttpSolrClient.request(HttpSolrClient.java:250)
[junit4] > at org.apache.solr.client.solrj.impl.HttpSolrClient.request(HttpSolrClient.java:239)
[junit4] > at org.apache.solr.client.solrj.impl.LBHttpSolrClient.doRequest(LBHttpSolrClient.java:470)
[junit4] > ... 31 more
[junit4] Completed [8/17 (1!)] on J2 in 6.61s, 0 tests, 1 error <<< FAILURES!
[...truncated 13 lines...]
[junit4] JVM J1: stderr was not empty, see: /home/jenkins/workspace/Lucene-Solr-master-Linux/solr/build/contrib/solr-analytics/test/temp/junit4-J1-20170703_173623_6548803276143867658792.syserr
[junit4] >>> JVM J1 emitted unexpected output (verbatim) ----
[junit4] Java HotSpot(TM) 64-Bit Server VM warning: Option UseConcMarkSweepGC was deprecated in version 9.0 and will likely be removed in a future release.
[junit4] <<< JVM J1: EOF ----
[...truncated 3 lines...]
[junit4] JVM J0: stderr was not empty, see: /home/jenkins/workspace/Lucene-Solr-master-Linux/solr/build/contrib/solr-analytics/test/temp/junit4-J0-20170703_173623_65413695243518789464531.syserr
[junit4] >>> JVM J0 emitted unexpected output (verbatim) ----
[junit4] Java HotSpot(TM) 64-Bit Server VM warning: Option UseConcMarkSweepGC was deprecated in version 9.0 and will likely be removed in a future release.
[junit4] <<< JVM J0: EOF ----
[...truncated 3 lines...]
[junit4] JVM J2: stderr was not empty, see: /home/jenkins/workspace/Lucene-Solr-master-Linux/solr/build/contrib/solr-analytics/test/temp/junit4-J2-20170703_173623_65417521286969591186026.syserr
[junit4] >>> JVM J2 emitted unexpected output (verbatim) ----
[junit4] Java HotSpot(TM) 64-Bit Server VM warning: Option UseConcMarkSweepGC was deprecated in version 9.0 and will likely be removed in a future release.
[junit4] <<< JVM J2: EOF ----
[...truncated 504 lines...]
[junit4] JVM J2: stderr was not empty, see: /home/jenkins/workspace/Lucene-Solr-master-Linux/solr/build/contrib/solr-clustering/test/temp/junit4-J2-20170703_173656_79412777304251862398498.syserr
[junit4] >>> JVM J2 emitted unexpected output (verbatim) ----
[junit4] Java HotSpot(TM) 64-Bit Server VM warning: Option UseConcMarkSweepGC was deprecated in version 9.0 and will likely be removed in a future release.
[junit4] <<< JVM J2: EOF ----
[...truncated 3 lines...]
[junit4] JVM J1: stderr was not empty, see: /home/jenkins/workspace/Lucene-Solr-master-Linux/solr/build/contrib/solr-clustering/test/temp/junit4-J1-20170703_173656_79414625551124815705680.syserr
[junit4] >>> JVM J1 emitted unexpected output (verbatim) ----
[junit4] Java HotSpot(TM) 64-Bit Server VM warning: Option UseConcMarkSweepGC was deprecated in version 9.0 and will likely be removed in a future release.
[junit4] <<< JVM J1: EOF ----
[...truncated 3 lines...]
[junit4] JVM J0: stderr was not empty, see: /home/jenkins/workspace/Lucene-Solr-master-Linux/solr/build/contrib/solr-clustering/test/temp/junit4-J0-20170703_173656_7948746743424041547097.syserr
[junit4] >>> JVM J0 emitted unexpected output (verbatim) ----
[junit4] Java HotSpot(TM) 64-Bit Server VM warning: Option UseConcMarkSweepGC was deprecated in version 9.0 and will likely be removed in a future release.
[junit4] <<< JVM J0: EOF ----
[...truncated 1131 lines...]
[junit4] JVM J1: stderr was not empty, see: /home/jenkins/workspace/Lucene-Solr-master-Linux/solr/build/contrib/solr-dataimporthandler-extras/test/temp/junit4-J1-20170703_173714_68811333758201032831490.syserr
[junit4] >>> JVM J1 emitted unexpected output (verbatim) ----
[junit4] Java HotSpot(TM) 64-Bit Server VM warning: Option UseConcMarkSweepGC was deprecated in version 9.0 and will likely be removed in a future release.
[junit4] <<< JVM J1: EOF ----
[...truncated 3 lines...]
[junit4] JVM J0: stderr was not empty, see: /home/jenkins/workspace/Lucene-Solr-master-Linux/solr/build/contrib/solr-dataimporthandler-extras/test/temp/junit4-J0-20170703_173714_6886305213089596553871.syserr
[junit4] >>> JVM J0 emitted unexpected output (verbatim) ----
[junit4] Java HotSpot(TM) 64-Bit Server VM warning: Option UseConcMarkSweepGC was deprecated in version 9.0 and will likely be removed in a future release.
[junit4] <<< JVM J0: EOF ----
[...truncated 590 lines...]
[junit4] JVM J2: stderr was not empty, see: /home/jenkins/workspace/Lucene-Solr-master-Linux/solr/build/contrib/solr-dataimporthandler/test/temp/junit4-J2-20170703_173721_60014468347451812988145.syserr
[junit4] >>> JVM J2 emitted unexpected output (verbatim) ----
[junit4] Java HotSpot(TM) 64-Bit Server VM warning: Option UseConcMarkSweepGC was deprecated in version 9.0 and will likely be removed in a future release.
[junit4] <<< JVM J2: EOF ----
[...truncated 3 lines...]
[junit4] JVM J1: stderr was not empty, see: /home/jenkins/workspace/Lucene-Solr-master-Linux/solr/build/contrib/solr-dataimporthandler/test/temp/junit4-J1-20170703_173721_6001511649074951780464.syserr
[junit4] >>> JVM J1 emitted unexpected output (verbatim) ----
[junit4] Java HotSpot(TM) 64-Bit Server VM warning: Option UseConcMarkSweepGC was deprecated in version 9.0 and will likely be removed in a future release.
[junit4] <<< JVM J1: EOF ----
[...truncated 3 lines...]
[junit4] JVM J0: stderr was not empty, see: /home/jenkins/workspace/Lucene-Solr-master-Linux/solr/build/contrib/solr-dataimporthandler/test/temp/junit4-J0-20170703_173721_6001347320456848729211.syserr
[junit4] >>> JVM J0 emitted unexpected output (verbatim) ----
[junit4] Java HotSpot(TM) 64-Bit Server VM warning: Option UseConcMarkSweepGC was deprecated in version 9.0 and will likely be removed in a future release.
[junit4] <<< JVM J0: EOF ----
[...truncated 503 lines...]
[junit4] JVM J1: stderr was not empty, see: /home/jenkins/workspace/Lucene-Solr-master-Linux/solr/build/contrib/solr-cell/test/temp/junit4-J1-20170703_173745_9895397683715419881855.syserr
[junit4] >>> JVM J1 emitted unexpected output (verbatim) ----
[junit4] Java HotSpot(TM) 64-Bit Server VM warning: Option UseConcMarkSweepGC was deprecated in version 9.0 and will likely be removed in a future release.
[junit4] <<< JVM J1: EOF ----
[...truncated 3 lines...]
[junit4] JVM J2: stderr was not empty, see: /home/jenkins/workspace/Lucene-Solr-master-Linux/solr/build/contrib/solr-cell/test/temp/junit4-J2-20170703_173745_99014302041964844318799.syserr
[junit4] >>> JVM J2 emitted unexpected output (verbatim) ----
[junit4] Java HotSpot(TM) 64-Bit Server VM warning: Option UseConcMarkSweepGC was deprecated in version 9.0 and will likely be removed in a future release.
[junit4] <<< JVM J2: EOF ----
[...truncated 3 lines...]
[junit4] JVM J0: stderr was not empty, see: /home/jenkins/workspace/Lucene-Solr-master-Linux/solr/build/contrib/solr-cell/test/temp/junit4-J0-20170703_173745_98817767239315952620245.syserr
[junit4] >>> JVM J0 emitted unexpected output (verbatim) ----
[junit4] Java HotSpot(TM) 64-Bit Server VM warning: Option UseConcMarkSweepGC was deprecated in version 9.0 and will likely be removed in a future release.
[junit4] <<< JVM J0: EOF ----
[...truncated 507 lines...]
[junit4] JVM J1: stderr was not empty, see: /home/jenkins/workspace/Lucene-Solr-master-Linux/solr/build/contrib/solr-langid/test/temp/junit4-J1-20170703_173757_49413467597513594865994.syserr
[junit4] >>> JVM J1 emitted unexpected output (verbatim) ----
[junit4] Java HotSpot(TM) 64-Bit Server VM warning: Option UseConcMarkSweepGC was deprecated in version 9.0 and will likely be removed in a future release.
[junit4] <<< JVM J1: EOF ----
[junit4] JVM J0: stderr was not empty, see: /home/jenkins/workspace/Lucene-Solr-master-Linux/solr/build/contrib/solr-langid/test/temp/junit4-J0-20170703_173757_4948523838525111188782.syserr
[junit4] >>> JVM J0 emitted unexpected output (verbatim) ----
[junit4] Java HotSpot(TM) 64-Bit Server VM warning: Option UseConcMarkSweepGC was deprecated in version 9.0 and will likely be removed in a future release.
[junit4] <<< JVM J0: EOF ----
[...truncated 590 lines...]
[junit4] JVM J0: stderr was not empty, see: /home/jenkins/workspace/Lucene-Solr-master-Linux/solr/build/contrib/solr-ltr/test/temp/junit4-J0-20170703_173804_48513631050360592811983.syserr
[junit4] >>> JVM J0 emitted unexpected output (verbatim) ----
[junit4] Java HotSpot(TM) 64-Bit Server VM warning: Option UseConcMarkSweepGC was deprecated in version 9.0 and will likely be removed in a future release.
[junit4] <<< JVM J0: EOF ----
[...truncated 6 lines...]
[junit4] JVM J2: stderr was not empty, see: /home/jenkins/workspace/Lucene-Solr-master-Linux/solr/build/contrib/solr-ltr/test/temp/junit4-J2-20170703_173804_48518262702550580671297.syserr
[junit4] >>> JVM J2 emitted unexpected output (verbatim) ----
[junit4] Java HotSpot(TM) 64-Bit Server VM warning: Option UseConcMarkSweepGC was deprecated in version 9.0 and will likely be removed in a future release.
[junit4] <<< JVM J2: EOF ----
[junit4] JVM J1: stderr was not empty, see: /home/jenkins/workspace/Lucene-Solr-master-Linux/solr/build/contrib/solr-ltr/test/temp/junit4-J1-20170703_173804_48516123443685155265965.syserr
[junit4] >>> JVM J1 emitted unexpected output (verbatim) ----
[junit4] Java HotSpot(TM) 64-Bit Server VM warning: Option UseConcMarkSweepGC was deprecated in version 9.0 and will likely be removed in a future release.
[junit4] <<< JVM J1: EOF ----
[...truncated 538 lines...]
[junit4] JVM J1: stderr was not empty, see: /home/jenkins/workspace/Lucene-Solr-master-Linux/solr/build/contrib/solr-uima/test/temp/junit4-J1-20170703_173832_65414203068187145712982.syserr
[junit4] >>> JVM J1 emitted unexpected output (verbatim) ----
[junit4] Java HotSpot(TM) 64-Bit Server VM warning: Option UseConcMarkSweepGC was deprecated in version 9.0 and will likely be removed in a future release.
[junit4] <<< JVM J1: EOF ----
[...truncated 3 lines...]
[junit4] JVM J0: stderr was not empty, see: /home/jenkins/workspace/Lucene-Solr-master-Linux/solr/build/contrib/solr-uima/test/temp/junit4-J0-20170703_173832_6547376108882768191172.syserr
[junit4] >>> JVM J0 emitted unexpected output (verbatim) ----
[junit4] Java HotSpot(TM) 64-Bit Server VM warning: Option UseConcMarkSweepGC was deprecated in version 9.0 and will likely be removed in a future release.
[junit4] <<< JVM J0: EOF ----
[...truncated 494 lines...]
[junit4] JVM J0: stderr was not empty, see: /home/jenkins/workspace/Lucene-Solr-master-Linux/solr/build/contrib/solr-velocity/test/temp/junit4-J0-20170703_173843_96518001564477216369582.syserr
[junit4] >>> JVM J0 emitted unexpected output (verbatim) ----
[junit4] Java HotSpot(TM) 64-Bit Server VM warning: Option UseConcMarkSweepGC was deprecated in version 9.0 and will likely be removed in a future release.
[junit4] <<< JVM J0: EOF ----
[...truncated 28979 lines...]
[JENKINS-EA] Lucene-Solr-master-Linux (64bit/jdk-9-ea+175) - Build
# 20051 - Still Unstable!
Posted by Policeman Jenkins Server <je...@thetaphi.de>.
Build: https://jenkins.thetaphi.de/job/Lucene-Solr-master-Linux/20051/
Java: 64bit/jdk-9-ea+175 -XX:-UseCompressedOops -XX:+UseG1GC --illegal-access=deny
1 tests failed.
FAILED: org.apache.solr.handler.admin.MBeansHandlerTest.testDiff
Error Message:
Stack Trace:
java.lang.NullPointerException
at __randomizedtesting.SeedInfo.seed([281BFC041AE5AF3:C7977B5B51186293]:0)
at org.apache.solr.handler.admin.SolrInfoMBeanHandler.diffObject(SolrInfoMBeanHandler.java:240)
at org.apache.solr.handler.admin.SolrInfoMBeanHandler.diffNamedList(SolrInfoMBeanHandler.java:219)
at org.apache.solr.handler.admin.SolrInfoMBeanHandler.diffObject(SolrInfoMBeanHandler.java:238)
at org.apache.solr.handler.admin.SolrInfoMBeanHandler.diffNamedList(SolrInfoMBeanHandler.java:219)
at org.apache.solr.handler.admin.SolrInfoMBeanHandler.getDiff(SolrInfoMBeanHandler.java:187)
at org.apache.solr.handler.admin.SolrInfoMBeanHandler.handleRequestBody(SolrInfoMBeanHandler.java:87)
at org.apache.solr.handler.RequestHandlerBase.handleRequest(RequestHandlerBase.java:177)
at org.apache.solr.core.SolrCore.execute(SolrCore.java:2473)
at org.apache.solr.util.TestHarness.query(TestHarness.java:337)
at org.apache.solr.util.TestHarness.query(TestHarness.java:319)
at org.apache.solr.handler.admin.MBeansHandlerTest.testDiff(MBeansHandlerTest.java:57)
at java.base/jdk.internal.reflect.NativeMethodAccessorImpl.invoke0(Native Method)
at java.base/jdk.internal.reflect.NativeMethodAccessorImpl.invoke(NativeMethodAccessorImpl.java:62)
at java.base/jdk.internal.reflect.DelegatingMethodAccessorImpl.invoke(DelegatingMethodAccessorImpl.java:43)
at java.base/java.lang.reflect.Method.invoke(Method.java:564)
at com.carrotsearch.randomizedtesting.RandomizedRunner.invoke(RandomizedRunner.java:1713)
at com.carrotsearch.randomizedtesting.RandomizedRunner$8.evaluate(RandomizedRunner.java:907)
at com.carrotsearch.randomizedtesting.RandomizedRunner$9.evaluate(RandomizedRunner.java:943)
at com.carrotsearch.randomizedtesting.RandomizedRunner$10.evaluate(RandomizedRunner.java:957)
at com.carrotsearch.randomizedtesting.rules.SystemPropertiesRestoreRule$1.evaluate(SystemPropertiesRestoreRule.java:57)
at org.apache.lucene.util.TestRuleSetupTeardownChained$1.evaluate(TestRuleSetupTeardownChained.java:49)
at org.apache.lucene.util.AbstractBeforeAfterRule$1.evaluate(AbstractBeforeAfterRule.java:45)
at org.apache.lucene.util.TestRuleThreadAndTestName$1.evaluate(TestRuleThreadAndTestName.java:48)
at org.apache.lucene.util.TestRuleIgnoreAfterMaxFailures$1.evaluate(TestRuleIgnoreAfterMaxFailures.java:64)
at org.apache.lucene.util.TestRuleMarkFailure$1.evaluate(TestRuleMarkFailure.java:47)
at com.carrotsearch.randomizedtesting.rules.StatementAdapter.evaluate(StatementAdapter.java:36)
at com.carrotsearch.randomizedtesting.ThreadLeakControl$StatementRunner.run(ThreadLeakControl.java:368)
at com.carrotsearch.randomizedtesting.ThreadLeakControl.forkTimeoutingTask(ThreadLeakControl.java:817)
at com.carrotsearch.randomizedtesting.ThreadLeakControl$3.evaluate(ThreadLeakControl.java:468)
at com.carrotsearch.randomizedtesting.RandomizedRunner.runSingleTest(RandomizedRunner.java:916)
at com.carrotsearch.randomizedtesting.RandomizedRunner$5.evaluate(RandomizedRunner.java:802)
at com.carrotsearch.randomizedtesting.RandomizedRunner$6.evaluate(RandomizedRunner.java:852)
at com.carrotsearch.randomizedtesting.RandomizedRunner$7.evaluate(RandomizedRunner.java:863)
at com.carrotsearch.randomizedtesting.rules.StatementAdapter.evaluate(StatementAdapter.java:36)
at com.carrotsearch.randomizedtesting.rules.SystemPropertiesRestoreRule$1.evaluate(SystemPropertiesRestoreRule.java:57)
at org.apache.lucene.util.AbstractBeforeAfterRule$1.evaluate(AbstractBeforeAfterRule.java:45)
at com.carrotsearch.randomizedtesting.rules.StatementAdapter.evaluate(StatementAdapter.java:36)
at org.apache.lucene.util.TestRuleStoreClassName$1.evaluate(TestRuleStoreClassName.java:41)
at com.carrotsearch.randomizedtesting.rules.NoShadowingOrOverridesOnMethodsRule$1.evaluate(NoShadowingOrOverridesOnMethodsRule.java:40)
at com.carrotsearch.randomizedtesting.rules.NoShadowingOrOverridesOnMethodsRule$1.evaluate(NoShadowingOrOverridesOnMethodsRule.java:40)
at com.carrotsearch.randomizedtesting.rules.StatementAdapter.evaluate(StatementAdapter.java:36)
at com.carrotsearch.randomizedtesting.rules.StatementAdapter.evaluate(StatementAdapter.java:36)
at org.apache.lucene.util.TestRuleAssertionsRequired$1.evaluate(TestRuleAssertionsRequired.java:53)
at org.apache.lucene.util.TestRuleMarkFailure$1.evaluate(TestRuleMarkFailure.java:47)
at org.apache.lucene.util.TestRuleIgnoreAfterMaxFailures$1.evaluate(TestRuleIgnoreAfterMaxFailures.java:64)
at org.apache.lucene.util.TestRuleIgnoreTestSuites$1.evaluate(TestRuleIgnoreTestSuites.java:54)
at com.carrotsearch.randomizedtesting.rules.StatementAdapter.evaluate(StatementAdapter.java:36)
at com.carrotsearch.randomizedtesting.ThreadLeakControl$StatementRunner.run(ThreadLeakControl.java:368)
at java.base/java.lang.Thread.run(Thread.java:844)
Build Log:
[...truncated 12189 lines...]
[junit4] Suite: org.apache.solr.handler.admin.MBeansHandlerTest
[junit4] 2> Creating dataDir: /home/jenkins/workspace/Lucene-Solr-master-Linux/solr/build/solr-core/test/J2/temp/solr.handler.admin.MBeansHandlerTest_281BFC041AE5AF3-001/init-core-data-001
[junit4] 2> 1203472 WARN (SUITE-MBeansHandlerTest-seed#[281BFC041AE5AF3]-worker) [ ] o.a.s.SolrTestCaseJ4 startTrackingSearchers: numOpens=2 numCloses=2
[junit4] 2> 1203473 INFO (SUITE-MBeansHandlerTest-seed#[281BFC041AE5AF3]-worker) [ ] o.a.s.SolrTestCaseJ4 Using PointFields (NUMERIC_POINTS_SYSPROP=true) w/NUMERIC_DOCVALUES_SYSPROP=false
[junit4] 2> 1203473 INFO (SUITE-MBeansHandlerTest-seed#[281BFC041AE5AF3]-worker) [ ] o.a.s.SolrTestCaseJ4 Randomized ssl (false) and clientAuth (true) via: @org.apache.solr.util.RandomizeSSL(reason="", ssl=0.0/0.0, value=0.0/0.0, clientAuth=0.0/0.0)
[junit4] 2> 1203473 INFO (SUITE-MBeansHandlerTest-seed#[281BFC041AE5AF3]-worker) [ ] o.a.s.SolrTestCaseJ4 ####initCore
[junit4] 2> 1203474 INFO (SUITE-MBeansHandlerTest-seed#[281BFC041AE5AF3]-worker) [ ] o.a.s.c.SolrResourceLoader [null] Added 2 libs to classloader, from paths: [/home/jenkins/workspace/Lucene-Solr-master-Linux/solr/core/src/test-files/solr/collection1/lib, /home/jenkins/workspace/Lucene-Solr-master-Linux/solr/core/src/test-files/solr/collection1/lib/classes]
[junit4] 2> 1203492 INFO (SUITE-MBeansHandlerTest-seed#[281BFC041AE5AF3]-worker) [ ] o.a.s.c.SolrConfig Using Lucene MatchVersion: 8.0.0
[junit4] 2> 1203508 INFO (SUITE-MBeansHandlerTest-seed#[281BFC041AE5AF3]-worker) [ ] o.a.s.s.IndexSchema [null] Schema name=test
[junit4] 2> 1203754 INFO (SUITE-MBeansHandlerTest-seed#[281BFC041AE5AF3]-worker) [ ] o.a.s.s.IndexSchema Loaded schema test/1.0 with uniqueid field id
[junit4] 2> 1203861 INFO (SUITE-MBeansHandlerTest-seed#[281BFC041AE5AF3]-worker) [ ] o.a.s.m.r.SolrJmxReporter JMX monitoring for 'solr.node' (registry 'solr.node') enabled at server: com.sun.jmx.mbeanserver.JmxMBeanServer@68d45e21
[junit4] 2> 1203866 INFO (SUITE-MBeansHandlerTest-seed#[281BFC041AE5AF3]-worker) [ ] o.a.s.m.r.SolrJmxReporter JMX monitoring for 'solr.jvm' (registry 'solr.jvm') enabled at server: com.sun.jmx.mbeanserver.JmxMBeanServer@68d45e21
[junit4] 2> 1203866 INFO (SUITE-MBeansHandlerTest-seed#[281BFC041AE5AF3]-worker) [ ] o.a.s.m.r.SolrJmxReporter JMX monitoring for 'solr.jetty' (registry 'solr.jetty') enabled at server: com.sun.jmx.mbeanserver.JmxMBeanServer@68d45e21
[junit4] 2> 1203885 INFO (coreLoadExecutor-5338-thread-1) [ ] o.a.s.c.SolrResourceLoader [null] Added 2 libs to classloader, from paths: [/home/jenkins/workspace/Lucene-Solr-master-Linux/solr/core/src/test-files/solr/collection1/lib, /home/jenkins/workspace/Lucene-Solr-master-Linux/solr/core/src/test-files/solr/collection1/lib/classes]
[junit4] 2> 1203960 INFO (coreLoadExecutor-5338-thread-1) [ ] o.a.s.c.SolrConfig Using Lucene MatchVersion: 8.0.0
[junit4] 2> 1204003 INFO (coreLoadExecutor-5338-thread-1) [ ] o.a.s.s.IndexSchema [collection1] Schema name=test
[junit4] 2> 1204137 INFO (coreLoadExecutor-5338-thread-1) [ ] o.a.s.s.IndexSchema Loaded schema test/1.0 with uniqueid field id
[junit4] 2> 1204158 INFO (coreLoadExecutor-5338-thread-1) [ ] o.a.s.c.CoreContainer Creating SolrCore 'collection1' using configuration from instancedir /home/jenkins/workspace/Lucene-Solr-master-Linux/solr/core/src/test-files/solr/collection1, trusted=true
[junit4] 2> 1204158 INFO (coreLoadExecutor-5338-thread-1) [ ] o.a.s.m.r.SolrJmxReporter JMX monitoring for 'solr.core.collection1' (registry 'solr.core.collection1') enabled at server: com.sun.jmx.mbeanserver.JmxMBeanServer@68d45e21
[junit4] 2> 1204159 INFO (coreLoadExecutor-5338-thread-1) [ ] o.a.s.c.SolrCore solr.RecoveryStrategy.Builder
[junit4] 2> 1204159 INFO (coreLoadExecutor-5338-thread-1) [ ] o.a.s.c.SolrCore [[collection1] ] Opening new SolrCore at [/home/jenkins/workspace/Lucene-Solr-master-Linux/solr/core/src/test-files/solr/collection1], dataDir=[/home/jenkins/workspace/Lucene-Solr-master-Linux/solr/build/solr-core/test/J2/temp/solr.handler.admin.MBeansHandlerTest_281BFC041AE5AF3-001/init-core-data-001/]
[junit4] 2> 1204160 INFO (coreLoadExecutor-5338-thread-1) [ ] o.a.s.u.RandomMergePolicy RandomMergePolicy wrapping class org.apache.lucene.index.LogByteSizeMergePolicy: [LogByteSizeMergePolicy: minMergeSize=1677721, mergeFactor=24, maxMergeSize=2147483648, maxMergeSizeForForcedMerge=9223372036854775807, calibrateSizeByDeletes=false, maxMergeDocs=2147483647, maxCFSSegmentSizeMB=8.796093022207999E12, noCFSRatio=0.31188428674348245]
[junit4] 2> 1204222 INFO (coreLoadExecutor-5338-thread-1) [ ] o.a.s.u.UpdateHandler Using UpdateLog implementation: org.apache.solr.update.UpdateLog
[junit4] 2> 1204222 INFO (coreLoadExecutor-5338-thread-1) [ ] o.a.s.u.UpdateLog Initializing UpdateLog: dataDir= defaultSyncLevel=FLUSH numRecordsToKeep=100 maxNumLogsToKeep=10 numVersionBuckets=65536
[junit4] 2> 1204223 INFO (coreLoadExecutor-5338-thread-1) [ ] o.a.s.u.CommitTracker Hard AutoCommit: disabled
[junit4] 2> 1204223 INFO (coreLoadExecutor-5338-thread-1) [ ] o.a.s.u.CommitTracker Soft AutoCommit: disabled
[junit4] 2> 1204224 INFO (coreLoadExecutor-5338-thread-1) [ ] o.a.s.u.RandomMergePolicy RandomMergePolicy wrapping class org.apache.lucene.index.LogByteSizeMergePolicy: [LogByteSizeMergePolicy: minMergeSize=1677721, mergeFactor=12, maxMergeSize=2147483648, maxMergeSizeForForcedMerge=9223372036854775807, calibrateSizeByDeletes=false, maxMergeDocs=2147483647, maxCFSSegmentSizeMB=8.796093022207999E12, noCFSRatio=0.20665761849170822]
[junit4] 2> 1204224 INFO (coreLoadExecutor-5338-thread-1) [ ] o.a.s.s.SolrIndexSearcher Opening [Searcher@4e7dae1c[collection1] main]
[junit4] 2> 1204225 INFO (coreLoadExecutor-5338-thread-1) [ ] o.a.s.h.c.SpellCheckComponent Initializing spell checkers
[junit4] 2> 1204237 INFO (coreLoadExecutor-5338-thread-1) [ ] o.a.s.s.DirectSolrSpellChecker init: {name=direct,classname=DirectSolrSpellChecker,field=lowerfilt,minQueryLength=3}
[junit4] 2> 1204298 INFO (coreLoadExecutor-5338-thread-1) [ ] o.a.s.h.ReplicationHandler Commits will be reserved for 10000
[junit4] 2> 1204298 INFO (searcherExecutor-5339-thread-1) [ ] o.a.s.h.c.SpellCheckComponent Loading spell index for spellchecker: default
[junit4] 2> 1204298 INFO (coreLoadExecutor-5338-thread-1) [ ] o.a.s.u.UpdateLog Could not find max version in index or recent updates, using new clock 1571945141033238528
[junit4] 2> 1204299 INFO (searcherExecutor-5339-thread-1) [ ] o.a.s.h.c.SpellCheckComponent Loading spell index for spellchecker: direct
[junit4] 2> 1204299 INFO (searcherExecutor-5339-thread-1) [ ] o.a.s.h.c.SpellCheckComponent Loading spell index for spellchecker: wordbreak
[junit4] 2> 1204299 INFO (searcherExecutor-5339-thread-1) [ ] o.a.s.h.c.SpellCheckComponent Loading spell index for spellchecker: multipleFields
[junit4] 2> 1204299 INFO (searcherExecutor-5339-thread-1) [ ] o.a.s.h.c.SpellCheckComponent Loading spell index for spellchecker: jarowinkler
[junit4] 2> 1204299 INFO (searcherExecutor-5339-thread-1) [ ] o.a.s.h.c.SpellCheckComponent Loading spell index for spellchecker: external
[junit4] 2> 1204300 INFO (searcherExecutor-5339-thread-1) [ ] o.a.s.h.c.SpellCheckComponent Loading spell index for spellchecker: freq
[junit4] 2> 1204300 INFO (searcherExecutor-5339-thread-1) [ ] o.a.s.h.c.SpellCheckComponent Loading spell index for spellchecker: fqcn
[junit4] 2> 1204300 INFO (searcherExecutor-5339-thread-1) [ ] o.a.s.h.c.SpellCheckComponent Loading spell index for spellchecker: perDict
[junit4] 2> 1204301 INFO (SUITE-MBeansHandlerTest-seed#[281BFC041AE5AF3]-worker) [ ] o.a.s.SolrTestCaseJ4 ####initCore end
[junit4] 2> 1204302 INFO (TEST-MBeansHandlerTest.testDiff-seed#[281BFC041AE5AF3]) [ ] o.a.s.SolrTestCaseJ4 ###Starting testDiff
[junit4] 2> 1204305 INFO (searcherExecutor-5339-thread-1) [ ] o.a.s.c.SolrCore [collection1] Registered new searcher Searcher@4e7dae1c[collection1] main{ExitableDirectoryReader(UninvertingDirectoryReader())}
[junit4] 2> 1204306 INFO (TEST-MBeansHandlerTest.testDiff-seed#[281BFC041AE5AF3]) [ ] o.a.s.c.TransientSolrCoreCacheDefault Allocating transient cache for 2147483647 transient cores
[junit4] 2> 1204307 INFO (TEST-MBeansHandlerTest.testDiff-seed#[281BFC041AE5AF3]) [ ] o.a.s.c.S.Request [collection1] webapp=null path=null params={qt=/admin/mbeans&stats=true&wt=xml} status=0 QTime=4
[junit4] 2> 1204424 ERROR (TEST-MBeansHandlerTest.testDiff-seed#[281BFC041AE5AF3]) [ ] o.a.s.h.RequestHandlerBase java.lang.NullPointerException
[junit4] 2> at org.apache.solr.handler.admin.SolrInfoMBeanHandler.diffObject(SolrInfoMBeanHandler.java:240)
[junit4] 2> at org.apache.solr.handler.admin.SolrInfoMBeanHandler.diffNamedList(SolrInfoMBeanHandler.java:219)
[junit4] 2> at org.apache.solr.handler.admin.SolrInfoMBeanHandler.diffObject(SolrInfoMBeanHandler.java:238)
[junit4] 2> at org.apache.solr.handler.admin.SolrInfoMBeanHandler.diffNamedList(SolrInfoMBeanHandler.java:219)
[junit4] 2> at org.apache.solr.handler.admin.SolrInfoMBeanHandler.getDiff(SolrInfoMBeanHandler.java:187)
[junit4] 2> at org.apache.solr.handler.admin.SolrInfoMBeanHandler.handleRequestBody(SolrInfoMBeanHandler.java:87)
[junit4] 2> at org.apache.solr.handler.RequestHandlerBase.handleRequest(RequestHandlerBase.java:177)
[junit4] 2> at org.apache.solr.core.SolrCore.execute(SolrCore.java:2473)
[junit4] 2> at org.apache.solr.util.TestHarness.query(TestHarness.java:337)
[junit4] 2> at org.apache.solr.util.TestHarness.query(TestHarness.java:319)
[junit4] 2> at org.apache.solr.handler.admin.MBeansHandlerTest.testDiff(MBeansHandlerTest.java:57)
[junit4] 2> at java.base/jdk.internal.reflect.NativeMethodAccessorImpl.invoke0(Native Method)
[junit4] 2> at java.base/jdk.internal.reflect.NativeMethodAccessorImpl.invoke(NativeMethodAccessorImpl.java:62)
[junit4] 2> at java.base/jdk.internal.reflect.DelegatingMethodAccessorImpl.invoke(DelegatingMethodAccessorImpl.java:43)
[junit4] 2> at java.base/java.lang.reflect.Method.invoke(Method.java:564)
[junit4] 2> at com.carrotsearch.randomizedtesting.RandomizedRunner.invoke(RandomizedRunner.java:1713)
[junit4] 2> at com.carrotsearch.randomizedtesting.RandomizedRunner$8.evaluate(RandomizedRunner.java:907)
[junit4] 2> at com.carrotsearch.randomizedtesting.RandomizedRunner$9.evaluate(RandomizedRunner.java:943)
[junit4] 2> at com.carrotsearch.randomizedtesting.RandomizedRunner$10.evaluate(RandomizedRunner.java:957)
[junit4] 2> at com.carrotsearch.randomizedtesting.rules.SystemPropertiesRestoreRule$1.evaluate(SystemPropertiesRestoreRule.java:57)
[junit4] 2> at org.apache.lucene.util.TestRuleSetupTeardownChained$1.evaluate(TestRuleSetupTeardownChained.java:49)
[junit4] 2> at org.apache.lucene.util.AbstractBeforeAfterRule$1.evaluate(AbstractBeforeAfterRule.java:45)
[junit4] 2> at org.apache.lucene.util.TestRuleThreadAndTestName$1.evaluate(TestRuleThreadAndTestName.java:48)
[junit4] 2> at org.apache.lucene.util.TestRuleIgnoreAfterMaxFailures$1.evaluate(TestRuleIgnoreAfterMaxFailures.java:64)
[junit4] 2> at org.apache.lucene.util.TestRuleMarkFailure$1.evaluate(TestRuleMarkFailure.java:47)
[junit4] 2> at com.carrotsearch.randomizedtesting.rules.StatementAdapter.evaluate(StatementAdapter.java:36)
[junit4] 2> at com.carrotsearch.randomizedtesting.ThreadLeakControl$StatementRunner.run(ThreadLeakControl.java:368)
[junit4] 2> at com.carrotsearch.randomizedtesting.ThreadLeakControl.forkTimeoutingTask(ThreadLeakControl.java:817)
[junit4] 2> at com.carrotsearch.randomizedtesting.ThreadLeakControl$3.evaluate(ThreadLeakControl.java:468)
[junit4] 2> at com.carrotsearch.randomizedtesting.RandomizedRunner.runSingleTest(RandomizedRunner.java:916)
[junit4] 2> at com.carrotsearch.randomizedtesting.RandomizedRunner$5.evaluate(RandomizedRunner.java:802)
[junit4] 2> at com.carrotsearch.randomizedtesting.RandomizedRunner$6.evaluate(RandomizedRunner.java:852)
[junit4] 2> at com.carrotsearch.randomizedtesting.RandomizedRunner$7.evaluate(RandomizedRunner.java:863)
[junit4] 2> at com.carrotsearch.randomizedtesting.rules.StatementAdapter.evaluate(StatementAdapter.java:36)
[junit4] 2> at com.carrotsearch.randomizedtesting.rules.SystemPropertiesRestoreRule$1.evaluate(SystemPropertiesRestoreRule.java:57)
[junit4] 2> at org.apache.lucene.util.AbstractBeforeAfterRule$1.evaluate(AbstractBeforeAfterRule.java:45)
[junit4] 2> at com.carrotsearch.randomizedtesting.rules.StatementAdapter.evaluate(StatementAdapter.java:36)
[junit4] 2> at org.apache.lucene.util.TestRuleStoreClassName$1.evaluate(TestRuleStoreClassName.java:41)
[junit4] 2> at com.carrotsearch.randomizedtesting.rules.NoShadowingOrOverridesOnMethodsRule$1.evaluate(NoShadowingOrOverridesOnMethodsRule.java:40)
[junit4] 2> at com.carrotsearch.randomizedtesting.rules.NoShadowingOrOverridesOnMethodsRule$1.evaluate(NoShadowingOrOverridesOnMethodsRule.java:40)
[junit4] 2> at com.carrotsearch.randomizedtesting.rules.StatementAdapter.evaluate(StatementAdapter.java:36)
[junit4] 2> at com.carrotsearch.randomizedtesting.rules.StatementAdapter.evaluate(StatementAdapter.java:36)
[junit4] 2> at org.apache.lucene.util.TestRuleAssertionsRequired$1.evaluate(TestRuleAssertionsRequired.java:53)
[junit4] 2> at org.apache.lucene.util.TestRuleMarkFailure$1.evaluate(TestRuleMarkFailure.java:47)
[junit4] 2> at org.apache.lucene.util.TestRuleIgnoreAfterMaxFailures$1.evaluate(TestRuleIgnoreAfterMaxFailures.java:64)
[junit4] 2> at org.apache.lucene.util.TestRuleIgnoreTestSuites$1.evaluate(TestRuleIgnoreTestSuites.java:54)
[junit4] 2> at com.carrotsearch.randomizedtesting.rules.StatementAdapter.evaluate(StatementAdapter.java:36)
[junit4] 2> at com.carrotsearch.randomizedtesting.ThreadLeakControl$StatementRunner.run(ThreadLeakControl.java:368)
[junit4] 2> at java.base/java.lang.Thread.run(Thread.java:844)
[junit4] 2>
[junit4] 2> 1204424 INFO (TEST-MBeansHandlerTest.testDiff-seed#[281BFC041AE5AF3]) [ ] o.a.s.c.S.Request [collection1] webapp=null path=null params={qt=/admin/mbeans&stats=true&diff=true&wt=xml} status=500 QTime=116
[junit4] 2> 1204424 INFO (TEST-MBeansHandlerTest.testDiff-seed#[281BFC041AE5AF3]) [ ] o.a.s.SolrTestCaseJ4 ###Ending testDiff
[junit4] 2> NOTE: reproduce with: ant test -Dtestcase=MBeansHandlerTest -Dtests.method=testDiff -Dtests.seed=281BFC041AE5AF3 -Dtests.multiplier=3 -Dtests.slow=true -Dtests.locale=rw-RW -Dtests.timezone=Pacific/Port_Moresby -Dtests.asserts=true -Dtests.file.encoding=ISO-8859-1
[junit4] ERROR 0.13s J2 | MBeansHandlerTest.testDiff <<<
[junit4] > Throwable #1: java.lang.NullPointerException
[junit4] > at __randomizedtesting.SeedInfo.seed([281BFC041AE5AF3:C7977B5B51186293]:0)
[junit4] > at org.apache.solr.handler.admin.SolrInfoMBeanHandler.diffObject(SolrInfoMBeanHandler.java:240)
[junit4] > at org.apache.solr.handler.admin.SolrInfoMBeanHandler.diffNamedList(SolrInfoMBeanHandler.java:219)
[junit4] > at org.apache.solr.handler.admin.SolrInfoMBeanHandler.diffObject(SolrInfoMBeanHandler.java:238)
[junit4] > at org.apache.solr.handler.admin.SolrInfoMBeanHandler.diffNamedList(SolrInfoMBeanHandler.java:219)
[junit4] > at org.apache.solr.handler.admin.SolrInfoMBeanHandler.getDiff(SolrInfoMBeanHandler.java:187)
[junit4] > at org.apache.solr.handler.admin.SolrInfoMBeanHandler.handleRequestBody(SolrInfoMBeanHandler.java:87)
[junit4] > at org.apache.solr.handler.RequestHandlerBase.handleRequest(RequestHandlerBase.java:177)
[junit4] > at org.apache.solr.core.SolrCore.execute(SolrCore.java:2473)
[junit4] > at org.apache.solr.util.TestHarness.query(TestHarness.java:337)
[junit4] > at org.apache.solr.util.TestHarness.query(TestHarness.java:319)
[junit4] > at org.apache.solr.handler.admin.MBeansHandlerTest.testDiff(MBeansHandlerTest.java:57)
[junit4] > at java.base/jdk.internal.reflect.NativeMethodAccessorImpl.invoke0(Native Method)
[junit4] > at java.base/jdk.internal.reflect.NativeMethodAccessorImpl.invoke(NativeMethodAccessorImpl.java:62)
[junit4] > at java.base/jdk.internal.reflect.DelegatingMethodAccessorImpl.invoke(DelegatingMethodAccessorImpl.java:43)
[junit4] > at java.base/java.lang.reflect.Method.invoke(Method.java:564)
[junit4] > at java.base/java.lang.Thread.run(Thread.java:844)
[junit4] 2> 1204427 INFO (TEST-MBeansHandlerTest.testXMLDiffWithExternalEntity-seed#[281BFC041AE5AF3]) [ ] o.a.s.SolrTestCaseJ4 ###Starting testXMLDiffWithExternalEntity
[junit4] 2> 1204462 INFO (TEST-MBeansHandlerTest.testXMLDiffWithExternalEntity-seed#[281BFC041AE5AF3]) [ ] o.a.s.SolrTestCaseJ4 ###Ending testXMLDiffWithExternalEntity
[junit4] 2> 1204462 INFO (SUITE-MBeansHandlerTest-seed#[281BFC041AE5AF3]-worker) [ ] o.a.s.SolrTestCaseJ4 ###deleteCore
[junit4] 2> 1204463 INFO (SUITE-MBeansHandlerTest-seed#[281BFC041AE5AF3]-worker) [ ] o.a.s.c.CoreContainer Shutting down CoreContainer instance=1512156063
[junit4] 2> 1204463 INFO (SUITE-MBeansHandlerTest-seed#[281BFC041AE5AF3]-worker) [ ] o.a.s.m.SolrMetricManager Closing metric reporters for registry=solr.node, tag=null
[junit4] 2> 1204464 INFO (SUITE-MBeansHandlerTest-seed#[281BFC041AE5AF3]-worker) [ ] o.a.s.m.SolrMetricManager Closing metric reporters for registry=solr.jvm, tag=null
[junit4] 2> 1204465 INFO (SUITE-MBeansHandlerTest-seed#[281BFC041AE5AF3]-worker) [ ] o.a.s.m.SolrMetricManager Closing metric reporters for registry=solr.jetty, tag=null
[junit4] 2> 1204466 INFO (coreCloseExecutor-5344-thread-1) [ ] o.a.s.c.SolrCore [collection1] CLOSING SolrCore org.apache.solr.core.SolrCore@7ab9aad8
[junit4] 2> 1204480 INFO (coreCloseExecutor-5344-thread-1) [ ] o.a.s.m.SolrMetricManager Closing metric reporters for registry=solr.core.collection1, tag=2058988248
[junit4] 2> NOTE: leaving temporary files on disk at: /home/jenkins/workspace/Lucene-Solr-master-Linux/solr/build/solr-core/test/J2/temp/solr.handler.admin.MBeansHandlerTest_281BFC041AE5AF3-001
[junit4] 2> NOTE: test params are: codec=Asserting(Lucene70): {}, docValues:{}, maxPointsInLeafNode=1266, maxMBSortInHeap=5.325210763996018, sim=RandomSimilarity(queryNorm=true): {}, locale=rw-RW, timezone=Pacific/Port_Moresby
[junit4] 2> NOTE: Linux 4.10.0-21-generic amd64/Oracle Corporation 9 (64-bit)/cpus=8,threads=1,free=140800576,total=536870912
[junit4] 2> NOTE: All tests run in this JVM: [SpellCheckCollatorWithCollapseTest, TestHttpShardHandlerFactory, TestSort, BlockJoinFacetRandomTest, TestSystemCollAutoCreate, TestReload, DocExpirationUpdateProcessorFactoryTest, HardAutoCommitTest, DateFieldTest, TestCodecSupport, TestChildDocTransformer, OutOfBoxZkACLAndCredentialsProvidersTest, ShowFileRequestHandlerTest, TestStressCloudBlindAtomicUpdates, TestSolrCloudWithDelegationTokens, ChaosMonkeyNothingIsSafeWithPullReplicasTest, TestFileDictionaryLookup, HdfsWriteToMultipleCollectionsTest, TestTolerantSearch, SparseHLLTest, TestSearcherReuse, RequestLoggingTest, SecurityConfHandlerTest, TestShardHandlerFactory, TestScoreJoinQPScore, PrimitiveFieldTypeTest, SharedFSAutoReplicaFailoverUtilsTest, TestDistributedMissingSort, TestZkChroot, MoveReplicaTest, MergeStrategyTest, HdfsRecoveryZkTest, TestJsonFacets, BasicAuthStandaloneTest, URLClassifyProcessorTest, TestLMJelinekMercerSimilarityFactory, DistribCursorPagingTest, BlockCacheTest, TestTlogReplica, TestConfigSets, UnloadDistributedZkTest, DeleteInactiveReplicaTest, TestFastWriter, TestAddFieldRealTimeGet, TestCloudPivotFacet, TestMissingGroups, TermsComponentTest, TestRandomRequestDistribution, BigEndianAscendingWordSerializerTest, TestHdfsUpdateLog, TestUseDocValuesAsStored, TestExactStatsCache, AliasIntegrationTest, TestBulkSchemaConcurrent, SolrShardReporterTest, DateMathParserTest, TestSurroundQueryParser, TestFieldCache, MultiTermTest, TestRestManager, SolrCoreMetricManagerTest, TestSQLHandlerNonCloud, TestOverriddenPrefixQueryForCustomFieldType, TestSchemaSimilarityResource, SolrCloudExampleTest, ReturnFieldsTest, TestSlowCompositeReaderWrapper, SaslZkACLProviderTest, TestTrie, SolrIndexMetricsTest, TestPseudoReturnFields, ForceLeaderTest, FacetPivotSmallTest, TestDelegationWithHadoopAuth, TestSolrCoreProperties, LeaderElectionTest, CdcrUpdateLogTest, TestManagedSynonymGraphFilterFactory, PingRequestHandlerTest, HdfsBasicDistributedZkTest, OverseerModifyCollectionTest, FullHLLTest, UtilsToolTest, TestRTimerTree, TestCloudNestedDocsSort, TestCopyFieldCollectionResource, TestFieldCollectionResource, MinimalSchemaTest, TestNamedUpdateProcessors, ClassificationUpdateProcessorIntegrationTest, TestNonDefinedSimilarityFactory, TestApiFramework, TestRequestForwarding, BadIndexSchemaTest, TestSolrXml, NumericFieldsTest, SolrInfoBeanTest, TimeZoneUtilsTest, CircularListTest, TestStandardQParsers, TestDefaultStatsCache, StatsComponentTest, RemoteQueryErrorTest, TestReversedWildcardFilterFactory, PreAnalyzedUpdateProcessorTest, TestInitParams, TlogReplayBufferedWhileIndexingTest, TestGroupingSearch, AutoCommitTest, TestSegmentSorting, ClusterStateTest, TestRawResponseWriter, TestConfigReload, JavabinLoaderTest, RecoveryZkTest, QueryEqualityTest, HdfsThreadLeakTest, ClusterStateUpdateTest, TestRandomFaceting, ZkSolrClientTest, TestRecovery, TermVectorComponentDistributedTest, TestRealTimeGet, TestStressReorder, TestRangeQuery, SimplePostToolTest, TestCoreDiscovery, AnalysisAfterCoreReloadTest, SignatureUpdateProcessorFactoryTest, SuggesterFSTTest, SolrRequestParserTest, TestFoldingMultitermQuery, DocValuesTest, TestUpdate, TestAtomicUpdateErrorCases, SortByFunctionTest, TestRemoteStreaming, XsltUpdateRequestHandlerTest, CacheHeaderTest, LukeRequestHandlerTest, DocumentAnalysisRequestHandlerTest, TestOmitPositions, RequestHandlersTest, PathHierarchyTokenizerFactoryTest, TestIndexingPerformance, RequiredFieldsTest, TestSolrQueryParser, LoggingHandlerTest, TestJmxIntegration, MBeansHandlerTest]
[junit4] Completed [433/725 (1!)] on J2 in 1.06s, 2 tests, 1 error <<< FAILURES!
[...truncated 37449 lines...]
[JENKINS] Lucene-Solr-master-Linux (32bit/jdk1.8.0_131) - Build #
20050 - Still Unstable!
Posted by Policeman Jenkins Server <je...@thetaphi.de>.
Build: https://jenkins.thetaphi.de/job/Lucene-Solr-master-Linux/20050/
Java: 32bit/jdk1.8.0_131 -server -XX:+UseSerialGC
2 tests failed.
FAILED: org.apache.solr.cloud.DocValuesNotIndexedTest.testGroupingDocAbsent
Error Message:
Did not find the expected number of groups for field intGSF expected:<4> but was:<3>
Stack Trace:
java.lang.AssertionError: Did not find the expected number of groups for field intGSF expected:<4> but was:<3>
at __randomizedtesting.SeedInfo.seed([BBB496829EB0D1C0:65034D0A7BE19105]:0)
at org.junit.Assert.fail(Assert.java:93)
at org.junit.Assert.failNotEquals(Assert.java:647)
at org.junit.Assert.assertEquals(Assert.java:128)
at org.junit.Assert.assertEquals(Assert.java:472)
at org.apache.solr.cloud.DocValuesNotIndexedTest.testGroupingDocAbsent(DocValuesNotIndexedTest.java:304)
at sun.reflect.NativeMethodAccessorImpl.invoke0(Native Method)
at sun.reflect.NativeMethodAccessorImpl.invoke(NativeMethodAccessorImpl.java:62)
at sun.reflect.DelegatingMethodAccessorImpl.invoke(DelegatingMethodAccessorImpl.java:43)
at java.lang.reflect.Method.invoke(Method.java:498)
at com.carrotsearch.randomizedtesting.RandomizedRunner.invoke(RandomizedRunner.java:1713)
at com.carrotsearch.randomizedtesting.RandomizedRunner$8.evaluate(RandomizedRunner.java:907)
at com.carrotsearch.randomizedtesting.RandomizedRunner$9.evaluate(RandomizedRunner.java:943)
at com.carrotsearch.randomizedtesting.RandomizedRunner$10.evaluate(RandomizedRunner.java:957)
at com.carrotsearch.randomizedtesting.rules.SystemPropertiesRestoreRule$1.evaluate(SystemPropertiesRestoreRule.java:57)
at org.apache.lucene.util.TestRuleSetupTeardownChained$1.evaluate(TestRuleSetupTeardownChained.java:49)
at org.apache.lucene.util.AbstractBeforeAfterRule$1.evaluate(AbstractBeforeAfterRule.java:45)
at org.apache.lucene.util.TestRuleThreadAndTestName$1.evaluate(TestRuleThreadAndTestName.java:48)
at org.apache.lucene.util.TestRuleIgnoreAfterMaxFailures$1.evaluate(TestRuleIgnoreAfterMaxFailures.java:64)
at org.apache.lucene.util.TestRuleMarkFailure$1.evaluate(TestRuleMarkFailure.java:47)
at com.carrotsearch.randomizedtesting.rules.StatementAdapter.evaluate(StatementAdapter.java:36)
at com.carrotsearch.randomizedtesting.ThreadLeakControl$StatementRunner.run(ThreadLeakControl.java:368)
at com.carrotsearch.randomizedtesting.ThreadLeakControl.forkTimeoutingTask(ThreadLeakControl.java:817)
at com.carrotsearch.randomizedtesting.ThreadLeakControl$3.evaluate(ThreadLeakControl.java:468)
at com.carrotsearch.randomizedtesting.RandomizedRunner.runSingleTest(RandomizedRunner.java:916)
at com.carrotsearch.randomizedtesting.RandomizedRunner$5.evaluate(RandomizedRunner.java:802)
at com.carrotsearch.randomizedtesting.RandomizedRunner$6.evaluate(RandomizedRunner.java:852)
at com.carrotsearch.randomizedtesting.RandomizedRunner$7.evaluate(RandomizedRunner.java:863)
at com.carrotsearch.randomizedtesting.rules.StatementAdapter.evaluate(StatementAdapter.java:36)
at com.carrotsearch.randomizedtesting.rules.SystemPropertiesRestoreRule$1.evaluate(SystemPropertiesRestoreRule.java:57)
at org.apache.lucene.util.AbstractBeforeAfterRule$1.evaluate(AbstractBeforeAfterRule.java:45)
at com.carrotsearch.randomizedtesting.rules.StatementAdapter.evaluate(StatementAdapter.java:36)
at org.apache.lucene.util.TestRuleStoreClassName$1.evaluate(TestRuleStoreClassName.java:41)
at com.carrotsearch.randomizedtesting.rules.NoShadowingOrOverridesOnMethodsRule$1.evaluate(NoShadowingOrOverridesOnMethodsRule.java:40)
at com.carrotsearch.randomizedtesting.rules.NoShadowingOrOverridesOnMethodsRule$1.evaluate(NoShadowingOrOverridesOnMethodsRule.java:40)
at com.carrotsearch.randomizedtesting.rules.StatementAdapter.evaluate(StatementAdapter.java:36)
at com.carrotsearch.randomizedtesting.rules.StatementAdapter.evaluate(StatementAdapter.java:36)
at com.carrotsearch.randomizedtesting.rules.StatementAdapter.evaluate(StatementAdapter.java:36)
at org.apache.lucene.util.TestRuleAssertionsRequired$1.evaluate(TestRuleAssertionsRequired.java:53)
at org.apache.lucene.util.TestRuleMarkFailure$1.evaluate(TestRuleMarkFailure.java:47)
at org.apache.lucene.util.TestRuleIgnoreAfterMaxFailures$1.evaluate(TestRuleIgnoreAfterMaxFailures.java:64)
at org.apache.lucene.util.TestRuleIgnoreTestSuites$1.evaluate(TestRuleIgnoreTestSuites.java:54)
at com.carrotsearch.randomizedtesting.rules.StatementAdapter.evaluate(StatementAdapter.java:36)
at com.carrotsearch.randomizedtesting.ThreadLeakControl$StatementRunner.run(ThreadLeakControl.java:368)
at java.lang.Thread.run(Thread.java:748)
FAILED: org.apache.solr.cloud.LeaderFailoverAfterPartitionTest.test
Error Message:
Expected 2 of 3 replicas to be active but only found 1; [core_node2:{"core":"c8n_1x3_lf_shard1_replica_n2","base_url":"http://127.0.0.1:38231","node_name":"127.0.0.1:38231_","state":"active","type":"NRT","leader":"true"}]; clusterState: DocCollection(c8n_1x3_lf//collections/c8n_1x3_lf/state.json/17)={ "pullReplicas":"0", "replicationFactor":"1", "shards":{"shard1":{ "range":"80000000-7fffffff", "state":"active", "replicas":{ "core_node1":{ "state":"down", "base_url":"http://127.0.0.1:39283", "core":"c8n_1x3_lf_shard1_replica_n1", "node_name":"127.0.0.1:39283_", "type":"NRT"}, "core_node2":{ "core":"c8n_1x3_lf_shard1_replica_n2", "base_url":"http://127.0.0.1:38231", "node_name":"127.0.0.1:38231_", "state":"active", "type":"NRT", "leader":"true"}, "core_node3":{ "core":"c8n_1x3_lf_shard1_replica_n3", "base_url":"http://127.0.0.1:38719", "node_name":"127.0.0.1:38719_", "state":"down", "type":"NRT"}}}}, "router":{"name":"compositeId"}, "maxShardsPerNode":"1", "autoAddReplicas":"false", "nrtReplicas":"3", "tlogReplicas":"0"}
Stack Trace:
java.lang.AssertionError: Expected 2 of 3 replicas to be active but only found 1; [core_node2:{"core":"c8n_1x3_lf_shard1_replica_n2","base_url":"http://127.0.0.1:38231","node_name":"127.0.0.1:38231_","state":"active","type":"NRT","leader":"true"}]; clusterState: DocCollection(c8n_1x3_lf//collections/c8n_1x3_lf/state.json/17)={
"pullReplicas":"0",
"replicationFactor":"1",
"shards":{"shard1":{
"range":"80000000-7fffffff",
"state":"active",
"replicas":{
"core_node1":{
"state":"down",
"base_url":"http://127.0.0.1:39283",
"core":"c8n_1x3_lf_shard1_replica_n1",
"node_name":"127.0.0.1:39283_",
"type":"NRT"},
"core_node2":{
"core":"c8n_1x3_lf_shard1_replica_n2",
"base_url":"http://127.0.0.1:38231",
"node_name":"127.0.0.1:38231_",
"state":"active",
"type":"NRT",
"leader":"true"},
"core_node3":{
"core":"c8n_1x3_lf_shard1_replica_n3",
"base_url":"http://127.0.0.1:38719",
"node_name":"127.0.0.1:38719_",
"state":"down",
"type":"NRT"}}}},
"router":{"name":"compositeId"},
"maxShardsPerNode":"1",
"autoAddReplicas":"false",
"nrtReplicas":"3",
"tlogReplicas":"0"}
at __randomizedtesting.SeedInfo.seed([BBB496829EB0D1C0:33E0A958304CBC38]:0)
at org.junit.Assert.fail(Assert.java:93)
at org.junit.Assert.assertTrue(Assert.java:43)
at org.apache.solr.cloud.LeaderFailoverAfterPartitionTest.testRf3WithLeaderFailover(LeaderFailoverAfterPartitionTest.java:169)
at org.apache.solr.cloud.LeaderFailoverAfterPartitionTest.test(LeaderFailoverAfterPartitionTest.java:56)
at sun.reflect.NativeMethodAccessorImpl.invoke0(Native Method)
at sun.reflect.NativeMethodAccessorImpl.invoke(NativeMethodAccessorImpl.java:62)
at sun.reflect.DelegatingMethodAccessorImpl.invoke(DelegatingMethodAccessorImpl.java:43)
at java.lang.reflect.Method.invoke(Method.java:498)
at com.carrotsearch.randomizedtesting.RandomizedRunner.invoke(RandomizedRunner.java:1713)
at com.carrotsearch.randomizedtesting.RandomizedRunner$8.evaluate(RandomizedRunner.java:907)
at com.carrotsearch.randomizedtesting.RandomizedRunner$9.evaluate(RandomizedRunner.java:943)
at com.carrotsearch.randomizedtesting.RandomizedRunner$10.evaluate(RandomizedRunner.java:957)
at org.apache.solr.BaseDistributedSearchTestCase$ShardsRepeatRule$ShardsFixedStatement.callStatement(BaseDistributedSearchTestCase.java:985)
at org.apache.solr.BaseDistributedSearchTestCase$ShardsRepeatRule$ShardsStatement.evaluate(BaseDistributedSearchTestCase.java:960)
at com.carrotsearch.randomizedtesting.rules.SystemPropertiesRestoreRule$1.evaluate(SystemPropertiesRestoreRule.java:57)
at org.apache.lucene.util.TestRuleSetupTeardownChained$1.evaluate(TestRuleSetupTeardownChained.java:49)
at org.apache.lucene.util.AbstractBeforeAfterRule$1.evaluate(AbstractBeforeAfterRule.java:45)
at org.apache.lucene.util.TestRuleThreadAndTestName$1.evaluate(TestRuleThreadAndTestName.java:48)
at org.apache.lucene.util.TestRuleIgnoreAfterMaxFailures$1.evaluate(TestRuleIgnoreAfterMaxFailures.java:64)
at org.apache.lucene.util.TestRuleMarkFailure$1.evaluate(TestRuleMarkFailure.java:47)
at com.carrotsearch.randomizedtesting.rules.StatementAdapter.evaluate(StatementAdapter.java:36)
at com.carrotsearch.randomizedtesting.ThreadLeakControl$StatementRunner.run(ThreadLeakControl.java:368)
at com.carrotsearch.randomizedtesting.ThreadLeakControl.forkTimeoutingTask(ThreadLeakControl.java:817)
at com.carrotsearch.randomizedtesting.ThreadLeakControl$3.evaluate(ThreadLeakControl.java:468)
at com.carrotsearch.randomizedtesting.RandomizedRunner.runSingleTest(RandomizedRunner.java:916)
at com.carrotsearch.randomizedtesting.RandomizedRunner$5.evaluate(RandomizedRunner.java:802)
at com.carrotsearch.randomizedtesting.RandomizedRunner$6.evaluate(RandomizedRunner.java:852)
at com.carrotsearch.randomizedtesting.RandomizedRunner$7.evaluate(RandomizedRunner.java:863)
at com.carrotsearch.randomizedtesting.rules.StatementAdapter.evaluate(StatementAdapter.java:36)
at com.carrotsearch.randomizedtesting.rules.SystemPropertiesRestoreRule$1.evaluate(SystemPropertiesRestoreRule.java:57)
at org.apache.lucene.util.AbstractBeforeAfterRule$1.evaluate(AbstractBeforeAfterRule.java:45)
at com.carrotsearch.randomizedtesting.rules.StatementAdapter.evaluate(StatementAdapter.java:36)
at org.apache.lucene.util.TestRuleStoreClassName$1.evaluate(TestRuleStoreClassName.java:41)
at com.carrotsearch.randomizedtesting.rules.NoShadowingOrOverridesOnMethodsRule$1.evaluate(NoShadowingOrOverridesOnMethodsRule.java:40)
at com.carrotsearch.randomizedtesting.rules.NoShadowingOrOverridesOnMethodsRule$1.evaluate(NoShadowingOrOverridesOnMethodsRule.java:40)
at com.carrotsearch.randomizedtesting.rules.StatementAdapter.evaluate(StatementAdapter.java:36)
at com.carrotsearch.randomizedtesting.rules.StatementAdapter.evaluate(StatementAdapter.java:36)
at com.carrotsearch.randomizedtesting.rules.StatementAdapter.evaluate(StatementAdapter.java:36)
at org.apache.lucene.util.TestRuleAssertionsRequired$1.evaluate(TestRuleAssertionsRequired.java:53)
at org.apache.lucene.util.TestRuleMarkFailure$1.evaluate(TestRuleMarkFailure.java:47)
at org.apache.lucene.util.TestRuleIgnoreAfterMaxFailures$1.evaluate(TestRuleIgnoreAfterMaxFailures.java:64)
at org.apache.lucene.util.TestRuleIgnoreTestSuites$1.evaluate(TestRuleIgnoreTestSuites.java:54)
at com.carrotsearch.randomizedtesting.rules.StatementAdapter.evaluate(StatementAdapter.java:36)
at com.carrotsearch.randomizedtesting.ThreadLeakControl$StatementRunner.run(ThreadLeakControl.java:368)
at java.lang.Thread.run(Thread.java:748)
Build Log:
[...truncated 12357 lines...]
[junit4] Suite: org.apache.solr.cloud.DocValuesNotIndexedTest
[junit4] 2> Creating dataDir: /home/jenkins/workspace/Lucene-Solr-master-Linux/solr/build/solr-core/test/J0/temp/solr.cloud.DocValuesNotIndexedTest_BBB496829EB0D1C0-001/init-core-data-001
[junit4] 2> 1292932 WARN (SUITE-DocValuesNotIndexedTest-seed#[BBB496829EB0D1C0]-worker) [ ] o.a.s.SolrTestCaseJ4 startTrackingSearchers: numOpens=61 numCloses=61
[junit4] 2> 1292933 INFO (SUITE-DocValuesNotIndexedTest-seed#[BBB496829EB0D1C0]-worker) [ ] o.a.s.SolrTestCaseJ4 Using TrieFields (NUMERIC_POINTS_SYSPROP=false) w/NUMERIC_DOCVALUES_SYSPROP=true
[junit4] 2> 1292934 INFO (SUITE-DocValuesNotIndexedTest-seed#[BBB496829EB0D1C0]-worker) [ ] o.a.s.SolrTestCaseJ4 Randomized ssl (true) and clientAuth (false) via: @org.apache.solr.util.RandomizeSSL(reason=, ssl=NaN, value=NaN, clientAuth=NaN)
[junit4] 2> 1292934 INFO (SUITE-DocValuesNotIndexedTest-seed#[BBB496829EB0D1C0]-worker) [ ] o.a.s.c.MiniSolrCloudCluster Starting cluster of 2 servers in /home/jenkins/workspace/Lucene-Solr-master-Linux/solr/build/solr-core/test/J0/temp/solr.cloud.DocValuesNotIndexedTest_BBB496829EB0D1C0-001/tempDir-001
[junit4] 2> 1292934 INFO (SUITE-DocValuesNotIndexedTest-seed#[BBB496829EB0D1C0]-worker) [ ] o.a.s.c.ZkTestServer STARTING ZK TEST SERVER
[junit4] 2> 1292934 INFO (Thread-5664) [ ] o.a.s.c.ZkTestServer client port:0.0.0.0/0.0.0.0:0
[junit4] 2> 1292934 INFO (Thread-5664) [ ] o.a.s.c.ZkTestServer Starting server
[junit4] 2> 1292935 ERROR (Thread-5664) [ ] o.a.z.s.ZooKeeperServer ZKShutdownHandler is not registered, so ZooKeeper server won't take any action on ERROR or SHUTDOWN server state changes
[junit4] 2> 1293035 INFO (SUITE-DocValuesNotIndexedTest-seed#[BBB496829EB0D1C0]-worker) [ ] o.a.s.c.ZkTestServer start zk server on port:42539
[junit4] 2> 1293039 INFO (jetty-launcher-1613-thread-2) [ ] o.e.j.s.Server jetty-9.3.14.v20161028
[junit4] 2> 1293039 INFO (jetty-launcher-1613-thread-1) [ ] o.e.j.s.Server jetty-9.3.14.v20161028
[junit4] 2> 1293047 INFO (jetty-launcher-1613-thread-1) [ ] o.e.j.s.h.ContextHandler Started o.e.j.s.ServletContextHandler@a7cc12{/solr,null,AVAILABLE}
[junit4] 2> 1293047 INFO (jetty-launcher-1613-thread-2) [ ] o.e.j.s.h.ContextHandler Started o.e.j.s.ServletContextHandler@6ad694{/solr,null,AVAILABLE}
[junit4] 2> 1293048 INFO (jetty-launcher-1613-thread-1) [ ] o.e.j.s.AbstractConnector Started ServerConnector@835d42{SSL,[ssl, http/1.1]}{127.0.0.1:39439}
[junit4] 2> 1293048 INFO (jetty-launcher-1613-thread-2) [ ] o.e.j.s.AbstractConnector Started ServerConnector@198a9b3{SSL,[ssl, http/1.1]}{127.0.0.1:33565}
[junit4] 2> 1293048 INFO (jetty-launcher-1613-thread-1) [ ] o.e.j.s.Server Started @1295695ms
[junit4] 2> 1293048 INFO (jetty-launcher-1613-thread-2) [ ] o.e.j.s.Server Started @1295695ms
[junit4] 2> 1293048 INFO (jetty-launcher-1613-thread-1) [ ] o.a.s.c.s.e.JettySolrRunner Jetty properties: {hostContext=/solr, hostPort=39439}
[junit4] 2> 1293048 INFO (jetty-launcher-1613-thread-2) [ ] o.a.s.c.s.e.JettySolrRunner Jetty properties: {hostContext=/solr, hostPort=33565}
[junit4] 2> 1293048 ERROR (jetty-launcher-1613-thread-1) [ ] o.a.s.s.StartupLoggingUtils Missing Java Option solr.log.dir. Logging may be missing or incomplete.
[junit4] 2> 1293048 ERROR (jetty-launcher-1613-thread-2) [ ] o.a.s.s.StartupLoggingUtils Missing Java Option solr.log.dir. Logging may be missing or incomplete.
[junit4] 2> 1293049 INFO (jetty-launcher-1613-thread-1) [ ] o.a.s.s.SolrDispatchFilter ___ _ Welcome to Apache Solrâ„¢ version 8.0.0
[junit4] 2> 1293049 INFO (jetty-launcher-1613-thread-2) [ ] o.a.s.s.SolrDispatchFilter ___ _ Welcome to Apache Solrâ„¢ version 8.0.0
[junit4] 2> 1293049 INFO (jetty-launcher-1613-thread-1) [ ] o.a.s.s.SolrDispatchFilter / __| ___| |_ _ Starting in cloud mode on port null
[junit4] 2> 1293049 INFO (jetty-launcher-1613-thread-2) [ ] o.a.s.s.SolrDispatchFilter / __| ___| |_ _ Starting in cloud mode on port null
[junit4] 2> 1293049 INFO (jetty-launcher-1613-thread-1) [ ] o.a.s.s.SolrDispatchFilter \__ \/ _ \ | '_| Install dir: null, Default config dir: null
[junit4] 2> 1293049 INFO (jetty-launcher-1613-thread-2) [ ] o.a.s.s.SolrDispatchFilter \__ \/ _ \ | '_| Install dir: null, Default config dir: null
[junit4] 2> 1293049 INFO (jetty-launcher-1613-thread-1) [ ] o.a.s.s.SolrDispatchFilter |___/\___/_|_| Start time: 2017-07-03T20:13:35.557Z
[junit4] 2> 1293049 INFO (jetty-launcher-1613-thread-2) [ ] o.a.s.s.SolrDispatchFilter |___/\___/_|_| Start time: 2017-07-03T20:13:35.557Z
[junit4] 2> 1293050 INFO (jetty-launcher-1613-thread-1) [ ] o.a.s.s.SolrDispatchFilter solr.xml found in ZooKeeper. Loading...
[junit4] 2> 1293051 INFO (jetty-launcher-1613-thread-2) [ ] o.a.s.s.SolrDispatchFilter solr.xml found in ZooKeeper. Loading...
[junit4] 2> 1293055 INFO (jetty-launcher-1613-thread-1) [ ] o.a.s.c.ZkContainer Zookeeper client=127.0.0.1:42539/solr
[junit4] 2> 1293056 INFO (jetty-launcher-1613-thread-2) [ ] o.a.s.c.ZkContainer Zookeeper client=127.0.0.1:42539/solr
[junit4] 2> 1293100 INFO (jetty-launcher-1613-thread-2) [n:127.0.0.1:33565_solr ] o.a.s.c.Overseer Overseer (id=null) closing
[junit4] 2> 1293100 INFO (jetty-launcher-1613-thread-2) [n:127.0.0.1:33565_solr ] o.a.s.c.OverseerElectionContext I am going to be the leader 127.0.0.1:33565_solr
[junit4] 2> 1293100 INFO (jetty-launcher-1613-thread-2) [n:127.0.0.1:33565_solr ] o.a.s.c.Overseer Overseer (id=98245857472872454-127.0.0.1:33565_solr-n_0000000000) starting
[junit4] 2> 1293103 INFO (jetty-launcher-1613-thread-1) [n:127.0.0.1:39439_solr ] o.a.s.c.Overseer Overseer (id=null) closing
[junit4] 2> 1293113 INFO (jetty-launcher-1613-thread-1) [n:127.0.0.1:39439_solr ] o.a.s.c.ZkController Register node as live in ZooKeeper:/live_nodes/127.0.0.1:39439_solr
[junit4] 2> 1293113 INFO (jetty-launcher-1613-thread-2) [n:127.0.0.1:33565_solr ] o.a.s.c.ZkController Register node as live in ZooKeeper:/live_nodes/127.0.0.1:33565_solr
[junit4] 2> 1293114 INFO (zkCallback-1625-thread-1-processing-n:127.0.0.1:33565_solr) [n:127.0.0.1:33565_solr ] o.a.s.c.c.ZkStateReader Updated live nodes from ZooKeeper... (0) -> (1)
[junit4] 2> 1293114 INFO (zkCallback-1624-thread-1-processing-n:127.0.0.1:39439_solr) [n:127.0.0.1:39439_solr ] o.a.s.c.c.ZkStateReader Updated live nodes from ZooKeeper... (0) -> (1)
[junit4] 2> 1293117 INFO (zkCallback-1625-thread-1-processing-n:127.0.0.1:33565_solr) [n:127.0.0.1:33565_solr ] o.a.s.c.c.ZkStateReader Updated live nodes from ZooKeeper... (1) -> (2)
[junit4] 2> 1293131 INFO (zkCallback-1624-thread-1-processing-n:127.0.0.1:39439_solr) [n:127.0.0.1:39439_solr ] o.a.s.c.c.ZkStateReader Updated live nodes from ZooKeeper... (1) -> (2)
[junit4] 2> 1293176 INFO (jetty-launcher-1613-thread-1) [n:127.0.0.1:39439_solr ] o.a.s.m.r.SolrJmxReporter JMX monitoring for 'solr_39439.solr.node' (registry 'solr.node') enabled at server: com.sun.jmx.mbeanserver.JmxMBeanServer@110ae24
[junit4] 2> 1293180 INFO (jetty-launcher-1613-thread-1) [n:127.0.0.1:39439_solr ] o.a.s.m.r.SolrJmxReporter JMX monitoring for 'solr_39439.solr.jvm' (registry 'solr.jvm') enabled at server: com.sun.jmx.mbeanserver.JmxMBeanServer@110ae24
[junit4] 2> 1293180 INFO (jetty-launcher-1613-thread-1) [n:127.0.0.1:39439_solr ] o.a.s.m.r.SolrJmxReporter JMX monitoring for 'solr_39439.solr.jetty' (registry 'solr.jetty') enabled at server: com.sun.jmx.mbeanserver.JmxMBeanServer@110ae24
[junit4] 2> 1293181 INFO (jetty-launcher-1613-thread-1) [n:127.0.0.1:39439_solr ] o.a.s.c.CorePropertiesLocator Found 0 core definitions underneath /home/jenkins/workspace/Lucene-Solr-master-Linux/solr/build/solr-core/test/J0/temp/solr.cloud.DocValuesNotIndexedTest_BBB496829EB0D1C0-001/tempDir-001/node1/.
[junit4] 2> 1293215 INFO (jetty-launcher-1613-thread-2) [n:127.0.0.1:33565_solr ] o.a.s.m.r.SolrJmxReporter JMX monitoring for 'solr_33565.solr.node' (registry 'solr.node') enabled at server: com.sun.jmx.mbeanserver.JmxMBeanServer@110ae24
[junit4] 2> 1293218 INFO (jetty-launcher-1613-thread-2) [n:127.0.0.1:33565_solr ] o.a.s.m.r.SolrJmxReporter JMX monitoring for 'solr_33565.solr.jvm' (registry 'solr.jvm') enabled at server: com.sun.jmx.mbeanserver.JmxMBeanServer@110ae24
[junit4] 2> 1293218 INFO (jetty-launcher-1613-thread-2) [n:127.0.0.1:33565_solr ] o.a.s.m.r.SolrJmxReporter JMX monitoring for 'solr_33565.solr.jetty' (registry 'solr.jetty') enabled at server: com.sun.jmx.mbeanserver.JmxMBeanServer@110ae24
[junit4] 2> 1293219 INFO (jetty-launcher-1613-thread-2) [n:127.0.0.1:33565_solr ] o.a.s.c.CorePropertiesLocator Found 0 core definitions underneath /home/jenkins/workspace/Lucene-Solr-master-Linux/solr/build/solr-core/test/J0/temp/solr.cloud.DocValuesNotIndexedTest_BBB496829EB0D1C0-001/tempDir-001/node2/.
[junit4] 2> 1293232 INFO (SUITE-DocValuesNotIndexedTest-seed#[BBB496829EB0D1C0]-worker) [ ] o.a.s.c.c.ZkStateReader Updated live nodes from ZooKeeper... (0) -> (2)
[junit4] 2> 1293232 INFO (SUITE-DocValuesNotIndexedTest-seed#[BBB496829EB0D1C0]-worker) [ ] o.a.s.c.s.i.ZkClientClusterStateProvider Cluster at 127.0.0.1:42539/solr ready
[junit4] 2> 1293264 INFO (qtp18810426-14491) [n:127.0.0.1:33565_solr ] o.a.s.h.a.CollectionsHandler Invoked Collection Action :create with params replicationFactor=1&collection.configName=conf1&maxShardsPerNode=2&name=dv_coll&nrtReplicas=1&action=CREATE&numShards=4&wt=javabin&version=2 and sendToOCPQueue=true
[junit4] 2> 1293265 INFO (OverseerThreadFactory-5060-thread-1-processing-n:127.0.0.1:33565_solr) [n:127.0.0.1:33565_solr ] o.a.s.c.CreateCollectionCmd Create collection dv_coll
[junit4] 2> 1293369 INFO (OverseerStateUpdate-98245857472872454-127.0.0.1:33565_solr-n_0000000000) [n:127.0.0.1:33565_solr ] o.a.s.c.o.SliceMutator createReplica() {
[junit4] 2> "operation":"ADDREPLICA",
[junit4] 2> "collection":"dv_coll",
[junit4] 2> "shard":"shard1",
[junit4] 2> "core":"dv_coll_shard1_replica_n1",
[junit4] 2> "state":"down",
[junit4] 2> "base_url":"https://127.0.0.1:39439/solr",
[junit4] 2> "type":"NRT"}
[junit4] 2> 1293370 INFO (OverseerStateUpdate-98245857472872454-127.0.0.1:33565_solr-n_0000000000) [n:127.0.0.1:33565_solr ] o.a.s.c.o.SliceMutator createReplica() {
[junit4] 2> "operation":"ADDREPLICA",
[junit4] 2> "collection":"dv_coll",
[junit4] 2> "shard":"shard2",
[junit4] 2> "core":"dv_coll_shard2_replica_n1",
[junit4] 2> "state":"down",
[junit4] 2> "base_url":"https://127.0.0.1:33565/solr",
[junit4] 2> "type":"NRT"}
[junit4] 2> 1293370 INFO (OverseerStateUpdate-98245857472872454-127.0.0.1:33565_solr-n_0000000000) [n:127.0.0.1:33565_solr ] o.a.s.c.o.SliceMutator createReplica() {
[junit4] 2> "operation":"ADDREPLICA",
[junit4] 2> "collection":"dv_coll",
[junit4] 2> "shard":"shard3",
[junit4] 2> "core":"dv_coll_shard3_replica_n1",
[junit4] 2> "state":"down",
[junit4] 2> "base_url":"https://127.0.0.1:39439/solr",
[junit4] 2> "type":"NRT"}
[junit4] 2> 1293370 INFO (OverseerStateUpdate-98245857472872454-127.0.0.1:33565_solr-n_0000000000) [n:127.0.0.1:33565_solr ] o.a.s.c.o.SliceMutator createReplica() {
[junit4] 2> "operation":"ADDREPLICA",
[junit4] 2> "collection":"dv_coll",
[junit4] 2> "shard":"shard4",
[junit4] 2> "core":"dv_coll_shard4_replica_n1",
[junit4] 2> "state":"down",
[junit4] 2> "base_url":"https://127.0.0.1:33565/solr",
[junit4] 2> "type":"NRT"}
[junit4] 2> 1293573 INFO (qtp18810426-14495) [n:127.0.0.1:33565_solr ] o.a.s.h.a.CoreAdminOperation core create command qt=/admin/cores&coreNodeName=core_node4&collection.configName=conf1&newCollection=true&name=dv_coll_shard4_replica_n1&action=CREATE&numShards=4&collection=dv_coll&shard=shard4&wt=javabin&version=2&replicaType=NRT
[junit4] 2> 1293573 INFO (qtp18810426-14495) [n:127.0.0.1:33565_solr ] o.a.s.c.TransientSolrCoreCacheDefault Allocating transient cache for 2147483647 transient cores
[junit4] 2> 1293576 INFO (qtp18810426-14545) [n:127.0.0.1:33565_solr ] o.a.s.h.a.CoreAdminOperation core create command qt=/admin/cores&coreNodeName=core_node2&collection.configName=conf1&newCollection=true&name=dv_coll_shard2_replica_n1&action=CREATE&numShards=4&collection=dv_coll&shard=shard2&wt=javabin&version=2&replicaType=NRT
[junit4] 2> 1293595 INFO (qtp20456943-14481) [n:127.0.0.1:39439_solr ] o.a.s.h.a.CoreAdminOperation core create command qt=/admin/cores&coreNodeName=core_node3&collection.configName=conf1&newCollection=true&name=dv_coll_shard3_replica_n1&action=CREATE&numShards=4&collection=dv_coll&shard=shard3&wt=javabin&version=2&replicaType=NRT
[junit4] 2> 1293595 INFO (qtp20456943-14481) [n:127.0.0.1:39439_solr ] o.a.s.c.TransientSolrCoreCacheDefault Allocating transient cache for 2147483647 transient cores
[junit4] 2> 1293602 INFO (qtp20456943-14492) [n:127.0.0.1:39439_solr ] o.a.s.h.a.CoreAdminOperation core create command qt=/admin/cores&coreNodeName=core_node1&collection.configName=conf1&newCollection=true&name=dv_coll_shard1_replica_n1&action=CREATE&numShards=4&collection=dv_coll&shard=shard1&wt=javabin&version=2&replicaType=NRT
[junit4] 2> 1293704 INFO (zkCallback-1625-thread-1-processing-n:127.0.0.1:33565_solr) [n:127.0.0.1:33565_solr ] o.a.s.c.c.ZkStateReader A cluster state change: [WatchedEvent state:SyncConnected type:NodeDataChanged path:/collections/dv_coll/state.json] for collection [dv_coll] has occurred - updating... (live nodes size: [2])
[junit4] 2> 1293704 INFO (zkCallback-1624-thread-1-processing-n:127.0.0.1:39439_solr) [n:127.0.0.1:39439_solr ] o.a.s.c.c.ZkStateReader A cluster state change: [WatchedEvent state:SyncConnected type:NodeDataChanged path:/collections/dv_coll/state.json] for collection [dv_coll] has occurred - updating... (live nodes size: [2])
[junit4] 2> 1293704 INFO (zkCallback-1624-thread-2-processing-n:127.0.0.1:39439_solr) [n:127.0.0.1:39439_solr ] o.a.s.c.c.ZkStateReader A cluster state change: [WatchedEvent state:SyncConnected type:NodeDataChanged path:/collections/dv_coll/state.json] for collection [dv_coll] has occurred - updating... (live nodes size: [2])
[junit4] 2> 1294582 INFO (qtp18810426-14545) [n:127.0.0.1:33565_solr c:dv_coll s:shard2 r:core_node2 x:dv_coll_shard2_replica_n1] o.a.s.c.SolrConfig Using Lucene MatchVersion: 8.0.0
[junit4] 2> 1294600 INFO (qtp18810426-14495) [n:127.0.0.1:33565_solr c:dv_coll s:shard4 r:core_node4 x:dv_coll_shard4_replica_n1] o.a.s.c.SolrConfig Using Lucene MatchVersion: 8.0.0
[junit4] 2> 1294601 INFO (qtp18810426-14545) [n:127.0.0.1:33565_solr c:dv_coll s:shard2 r:core_node2 x:dv_coll_shard2_replica_n1] o.a.s.s.IndexSchema [dv_coll_shard2_replica_n1] Schema name=minimal
[junit4] 2> 1294603 INFO (qtp20456943-14481) [n:127.0.0.1:39439_solr c:dv_coll s:shard3 r:core_node3 x:dv_coll_shard3_replica_n1] o.a.s.c.SolrConfig Using Lucene MatchVersion: 8.0.0
[junit4] 2> 1294603 INFO (qtp18810426-14545) [n:127.0.0.1:33565_solr c:dv_coll s:shard2 r:core_node2 x:dv_coll_shard2_replica_n1] o.a.s.s.IndexSchema Loaded schema minimal/1.1 with uniqueid field id
[junit4] 2> 1294603 INFO (qtp18810426-14545) [n:127.0.0.1:33565_solr c:dv_coll s:shard2 r:core_node2 x:dv_coll_shard2_replica_n1] o.a.s.c.CoreContainer Creating SolrCore 'dv_coll_shard2_replica_n1' using configuration from collection dv_coll, trusted=true
[junit4] 2> 1294604 INFO (qtp18810426-14545) [n:127.0.0.1:33565_solr c:dv_coll s:shard2 r:core_node2 x:dv_coll_shard2_replica_n1] o.a.s.m.r.SolrJmxReporter JMX monitoring for 'solr_33565.solr.core.dv_coll.shard2.replica_n1' (registry 'solr.core.dv_coll.shard2.replica_n1') enabled at server: com.sun.jmx.mbeanserver.JmxMBeanServer@110ae24
[junit4] 2> 1294604 INFO (qtp18810426-14545) [n:127.0.0.1:33565_solr c:dv_coll s:shard2 r:core_node2 x:dv_coll_shard2_replica_n1] o.a.s.c.SolrCore solr.RecoveryStrategy.Builder
[junit4] 2> 1294604 INFO (qtp18810426-14545) [n:127.0.0.1:33565_solr c:dv_coll s:shard2 r:core_node2 x:dv_coll_shard2_replica_n1] o.a.s.c.SolrCore [[dv_coll_shard2_replica_n1] ] Opening new SolrCore at [/home/jenkins/workspace/Lucene-Solr-master-Linux/solr/build/solr-core/test/J0/temp/solr.cloud.DocValuesNotIndexedTest_BBB496829EB0D1C0-001/tempDir-001/node2/dv_coll_shard2_replica_n1], dataDir=[/home/jenkins/workspace/Lucene-Solr-master-Linux/solr/build/solr-core/test/J0/temp/solr.cloud.DocValuesNotIndexedTest_BBB496829EB0D1C0-001/tempDir-001/node2/./dv_coll_shard2_replica_n1/data/]
[junit4] 2> 1294606 INFO (qtp18810426-14495) [n:127.0.0.1:33565_solr c:dv_coll s:shard4 r:core_node4 x:dv_coll_shard4_replica_n1] o.a.s.s.IndexSchema [dv_coll_shard4_replica_n1] Schema name=minimal
[junit4] 2> 1294607 INFO (qtp18810426-14495) [n:127.0.0.1:33565_solr c:dv_coll s:shard4 r:core_node4 x:dv_coll_shard4_replica_n1] o.a.s.s.IndexSchema Loaded schema minimal/1.1 with uniqueid field id
[junit4] 2> 1294608 INFO (qtp18810426-14495) [n:127.0.0.1:33565_solr c:dv_coll s:shard4 r:core_node4 x:dv_coll_shard4_replica_n1] o.a.s.c.CoreContainer Creating SolrCore 'dv_coll_shard4_replica_n1' using configuration from collection dv_coll, trusted=true
[junit4] 2> 1294608 INFO (qtp18810426-14495) [n:127.0.0.1:33565_solr c:dv_coll s:shard4 r:core_node4 x:dv_coll_shard4_replica_n1] o.a.s.m.r.SolrJmxReporter JMX monitoring for 'solr_33565.solr.core.dv_coll.shard4.replica_n1' (registry 'solr.core.dv_coll.shard4.replica_n1') enabled at server: com.sun.jmx.mbeanserver.JmxMBeanServer@110ae24
[junit4] 2> 1294608 INFO (qtp18810426-14495) [n:127.0.0.1:33565_solr c:dv_coll s:shard4 r:core_node4 x:dv_coll_shard4_replica_n1] o.a.s.c.SolrCore solr.RecoveryStrategy.Builder
[junit4] 2> 1294608 INFO (qtp18810426-14495) [n:127.0.0.1:33565_solr c:dv_coll s:shard4 r:core_node4 x:dv_coll_shard4_replica_n1] o.a.s.c.SolrCore [[dv_coll_shard4_replica_n1] ] Opening new SolrCore at [/home/jenkins/workspace/Lucene-Solr-master-Linux/solr/build/solr-core/test/J0/temp/solr.cloud.DocValuesNotIndexedTest_BBB496829EB0D1C0-001/tempDir-001/node2/dv_coll_shard4_replica_n1], dataDir=[/home/jenkins/workspace/Lucene-Solr-master-Linux/solr/build/solr-core/test/J0/temp/solr.cloud.DocValuesNotIndexedTest_BBB496829EB0D1C0-001/tempDir-001/node2/./dv_coll_shard4_replica_n1/data/]
[junit4] 2> 1294609 INFO (qtp20456943-14481) [n:127.0.0.1:39439_solr c:dv_coll s:shard3 r:core_node3 x:dv_coll_shard3_replica_n1] o.a.s.s.IndexSchema [dv_coll_shard3_replica_n1] Schema name=minimal
[junit4] 2> 1294610 INFO (qtp20456943-14492) [n:127.0.0.1:39439_solr c:dv_coll s:shard1 r:core_node1 x:dv_coll_shard1_replica_n1] o.a.s.c.SolrConfig Using Lucene MatchVersion: 8.0.0
[junit4] 2> 1294611 INFO (qtp20456943-14481) [n:127.0.0.1:39439_solr c:dv_coll s:shard3 r:core_node3 x:dv_coll_shard3_replica_n1] o.a.s.s.IndexSchema Loaded schema minimal/1.1 with uniqueid field id
[junit4] 2> 1294611 INFO (qtp20456943-14481) [n:127.0.0.1:39439_solr c:dv_coll s:shard3 r:core_node3 x:dv_coll_shard3_replica_n1] o.a.s.c.CoreContainer Creating SolrCore 'dv_coll_shard3_replica_n1' using configuration from collection dv_coll, trusted=true
[junit4] 2> 1294612 INFO (qtp20456943-14481) [n:127.0.0.1:39439_solr c:dv_coll s:shard3 r:core_node3 x:dv_coll_shard3_replica_n1] o.a.s.m.r.SolrJmxReporter JMX monitoring for 'solr_39439.solr.core.dv_coll.shard3.replica_n1' (registry 'solr.core.dv_coll.shard3.replica_n1') enabled at server: com.sun.jmx.mbeanserver.JmxMBeanServer@110ae24
[junit4] 2> 1294612 INFO (qtp20456943-14481) [n:127.0.0.1:39439_solr c:dv_coll s:shard3 r:core_node3 x:dv_coll_shard3_replica_n1] o.a.s.c.SolrCore solr.RecoveryStrategy.Builder
[junit4] 2> 1294612 INFO (qtp20456943-14481) [n:127.0.0.1:39439_solr c:dv_coll s:shard3 r:core_node3 x:dv_coll_shard3_replica_n1] o.a.s.c.SolrCore [[dv_coll_shard3_replica_n1] ] Opening new SolrCore at [/home/jenkins/workspace/Lucene-Solr-master-Linux/solr/build/solr-core/test/J0/temp/solr.cloud.DocValuesNotIndexedTest_BBB496829EB0D1C0-001/tempDir-001/node1/dv_coll_shard3_replica_n1], dataDir=[/home/jenkins/workspace/Lucene-Solr-master-Linux/solr/build/solr-core/test/J0/temp/solr.cloud.DocValuesNotIndexedTest_BBB496829EB0D1C0-001/tempDir-001/node1/./dv_coll_shard3_replica_n1/data/]
[junit4] 2> 1294615 INFO (qtp20456943-14492) [n:127.0.0.1:39439_solr c:dv_coll s:shard1 r:core_node1 x:dv_coll_shard1_replica_n1] o.a.s.s.IndexSchema [dv_coll_shard1_replica_n1] Schema name=minimal
[junit4] 2> 1294617 INFO (qtp20456943-14492) [n:127.0.0.1:39439_solr c:dv_coll s:shard1 r:core_node1 x:dv_coll_shard1_replica_n1] o.a.s.s.IndexSchema Loaded schema minimal/1.1 with uniqueid field id
[junit4] 2> 1294617 INFO (qtp20456943-14492) [n:127.0.0.1:39439_solr c:dv_coll s:shard1 r:core_node1 x:dv_coll_shard1_replica_n1] o.a.s.c.CoreContainer Creating SolrCore 'dv_coll_shard1_replica_n1' using configuration from collection dv_coll, trusted=true
[junit4] 2> 1294617 INFO (qtp20456943-14492) [n:127.0.0.1:39439_solr c:dv_coll s:shard1 r:core_node1 x:dv_coll_shard1_replica_n1] o.a.s.m.r.SolrJmxReporter JMX monitoring for 'solr_39439.solr.core.dv_coll.shard1.replica_n1' (registry 'solr.core.dv_coll.shard1.replica_n1') enabled at server: com.sun.jmx.mbeanserver.JmxMBeanServer@110ae24
[junit4] 2> 1294618 INFO (qtp20456943-14492) [n:127.0.0.1:39439_solr c:dv_coll s:shard1 r:core_node1 x:dv_coll_shard1_replica_n1] o.a.s.c.SolrCore solr.RecoveryStrategy.Builder
[junit4] 2> 1294618 INFO (qtp20456943-14492) [n:127.0.0.1:39439_solr c:dv_coll s:shard1 r:core_node1 x:dv_coll_shard1_replica_n1] o.a.s.c.SolrCore [[dv_coll_shard1_replica_n1] ] Opening new SolrCore at [/home/jenkins/workspace/Lucene-Solr-master-Linux/solr/build/solr-core/test/J0/temp/solr.cloud.DocValuesNotIndexedTest_BBB496829EB0D1C0-001/tempDir-001/node1/dv_coll_shard1_replica_n1], dataDir=[/home/jenkins/workspace/Lucene-Solr-master-Linux/solr/build/solr-core/test/J0/temp/solr.cloud.DocValuesNotIndexedTest_BBB496829EB0D1C0-001/tempDir-001/node1/./dv_coll_shard1_replica_n1/data/]
[junit4] 2> 1294663 INFO (qtp18810426-14495) [n:127.0.0.1:33565_solr c:dv_coll s:shard4 r:core_node4 x:dv_coll_shard4_replica_n1] o.a.s.u.UpdateHandler Using UpdateLog implementation: org.apache.solr.update.UpdateLog
[junit4] 2> 1294663 INFO (qtp18810426-14495) [n:127.0.0.1:33565_solr c:dv_coll s:shard4 r:core_node4 x:dv_coll_shard4_replica_n1] o.a.s.u.UpdateLog Initializing UpdateLog: dataDir=null defaultSyncLevel=FLUSH numRecordsToKeep=100 maxNumLogsToKeep=10 numVersionBuckets=65536
[junit4] 2> 1294664 INFO (qtp18810426-14545) [n:127.0.0.1:33565_solr c:dv_coll s:shard2 r:core_node2 x:dv_coll_shard2_replica_n1] o.a.s.u.UpdateHandler Using UpdateLog implementation: org.apache.solr.update.UpdateLog
[junit4] 2> 1294664 INFO (qtp18810426-14545) [n:127.0.0.1:33565_solr c:dv_coll s:shard2 r:core_node2 x:dv_coll_shard2_replica_n1] o.a.s.u.UpdateLog Initializing UpdateLog: dataDir=null defaultSyncLevel=FLUSH numRecordsToKeep=100 maxNumLogsToKeep=10 numVersionBuckets=65536
[junit4] 2> 1294664 INFO (qtp18810426-14495) [n:127.0.0.1:33565_solr c:dv_coll s:shard4 r:core_node4 x:dv_coll_shard4_replica_n1] o.a.s.u.CommitTracker Hard AutoCommit: disabled
[junit4] 2> 1294664 INFO (qtp18810426-14495) [n:127.0.0.1:33565_solr c:dv_coll s:shard4 r:core_node4 x:dv_coll_shard4_replica_n1] o.a.s.u.CommitTracker Soft AutoCommit: disabled
[junit4] 2> 1294664 INFO (qtp20456943-14481) [n:127.0.0.1:39439_solr c:dv_coll s:shard3 r:core_node3 x:dv_coll_shard3_replica_n1] o.a.s.u.UpdateHandler Using UpdateLog implementation: org.apache.solr.update.UpdateLog
[junit4] 2> 1294664 INFO (qtp20456943-14481) [n:127.0.0.1:39439_solr c:dv_coll s:shard3 r:core_node3 x:dv_coll_shard3_replica_n1] o.a.s.u.UpdateLog Initializing UpdateLog: dataDir=null defaultSyncLevel=FLUSH numRecordsToKeep=100 maxNumLogsToKeep=10 numVersionBuckets=65536
[junit4] 2> 1294665 INFO (qtp18810426-14545) [n:127.0.0.1:33565_solr c:dv_coll s:shard2 r:core_node2 x:dv_coll_shard2_replica_n1] o.a.s.u.CommitTracker Hard AutoCommit: disabled
[junit4] 2> 1294665 INFO (qtp18810426-14545) [n:127.0.0.1:33565_solr c:dv_coll s:shard2 r:core_node2 x:dv_coll_shard2_replica_n1] o.a.s.u.CommitTracker Soft AutoCommit: disabled
[junit4] 2> 1294665 INFO (qtp18810426-14495) [n:127.0.0.1:33565_solr c:dv_coll s:shard4 r:core_node4 x:dv_coll_shard4_replica_n1] o.a.s.s.SolrIndexSearcher Opening [Searcher@1be797c[dv_coll_shard4_replica_n1] main]
[junit4] 2> 1294666 INFO (qtp20456943-14481) [n:127.0.0.1:39439_solr c:dv_coll s:shard3 r:core_node3 x:dv_coll_shard3_replica_n1] o.a.s.u.CommitTracker Hard AutoCommit: disabled
[junit4] 2> 1294666 INFO (qtp20456943-14481) [n:127.0.0.1:39439_solr c:dv_coll s:shard3 r:core_node3 x:dv_coll_shard3_replica_n1] o.a.s.u.CommitTracker Soft AutoCommit: disabled
[junit4] 2> 1294666 INFO (qtp18810426-14495) [n:127.0.0.1:33565_solr c:dv_coll s:shard4 r:core_node4 x:dv_coll_shard4_replica_n1] o.a.s.r.ManagedResourceStorage Configured ZooKeeperStorageIO with znodeBase: /configs/conf1
[junit4] 2> 1294667 INFO (qtp20456943-14481) [n:127.0.0.1:39439_solr c:dv_coll s:shard3 r:core_node3 x:dv_coll_shard3_replica_n1] o.a.s.s.SolrIndexSearcher Opening [Searcher@15acc6d[dv_coll_shard3_replica_n1] main]
[junit4] 2> 1294667 INFO (qtp18810426-14495) [n:127.0.0.1:33565_solr c:dv_coll s:shard4 r:core_node4 x:dv_coll_shard4_replica_n1] o.a.s.r.ManagedResourceStorage Loaded null at path _rest_managed.json using ZooKeeperStorageIO:path=/configs/conf1
[junit4] 2> 1294667 INFO (qtp18810426-14495) [n:127.0.0.1:33565_solr c:dv_coll s:shard4 r:core_node4 x:dv_coll_shard4_replica_n1] o.a.s.s.ZkIndexSchemaReader Creating ZooKeeper watch for the managed schema at /configs/conf1/managed-schema
[junit4] 2> 1294667 INFO (qtp18810426-14545) [n:127.0.0.1:33565_solr c:dv_coll s:shard2 r:core_node2 x:dv_coll_shard2_replica_n1] o.a.s.s.SolrIndexSearcher Opening [Searcher@ea5181[dv_coll_shard2_replica_n1] main]
[junit4] 2> 1294668 INFO (qtp18810426-14495) [n:127.0.0.1:33565_solr c:dv_coll s:shard4 r:core_node4 x:dv_coll_shard4_replica_n1] o.a.s.s.ZkIndexSchemaReader Current schema version 0 is already the latest
[junit4] 2> 1294668 INFO (qtp18810426-14495) [n:127.0.0.1:33565_solr c:dv_coll s:shard4 r:core_node4 x:dv_coll_shard4_replica_n1] o.a.s.h.ReplicationHandler Commits will be reserved for 10000
[junit4] 2> 1294669 INFO (qtp20456943-14481) [n:127.0.0.1:39439_solr c:dv_coll s:shard3 r:core_node3 x:dv_coll_shard3_replica_n1] o.a.s.r.ManagedResourceStorage Configured ZooKeeperStorageIO with znodeBase: /configs/conf1
[junit4] 2> 1294669 INFO (qtp18810426-14545) [n:127.0.0.1:33565_solr c:dv_coll s:shard2 r:core_node2 x:dv_coll_shard2_replica_n1] o.a.s.r.ManagedResourceStorage Configured ZooKeeperStorageIO with znodeBase: /configs/conf1
[junit4] 2> 1294669 INFO (qtp20456943-14481) [n:127.0.0.1:39439_solr c:dv_coll s:shard3 r:core_node3 x:dv_coll_shard3_replica_n1] o.a.s.r.ManagedResourceStorage Loaded null at path _rest_managed.json using ZooKeeperStorageIO:path=/configs/conf1
[junit4] 2> 1294669 INFO (qtp18810426-14545) [n:127.0.0.1:33565_solr c:dv_coll s:shard2 r:core_node2 x:dv_coll_shard2_replica_n1] o.a.s.r.ManagedResourceStorage Loaded null at path _rest_managed.json using ZooKeeperStorageIO:path=/configs/conf1
[junit4] 2> 1294669 INFO (qtp20456943-14481) [n:127.0.0.1:39439_solr c:dv_coll s:shard3 r:core_node3 x:dv_coll_shard3_replica_n1] o.a.s.s.ZkIndexSchemaReader Creating ZooKeeper watch for the managed schema at /configs/conf1/managed-schema
[junit4] 2> 1294669 INFO (qtp18810426-14545) [n:127.0.0.1:33565_solr c:dv_coll s:shard2 r:core_node2 x:dv_coll_shard2_replica_n1] o.a.s.s.ZkIndexSchemaReader Creating ZooKeeper watch for the managed schema at /configs/conf1/managed-schema
[junit4] 2> 1294669 INFO (qtp20456943-14481) [n:127.0.0.1:39439_solr c:dv_coll s:shard3 r:core_node3 x:dv_coll_shard3_replica_n1] o.a.s.s.ZkIndexSchemaReader Current schema version 0 is already the latest
[junit4] 2> 1294669 INFO (qtp18810426-14545) [n:127.0.0.1:33565_solr c:dv_coll s:shard2 r:core_node2 x:dv_coll_shard2_replica_n1] o.a.s.s.ZkIndexSchemaReader Current schema version 0 is already the latest
[junit4] 2> 1294669 INFO (searcherExecutor-5066-thread-1-processing-n:127.0.0.1:33565_solr x:dv_coll_shard4_replica_n1 s:shard4 c:dv_coll r:core_node4) [n:127.0.0.1:33565_solr c:dv_coll s:shard4 r:core_node4 x:dv_coll_shard4_replica_n1] o.a.s.c.SolrCore [dv_coll_shard4_replica_n1] Registered new searcher Searcher@1be797c[dv_coll_shard4_replica_n1] main{ExitableDirectoryReader(UninvertingDirectoryReader())}
[junit4] 2> 1294670 INFO (qtp18810426-14495) [n:127.0.0.1:33565_solr c:dv_coll s:shard4 r:core_node4 x:dv_coll_shard4_replica_n1] o.a.s.u.UpdateLog Could not find max version in index or recent updates, using new clock 1571933721385238528
[junit4] 2> 1294670 INFO (qtp20456943-14481) [n:127.0.0.1:39439_solr c:dv_coll s:shard3 r:core_node3 x:dv_coll_shard3_replica_n1] o.a.s.h.ReplicationHandler Commits will be reserved for 10000
[junit4] 2> 1294670 INFO (qtp18810426-14545) [n:127.0.0.1:33565_solr c:dv_coll s:shard2 r:core_node2 x:dv_coll_shard2_replica_n1] o.a.s.h.ReplicationHandler Commits will be reserved for 10000
[junit4] 2> 1294670 INFO (qtp18810426-14545) [n:127.0.0.1:33565_solr c:dv_coll s:shard2 r:core_node2 x:dv_coll_shard2_replica_n1] o.a.s.u.UpdateLog Could not find max version in index or recent updates, using new clock 1571933721385238528
[junit4] 2> 1294670 INFO (searcherExecutor-5067-thread-1-processing-n:127.0.0.1:39439_solr x:dv_coll_shard3_replica_n1 s:shard3 c:dv_coll r:core_node3) [n:127.0.0.1:39439_solr c:dv_coll s:shard3 r:core_node3 x:dv_coll_shard3_replica_n1] o.a.s.c.SolrCore [dv_coll_shard3_replica_n1] Registered new searcher Searcher@15acc6d[dv_coll_shard3_replica_n1] main{ExitableDirectoryReader(UninvertingDirectoryReader())}
[junit4] 2> 1294670 INFO (qtp20456943-14481) [n:127.0.0.1:39439_solr c:dv_coll s:shard3 r:core_node3 x:dv_coll_shard3_replica_n1] o.a.s.u.UpdateLog Could not find max version in index or recent updates, using new clock 1571933721385238528
[junit4] 2> 1294671 INFO (searcherExecutor-5065-thread-1-processing-n:127.0.0.1:33565_solr x:dv_coll_shard2_replica_n1 s:shard2 c:dv_coll r:core_node2) [n:127.0.0.1:33565_solr c:dv_coll s:shard2 r:core_node2 x:dv_coll_shard2_replica_n1] o.a.s.c.SolrCore [dv_coll_shard2_replica_n1] Registered new searcher Searcher@ea5181[dv_coll_shard2_replica_n1] main{ExitableDirectoryReader(UninvertingDirectoryReader())}
[junit4] 2> 1294674 INFO (qtp20456943-14481) [n:127.0.0.1:39439_solr c:dv_coll s:shard3 r:core_node3 x:dv_coll_shard3_replica_n1] o.a.s.c.ShardLeaderElectionContext Enough replicas found to continue.
[junit4] 2> 1294674 INFO (qtp20456943-14481) [n:127.0.0.1:39439_solr c:dv_coll s:shard3 r:core_node3 x:dv_coll_shard3_replica_n1] o.a.s.c.ShardLeaderElectionContext I may be the new leader - try and sync
[junit4] 2> 1294674 INFO (qtp20456943-14481) [n:127.0.0.1:39439_solr c:dv_coll s:shard3 r:core_node3 x:dv_coll_shard3_replica_n1] o.a.s.c.SyncStrategy Sync replicas to https://127.0.0.1:39439/solr/dv_coll_shard3_replica_n1/
[junit4] 2> 1294674 INFO (qtp20456943-14481) [n:127.0.0.1:39439_solr c:dv_coll s:shard3 r:core_node3 x:dv_coll_shard3_replica_n1] o.a.s.c.SyncStrategy Sync Success - now sync replicas to me
[junit4] 2> 1294674 INFO (qtp20456943-14481) [n:127.0.0.1:39439_solr c:dv_coll s:shard3 r:core_node3 x:dv_coll_shard3_replica_n1] o.a.s.c.SyncStrategy https://127.0.0.1:39439/solr/dv_coll_shard3_replica_n1/ has no replicas
[junit4] 2> 1294674 INFO (qtp20456943-14481) [n:127.0.0.1:39439_solr c:dv_coll s:shard3 r:core_node3 x:dv_coll_shard3_replica_n1] o.a.s.c.ShardLeaderElectionContext Found all replicas participating in election, clear LIR
[junit4] 2> 1294675 INFO (qtp18810426-14495) [n:127.0.0.1:33565_solr c:dv_coll s:shard4 r:core_node4 x:dv_coll_shard4_replica_n1] o.a.s.c.ShardLeaderElectionContext Enough replicas found to continue.
[junit4] 2> 1294675 INFO (qtp18810426-14495) [n:127.0.0.1:33565_solr c:dv_coll s:shard4 r:core_node4 x:dv_coll_shard4_replica_n1] o.a.s.c.ShardLeaderElectionContext I may be the new leader - try and sync
[junit4] 2> 1294675 INFO (qtp18810426-14495) [n:127.0.0.1:33565_solr c:dv_coll s:shard4 r:core_node4 x:dv_coll_shard4_replica_n1] o.a.s.c.SyncStrategy Sync replicas to https://127.0.0.1:33565/solr/dv_coll_shard4_replica_n1/
[junit4] 2> 1294675 INFO (qtp18810426-14495) [n:127.0.0.1:33565_solr c:dv_coll s:shard4 r:core_node4 x:dv_coll_shard4_replica_n1] o.a.s.c.SyncStrategy Sync Success - now sync replicas to me
[junit4] 2> 1294675 INFO (qtp18810426-14495) [n:127.0.0.1:33565_solr c:dv_coll s:shard4 r:core_node4 x:dv_coll_shard4_replica_n1] o.a.s.c.SyncStrategy https://127.0.0.1:33565/solr/dv_coll_shard4_replica_n1/ has no replicas
[junit4] 2> 1294675 INFO (qtp18810426-14495) [n:127.0.0.1:33565_solr c:dv_coll s:shard4 r:core_node4 x:dv_coll_shard4_replica_n1] o.a.s.c.ShardLeaderElectionContext Found all replicas participating in election, clear LIR
[junit4] 2> 1294676 INFO (qtp20456943-14481) [n:127.0.0.1:39439_solr c:dv_coll s:shard3 r:core_node3 x:dv_coll_shard3_replica_n1] o.a.s.c.ShardLeaderElectionContext I am the new leader: https://127.0.0.1:39439/solr/dv_coll_shard3_replica_n1/ shard3
[junit4] 2> 1294677 INFO (qtp18810426-14495) [n:127.0.0.1:33565_solr c:dv_coll s:shard4 r:core_node4 x:dv_coll_shard4_replica_n1] o.a.s.c.ShardLeaderElectionContext I am the new leader: https://127.0.0.1:33565/solr/dv_coll_shard4_replica_n1/ shard4
[junit4] 2> 1294677 INFO (qtp18810426-14545) [n:127.0.0.1:33565_solr c:dv_coll s:shard2 r:core_node2 x:dv_coll_shard2_replica_n1] o.a.s.c.ShardLeaderElectionContext Enough replicas found to continue.
[junit4] 2> 1294677 INFO (qtp18810426-14545) [n:127.0.0.1:33565_solr c:dv_coll s:shard2 r:core_node2 x:dv_coll_shard2_replica_n1] o.a.s.c.ShardLeaderElectionContext I may be the new leader - try and sync
[junit4] 2> 1294677 INFO (qtp18810426-14545) [n:127.0.0.1:33565_solr c:dv_coll s:shard2 r:core_node2 x:dv_coll_shard2_replica_n1] o.a.s.c.SyncStrategy Sync replicas to https://127.0.0.1:33565/solr/dv_coll_shard2_replica_n1/
[junit4] 2> 1294677 INFO (qtp18810426-14545) [n:127.0.0.1:33565_solr c:dv_coll s:shard2 r:core_node2 x:dv_coll_shard2_replica_n1] o.a.s.c.SyncStrategy Sync Success - now sync replicas to me
[junit4] 2> 1294677 INFO (qtp18810426-14545) [n:127.0.0.1:33565_solr c:dv_coll s:shard2 r:core_node2 x:dv_coll_shard2_replica_n1] o.a.s.c.SyncStrategy https://127.0.0.1:33565/solr/dv_coll_shard2_replica_n1/ has no replicas
[junit4] 2> 1294677 INFO (qtp18810426-14545) [n:127.0.0.1:33565_solr c:dv_coll s:shard2 r:core_node2 x:dv_coll_shard2_replica_n1] o.a.s.c.ShardLeaderElectionContext Found all replicas participating in election, clear LIR
[junit4] 2> 1294678 INFO (qtp18810426-14545) [n:127.0.0.1:33565_solr c:dv_coll s:shard2 r:core_node2 x:dv_coll_shard2_replica_n1] o.a.s.c.ShardLeaderElectionContext I am the new leader: https://127.0.0.1:33565/solr/dv_coll_shard2_replica_n1/ shard2
[junit4] 2> 1294680 INFO (qtp20456943-14492) [n:127.0.0.1:39439_solr c:dv_coll s:shard1 r:core_node1 x:dv_coll_shard1_replica_n1] o.a.s.u.UpdateHandler Using UpdateLog implementation: org.apache.solr.update.UpdateLog
[junit4] 2> 1294680 INFO (qtp20456943-14492) [n:127.0.0.1:39439_solr c:dv_coll s:shard1 r:core_node1 x:dv_coll_shard1_replica_n1] o.a.s.u.UpdateLog Initializing UpdateLog: dataDir=null defaultSyncLevel=FLUSH numRecordsToKeep=100 maxNumLogsToKeep=10 numVersionBuckets=65536
[junit4] 2> 1294681 INFO (qtp20456943-14492) [n:127.0.0.1:39439_solr c:dv_coll s:shard1 r:core_node1 x:dv_coll_shard1_replica_n1] o.a.s.u.CommitTracker Hard AutoCommit: disabled
[junit4] 2> 1294681 INFO (qtp20456943-14492) [n:127.0.0.1:39439_solr c:dv_coll s:shard1 r:core_node1 x:dv_coll_shard1_replica_n1] o.a.s.u.CommitTracker Soft AutoCommit: disabled
[junit4] 2> 1294682 INFO (qtp20456943-14492) [n:127.0.0.1:39439_solr c:dv_coll s:shard1 r:core_node1 x:dv_coll_shard1_replica_n1] o.a.s.s.SolrIndexSearcher Opening [Searcher@1d9f8e1[dv_coll_shard1_replica_n1] main]
[junit4] 2> 1294683 INFO (qtp20456943-14492) [n:127.0.0.1:39439_solr c:dv_coll s:shard1 r:core_node1 x:dv_coll_shard1_replica_n1] o.a.s.r.ManagedResourceStorage Configured ZooKeeperStorageIO with znodeBase: /configs/conf1
[junit4] 2> 1294683 INFO (qtp20456943-14492) [n:127.0.0.1:39439_solr c:dv_coll s:shard1 r:core_node1 x:dv_coll_shard1_replica_n1] o.a.s.r.ManagedResourceStorage Loaded null at path _rest_managed.json using ZooKeeperStorageIO:path=/configs/conf1
[junit4] 2> 1294683 INFO (qtp20456943-14492) [n:127.0.0.1:39439_solr c:dv_coll s:shard1 r:core_node1 x:dv_coll_shard1_replica_n1] o.a.s.s.ZkIndexSchemaReader Creating ZooKeeper watch for the managed schema at /configs/conf1/managed-schema
[junit4] 2> 1294683 INFO (qtp20456943-14492) [n:127.0.0.1:39439_solr c:dv_coll s:shard1 r:core_node1 x:dv_coll_shard1_replica_n1] o.a.s.s.ZkIndexSchemaReader Current schema version 0 is already the latest
[junit4] 2> 1294684 INFO (qtp20456943-14492) [n:127.0.0.1:39439_solr c:dv_coll s:shard1 r:core_node1 x:dv_coll_shard1_replica_n1] o.a.s.h.ReplicationHandler Commits will be reserved for 10000
[junit4] 2> 1294685 INFO (searcherExecutor-5068-thread-1-processing-n:127.0.0.1:39439_solr x:dv_coll_shard1_replica_n1 s:shard1 c:dv_coll r:core_node1) [n:127.0.0.1:39439_solr c:dv_coll s:shard1 r:core_node1 x:dv_coll_shard1_replica_n1] o.a.s.c.SolrCore [dv_coll_shard1_replica_n1] Registered new searcher Searcher@1d9f8e1[dv_coll_shard1_replica_n1] main{ExitableDirectoryReader(UninvertingDirectoryReader())}
[junit4] 2> 1294685 INFO (qtp20456943-14492) [n:127.0.0.1:39439_solr c:dv_coll s:shard1 r:core_node1 x:dv_coll_shard1_replica_n1] o.a.s.u.UpdateLog Could not find max version in index or recent updates, using new clock 1571933721400967168
[junit4] 2> 1294688 INFO (qtp20456943-14492) [n:127.0.0.1:39439_solr c:dv_coll s:shard1 r:core_node1 x:dv_coll_shard1_replica_n1] o.a.s.c.ShardLeaderElectionContext Enough replicas found to continue.
[junit4] 2> 1294688 INFO (qtp20456943-14492) [n:127.0.0.1:39439_solr c:dv_coll s:shard1 r:core_node1 x:dv_coll_shard1_replica_n1] o.a.s.c.ShardLeaderElectionContext I may be the new leader - try and sync
[junit4] 2> 1294688 INFO (qtp20456943-14492) [n:127.0.0.1:39439_solr c:dv_coll s:shard1 r:core_node1 x:dv_coll_shard1_replica_n1] o.a.s.c.SyncStrategy Sync replicas to https://127.0.0.1:39439/solr/dv_coll_shard1_replica_n1/
[junit4] 2> 1294688 INFO (qtp20456943-14492) [n:127.0.0.1:39439_solr c:dv_coll s:shard1 r:core_node1 x:dv_coll_shard1_replica_n1] o.a.s.c.SyncStrategy Sync Success - now sync replicas to me
[junit4] 2> 1294688 INFO (qtp20456943-14492) [n:127.0.0.1:39439_solr c:dv_coll s:shard1 r:core_node1 x:dv_coll_shard1_replica_n1] o.a.s.c.SyncStrategy https://127.0.0.1:39439/solr/dv_coll_shard1_replica_n1/ has no replicas
[junit4] 2> 1294688 INFO (qtp20456943-14492) [n:127.0.0.1:39439_solr c:dv_coll s:shard1 r:core_node1 x:dv_coll_shard1_replica_n1] o.a.s.c.ShardLeaderElectionContext Found all replicas participating in election, clear LIR
[junit4] 2> 1294689 INFO (qtp20456943-14492) [n:127.0.0.1:39439_solr c:dv_coll s:shard1 r:core_node1 x:dv_coll_shard1_replica_n1] o.a.s.c.ShardLeaderElectionContext I am the new leader: https://127.0.0.1:39439/solr/dv_coll_shard1_replica_n1/ shard1
[junit4] 2> 1294790 INFO (zkCallback-1625-thread-1-processing-n:127.0.0.1:33565_solr) [n:127.0.0.1:33565_solr ] o.a.s.c.c.ZkStateReader A cluster state change: [WatchedEvent state:SyncConnected type:NodeDataChanged path:/collections/dv_coll/state.json] for collection [dv_coll] has occurred - updating... (live nodes size: [2])
[junit4] 2> 1294790 INFO (zkCallback-1624-thread-2-processing-n:127.0.0.1:39439_solr) [n:127.0.0.1:39439_solr ] o.a.s.c.c.ZkStateReader A cluster state change: [WatchedEvent state:SyncConnected type:NodeDataChanged path:/collections/dv_coll/state.json] for collection [dv_coll] has occurred - updating... (live nodes size: [2])
[junit4] 2> 1294790 INFO (zkCallback-1624-thread-1-processing-n:127.0.0.1:39439_solr) [n:127.0.0.1:39439_solr ] o.a.s.c.c.ZkStateReader A cluster state change: [WatchedEvent state:SyncConnected type:NodeDataChanged path:/collections/dv_coll/state.json] for collection [dv_coll] has occurred - updating... (live nodes size: [2])
[junit4] 2> 1294827 INFO (qtp20456943-14481) [n:127.0.0.1:39439_solr c:dv_coll s:shard3 r:core_node3 x:dv_coll_shard3_replica_n1] o.a.s.c.ZkController I am the leader, no recovery necessary
[junit4] 2> 1294828 INFO (qtp18810426-14495) [n:127.0.0.1:33565_solr c:dv_coll s:shard4 r:core_node4 x:dv_coll_shard4_replica_n1] o.a.s.c.ZkController I am the leader, no recovery necessary
[junit4] 2> 1294828 INFO (qtp20456943-14481) [n:127.0.0.1:39439_solr c:dv_coll s:shard3 r:core_node3 x:dv_coll_shard3_replica_n1] o.a.s.s.HttpSolrCall [admin] webapp=null path=/admin/cores params={qt=/admin/cores&coreNodeName=core_node3&collection.configName=conf1&newCollection=true&name=dv_coll_shard3_replica_n1&action=CREATE&numShards=4&collection=dv_coll&shard=shard3&wt=javabin&version=2&replicaType=NRT} status=0 QTime=1233
[junit4] 2> 1294829 INFO (qtp18810426-14545) [n:127.0.0.1:33565_solr c:dv_coll s:shard2 r:core_node2 x:dv_coll_shard2_replica_n1] o.a.s.c.ZkController I am the leader, no recovery necessary
[junit4] 2> 1294829 INFO (qtp18810426-14495) [n:127.0.0.1:33565_solr c:dv_coll s:shard4 r:core_node4 x:dv_coll_shard4_replica_n1] o.a.s.s.HttpSolrCall [admin] webapp=null path=/admin/cores params={qt=/admin/cores&coreNodeName=core_node4&collection.configName=conf1&newCollection=true&name=dv_coll_shard4_replica_n1&action=CREATE&numShards=4&collection=dv_coll&shard=shard4&wt=javabin&version=2&replicaType=NRT} status=0 QTime=1255
[junit4] 2> 1294830 INFO (qtp18810426-14545) [n:127.0.0.1:33565_solr c:dv_coll s:shard2 r:core_node2 x:dv_coll_shard2_replica_n1] o.a.s.s.HttpSolrCall [admin] webapp=null path=/admin/cores params={qt=/admin/cores&coreNodeName=core_node2&collection.configName=conf1&newCollection=true&name=dv_coll_shard2_replica_n1&action=CREATE&numShards=4&collection=dv_coll&shard=shard2&wt=javabin&version=2&replicaType=NRT} status=0 QTime=1253
[junit4] 2> 1294840 INFO (qtp20456943-14492) [n:127.0.0.1:39439_solr c:dv_coll s:shard1 r:core_node1 x:dv_coll_shard1_replica_n1] o.a.s.c.ZkController I am the leader, no recovery necessary
[junit4] 2> 1294841 INFO (qtp20456943-14492) [n:127.0.0.1:39439_solr c:dv_coll s:shard1 r:core_node1 x:dv_coll_shard1_replica_n1] o.a.s.s.HttpSolrCall [admin] webapp=null path=/admin/cores params={qt=/admin/cores&coreNodeName=core_node1&collection.configName=conf1&newCollection=true&name=dv_coll_shard1_replica_n1&action=CREATE&numShards=4&collection=dv_coll&shard=shard1&wt=javabin&version=2&replicaType=NRT} status=0 QTime=1238
[junit4] 2> 1294842 INFO (qtp18810426-14491) [n:127.0.0.1:33565_solr ] o.a.s.h.a.CollectionsHandler Wait for new collection to be active for at most 30 seconds. Check all shard replicas
[junit4] 2> 1294941 INFO (zkCallback-1624-thread-2-processing-n:127.0.0.1:39439_solr) [n:127.0.0.1:39439_solr ] o.a.s.c.c.ZkStateReader A cluster state change: [WatchedEvent state:SyncConnected type:NodeDataChanged path:/collections/dv_coll/state.json] for collection [dv_coll] has occurred - updating... (live nodes size: [2])
[junit4] 2> 1294942 INFO (zkCallback-1624-thread-1-processing-n:127.0.0.1:39439_solr) [n:127.0.0.1:39439_solr ] o.a.s.c.c.ZkStateReader A cluster state change: [WatchedEvent state:SyncConnected type:NodeDataChanged path:/collections/dv_coll/state.json] for collection [dv_coll] has occurred - updating... (live nodes size: [2])
[junit4] 2> 1294942 INFO (zkCallback-1625-thread-1-processing-n:127.0.0.1:33565_solr) [n:127.0.0.1:33565_solr ] o.a.s.c.c.ZkStateReader A cluster state change: [WatchedEvent state:SyncConnected type:NodeDataChanged path:/collections/dv_coll/state.json] for collection [dv_coll] has occurred - updating... (live nodes size: [2])
[junit4] 2> 1295267 INFO (OverseerCollectionConfigSetProcessor-98245857472872454-127.0.0.1:33565_solr-n_0000000000) [n:127.0.0.1:33565_solr ] o.a.s.c.OverseerTaskQueue Response ZK path: /overseer/collection-queue-work/qnr-0000000000 doesn't exist. Requestor may have disconnected from ZooKeeper
[junit4] 2> 1295842 INFO (qtp18810426-14491) [n:127.0.0.1:33565_solr ] o.a.s.s.HttpSolrCall [admin] webapp=null path=/admin/collections params={replicationFactor=1&collection.configName=conf1&maxShardsPerNode=2&name=dv_coll&nrtReplicas=1&action=CREATE&numShards=4&wt=javabin&version=2} status=0 QTime=2577
[junit4] 2> 1295852 INFO (qtp20456943-14481) [n:127.0.0.1:39439_solr c:dv_coll s:shard3 r:core_node3 x:dv_coll_shard3_replica_n1] o.a.s.s.SchemaManager managed schema loaded . version : 0
[junit4] 2> 1295854 INFO (qtp20456943-14481) [n:127.0.0.1:39439_solr c:dv_coll s:shard3 r:core_node3 x:dv_coll_shard3_replica_n1] o.a.s.s.IndexSchema [dv_coll_shard3_replica_n1] Schema name=minimal
[junit4] 2> 1295856 INFO (qtp20456943-14481) [n:127.0.0.1:39439_solr c:dv_coll s:shard3 r:core_node3 x:dv_coll_shard3_replica_n1] o.a.s.s.IndexSchema Loaded schema minimal/1.1 with uniqueid field id
[junit4] 2> 1295860 INFO (qtp20456943-14481) [n:127.0.0.1:39439_solr c:dv_coll s:shard3 r:core_node3 x:dv_coll_shard3_replica_n1] o.a.s.c.ZkController Persisted config data to node /configs/conf1/managed-schema
[junit4] 2> 1295860 INFO (zkCallback-1625-thread-1-processing-n:127.0.0.1:33565_solr) [n:127.0.0.1:33565_solr ] o.a.s.s.ZkIndexSchemaReader A schema change: WatchedEvent state:SyncConnected type:NodeDataChanged path:/configs/conf1/managed-schema, has occurred - updating schema from ZooKeeper ...
[junit4] 2> 1295861 INFO (zkCallback-1624-thread-2-processing-n:127.0.0.1:39439_solr) [n:127.0.0.1:39439_solr ] o.a.s.s.ZkIndexSchemaReader A schema change: WatchedEvent state:SyncConnected type:NodeDataChanged path:/configs/conf1/managed-schema, has occurred - updating schema from ZooKeeper ...
[junit4] 2> 1295861 INFO (zkCallback-1625-thread-2-processing-n:127.0.0.1:33565_solr) [n:127.0.0.1:33565_solr ] o.a.s.s.ZkIndexSchemaReader A schema change: WatchedEvent state:SyncConnected type:NodeDataChanged path:/configs/conf1/managed-schema, has occurred - updating schema from ZooKeeper ...
[junit4] 2> 1295861 INFO (zkCallback-1624-thread-1-processing-n:127.0.0.1:39439_solr) [n:127.0.0.1:39439_solr ] o.a.s.s.ZkIndexSchemaReader A schema change: WatchedEvent state:SyncConnected type:NodeDataChanged path:/configs/conf1/managed-schema, has occurred - updating schema from ZooKeeper ...
[junit4] 2> 1295861 INFO (zkCallback-1624-thread-2-processing-n:127.0.0.1:39439_solr) [n:127.0.0.1:39439_solr ] o.a.s.s.ZkIndexSchemaReader Retrieved schema version 1 from ZooKeeper
[junit4] 2> 1295861 INFO (zkCallback-1625-thread-2-processing-n:127.0.0.1:33565_solr) [n:127.0.0.1:33565_solr ] o.a.s.s.ZkIndexSchemaReader Retrieved schema version 1 from ZooKeeper
[junit4] 2> 1295861 INFO (zkCallback-1625-thread-1-processing-n:127.0.0.1:33565_solr) [n:127.0.0.1:33565_solr ] o.a.s.s.ZkIndexSchemaReader Retrieved schema version 1 from ZooKeeper
[junit4] 2> 1295863 INFO (zkCallback-1624-thread-2-processing-n:127.0.0.1:39439_solr) [n:127.0.0.1:39439_solr ] o.a.s.s.IndexSchema [dv_coll_shard1_replica_n1] Schema name=minimal
[junit4] 2> 1295863 INFO (zkCallback-1625-thread-1-processing-n:127.0.0.1:33565_solr) [n:127.0.0.1:33565_solr ] o.a.s.s.IndexSchema [dv_coll_shard4_replica_n1] Schema name=minimal
[junit4] 2> 1295863 INFO (zkCallback-1625-thread-2-processing-n:127.0.0.1:33565_solr) [n:127.0.0.1:33565_solr ] o.a.s.s.IndexSchema [dv_coll_shard2_replica_n1] Schema name=minimal
[junit4] 2> 1295867 INFO (zkCallback-1625-thread-1-processing-n:127.0.0.1:33565_solr) [n:127.0.0.1:33565_solr ] o.a.s.s.IndexSchema Loaded schema minimal/1.1 with uniqueid field id
[junit4] 2> 1295867 INFO (zkCallback-1625-thread-1-processing-n:127.0.0.1:33565_solr) [n:127.0.0.1:33565_solr ] o.a.s.s.ZkIndexSchemaReader Finished refreshing schema in 5 ms
[junit4] 2> 1295867 INFO (zkCallback-1624-thread-2-processing-n:127.0.0.1:39439_solr) [n:127.0.0.1:39439_solr ] o.a.s.s.IndexSchema Loaded schema minimal/1.1 with uniqueid field id
[junit4] 2> 1295867 INFO (zkCallback-1624-thread-2-processing-n:127.0.0.1:39439_solr) [n:127.0.0.1:39439_solr ] o.a.s.s.ZkIndexSchemaReader Finished refreshing schema in 6 ms
[junit4] 2> 1295867 INFO (zkCallback-1625-thread-2-processing-n:127.0.0.1:33565_solr) [n:127.0.0.1:33565_solr ] o.a.s.s.IndexSchema Loaded schema minimal/1.1 with uniqueid field id
[junit4] 2> 1295867 INFO (zkCallback-1625-thread-2-processing-n:127.0.0.1:33565_solr) [n:127.0.0.1:33565_solr ] o.a.s.s.ZkIndexSchemaReader Finished refreshing schema in 5 ms
[junit4] 2> 1295867 INFO (Thread-5688) [n:127.0.0.1:39439_solr ] o.a.s.c.SolrCore config update listener called for core dv_coll_shard1_replica_n1
[junit4] 2> 1295868 INFO (Thread-5689) [n:127.0.0.1:33565_solr ] o.a.s.c.SolrCore config update listener called for core dv_coll_shard4_replica_n1
[junit4] 2> 1295868 INFO (qtp20456943-14481) [n:127.0.0.1:39439_solr c:dv_coll s:shard3 r:core_node3 x:dv_coll_shard3_replica_n1] o.a.s.c.SolrConfig Using Lucene MatchVersion: 8.0.0
[junit4] 2> 1295869 INFO (Thread-5688) [n:127.0.0.1:39439_solr ] o.a.s.c.SolrCore config update listener called for core dv_coll_shard3_replica_n1
[junit4] 2> 1295869 INFO (Thread-5689) [n:127.0.0.1:33565_solr ] o.a.s.c.SolrCore config update listener called for core dv_coll_shard2_replica_n1
[junit4] 2> 1295870 INFO (Thread-5688) [n:127.0.0.1:39439_solr ] o.a.s.c.SolrCore core reload dv_coll_shard3_replica_n1
[junit4] 2> 1295872 INFO (qtp20456943-14481) [n:127.0.0.1:39439_solr c:dv_coll s:shard3 r:core_node3 x:dv_coll_shard3_replica_n1] o.a.s.s.IndexSchema [dv_coll_shard3_replica_n1] Schema name=minimal
[junit4] 2> 1295874 INFO (qtp20456943-14481) [n:127.0.0.1:39439_solr c:dv_coll s:shard3 r:core_node3 x:dv_coll_shard3_replica_n1] o.a.s.s.IndexSchema Loaded schema minimal/1.1 with uniqueid field id
[junit4] 2> 1295874 INFO (qtp20456943-14481) [n:127.0.0.1:39439_solr c:dv_coll s:shard3 r:core_node3 x:dv_coll_shard3_replica_n1] o.a.s.c.CoreContainer Reloading SolrCore 'dv_coll_shard3_replica_n1' using configuration from collection dv_coll
[junit4] 2> 1295883 INFO (qtp20456943-14481) [n:127.0.0.1:39439_solr c:dv_coll s:shard3 r:core_node3 x:dv_coll_shard3_replica_n1] o.a.s.m.r.SolrJmxReporter JMX monitoring for 'solr_39439.solr.core.dv_coll.shard3.replica_n1' (registry 'solr.core.dv_coll.shard3.replica_n1') enabled at server: com.sun.jmx.mbeanserver.JmxMBeanServer@110ae24
[junit4] 2> 1295883 INFO (qtp20456943-14481) [n:127.0.0.1:39439_solr c:dv_coll s:shard3 r:core_node3 x:dv_coll_shard3_replica_n1] o.a.s.c.SolrCore [[dv_coll_shard3_replica_n1] ] Opening new SolrCore at [/home/jenkins/workspace/Lucene-Solr-master-Linux/solr/build/solr-core/test/J0/temp/solr.cloud.DocValuesNotIndexedTest_BBB496829EB0D1C0-001/tempDir-001/node1/dv_coll_shard3_replica_n1], dataDir=[/home/jenkins/workspace/Lucene-Solr-master-Linux/solr/build/solr-core/test/J0/temp/solr.cloud.DocValuesNotIndexedTest_BBB496829EB0D1C0-001/tempDir-001/node1/./dv_coll_shard3_replica_n1/data/]
[junit4] 2> 1295943 INFO (qtp20456943-14481) [n:127.0.0.1:39439_solr c:dv_coll s:shard3 r:core_node3 x:dv_coll_shard3_replica_n1] o.a.s.u.CommitTracker Hard AutoCommit: disabled
[junit4] 2> 1295943 INFO (qtp20456943-14481) [n:127.0.0.1:39439_solr c:dv_coll s:shard3 r:core_node3 x:dv_coll_shard3_replica_n1] o.a.s.u.CommitTracker Soft AutoCommit: disabled
[junit4] 2> 1295944 INFO (qtp20456943-14481) [n:127.0.0.1:39439_solr c:dv_coll s:shard3 r:core_node3 x:dv_coll_shard3_replica_n1] o.a.s.s.SolrIndexSearcher Opening [Searcher@65eef0[dv_coll_shard3_replica_n1] main]
[junit4] 2> 1295945 INFO (qtp20456943-14481) [n:127.0.0.1:39439_solr c:dv_coll s:shard3 r:core_node3 x:dv_coll_shard3_replica_n1] o.a.s.r.ManagedResourceStorage Configured ZooKeeperStorageIO with znodeBase: /configs/conf1
[junit4] 2> 1295945 INFO (qtp20456943-14481) [n:127.0.0.1:39439_solr c:dv_coll s:shard3 r:core_node3 x:dv_coll_shard3_replica_n1] o.a.s.r.ManagedResourceStorage Loaded null at path _rest_managed.json using ZooKeeperStorageIO:path=/configs/conf1
[junit4] 2> 1295945 INFO (qtp20456943-14481) [n:127.0.0.1:39439_solr c:dv_coll s:shard3 r:core_node3 x:dv_coll_shard3_replica_n1] o.a.s.s.ZkIndexSchemaReader Creating ZooKeeper watch for the managed schema at /configs/conf1/managed-schema
[junit4] 2> 1295945 INFO (qtp20456943-14481) [n:127.0.0.1:39439_solr c:dv_coll s:shard3 r:core_node3 x:dv_coll_shard3_replica_n1] o.a.s.s.ZkIndexSchemaReader Current schema version 1 is already the latest
[junit4] 2> 1295946 INFO (qtp20456943-14481) [n:127.0.0.1:39439_solr c:dv_coll s:shard3 r:core_node3 x:dv_coll_shard3_replica_n1] o.a.s.h.ReplicationHandler Commits will be reserved for 10000
[junit4] 2> 1295947 INFO (searcherExecutor-5085-thread-1-processing-n:127.0.0.1:39439_solr x:dv_coll_shard3_replica_n1 s:shard3 c:dv_coll r:core_node3) [n:127.0.0.1:39439_solr c:dv_coll s:shard3 r:core_node3 x:dv_coll_shard3_replica_n1] o.a.s.c.SolrCore [dv_coll_shard3_replica_n1] Registered new searcher Searcher@65eef0[dv_coll_shard3_replica_n1] main{ExitableDirectoryReader(UninvertingDirectoryReader())}
[junit4] 2> 1295947 INFO (qtp20456943-14481) [n:127.0.0.1:39439_solr c:dv_coll s:shard3 r:core_node3 x:dv_coll_shard3_replica_n1] o.a.s.u.UpdateLog Could not find max version in index or recent updates, using new clock 1571933722724270080
[junit4] 2> 1295949 INFO (qtp20456943-14481) [n:127.0.0.1:39439_solr c:dv_coll s:shard3 r:core_node3 x:dv_coll_shard3_replica_n1] o.a.s.u.DefaultSolrCoreState New IndexWriter is ready to be used.
[junit4] 2> 1295949 INFO (qtp20456943-14481) [n:127.0.0.1:39439_solr c:dv_coll s:shard3 r:core_node3 x:dv_coll_shard3_replica_n1] o.a.s.s.SolrIndexSearcher Opening [Searcher@e4a78d[dv_coll_shard3_replica_n1] main]
[junit4] 2> 1295950 INFO (zkCallback-1624-thread-1-processing-n:127.0.0.1:39439_solr) [n:127.0.0.1:39439_solr ] o.a.s.s.ZkIndexSchemaReader Retrieved schema version 1 from ZooKeeper
[junit4] 2> 1295951 INFO (searcherExecutor-5085-thread-1-processing-n:127.0.0.1:39439_solr x:dv_coll_shard3_replica_n1 s:shard3 c:dv_coll r:core_node3) [n:127.0.0.1:39439_solr c:dv_coll s:shard3 r:core_node3 x:dv_coll_shard3_replica_n1] o.a.s.c.SolrCore [dv_coll_shard3_replica_n1] Registered new searcher Searcher@e4a78d[dv_coll_shard3_replica_n1] main{ExitableDirectoryReader(UninvertingDirectoryReader())}
[junit4] 2> 1295952 INFO (zkCallback-1624-thread-1-processing-n:127.0.0.1:39439_solr) [n:127.0.0.1:39439_solr ] o.a.s.s.IndexSchema [dv_coll_shard3_replica_n1] Schema name=minimal
[junit4] 2> 1295954 INFO (qtp20456943-14481) [n:127.0.0.1:39439_solr c:dv_coll s:shard3 r:core_node3 x:dv_coll_shard3_replica_n1] o.a.s.s.ManagedIndexSchema Waiting up to 599 secs for 3 replicas to apply schema update version 1 for collection dv_coll
[junit4] 2> 1295955 INFO (zkCallback-1624-thread-1-processing-n:127.0.0.1:39439_solr) [n:127.0.0.1:39439_solr ] o.a.s.s.IndexSchema Loaded schema minimal/1.1 with uniqueid field id
[junit4] 2> 1295955 INFO (zkCallback-1624-thread-1-processing-n:127.0.0.1:39439_solr) [n:127.0.0.1:39439_solr ] o.a.s.s.ZkIndexSchemaReader Finished refreshing schema in 5 ms
[junit4] 2> 1295958 INFO (Thread-5688) [n:127.0.0.1:39439_solr ] o.a.s.c.SolrConfig Using Lucene MatchVersion: 8.0.0
[junit4] 2> 1295961 INFO (qtp20456943-14493) [n:127.0.0.1:39439_solr c:dv_coll s:shard1 r:core_node1 x:dv_coll_shard1_replica_n1] o.a.s.c.S.Request [dv_coll_shard1_replica_n1] webapp=/solr path=/schema/zkversion params={refreshIfBelowVersion=1&wt=javabin&version=2} status=0 QTime=0
[junit4] 2> 1295961 INFO (qtp18810426-14543) [n:127.0.0.1:33565_solr c:dv_coll s:shard4 r:core_node4 x:dv_coll_shard4_replica_n1] o.a.s.c.S.Request [dv_coll_shard4_replica_n1] webapp=/solr path=/schema/zkversion params={refreshIfBelowVersion=1&wt=javabin&version=2} status=0 QTime=0
[junit4] 2> 1295963 INFO (Thread-5688) [n:127.0.0.1:39439_solr ] o.a.s.s.IndexSchema [dv_coll_shard3_replica_n1] Schema name=minimal
[junit4] 2> 1295965 INFO (Thread-5688) [n:127.0.0.1:39439_solr ] o.a.s.s.IndexSchema Loaded schema minimal/1.1 with uniqueid field id
[junit4] 2> 1295965 INFO (Thread-5688) [n:127.0.0.1:39439_solr ] o.a.s.c.CoreContainer Reloading SolrCore 'dv_coll_shard3_replica_n1' using configuration from collection dv_coll
[junit4] 2> 1295969 INFO (qtp18810426-14545) [n:127.0.0.1:33565_solr c:dv_coll s:shard2 r:core_node2 x:dv_coll_shard2_replica_n1] o.a.s.c.S.Request [dv_coll_shard2_replica_n1] webapp=/solr path=/schema/zkversion params={refreshIfBelowVersion=1&wt=javabin&version=2} status=0 QTime=0
[junit4] 2> 1295969 INFO (qtp20456943-14481) [n:127.0.0.1:39439_solr c:dv_coll s:shard3 r:core_node3 x:dv_coll_shard3_replica_n1] o.a.s.s.ManagedIndexSchema Took 19.0ms for 3 replicas to apply schema update version 1 for collection dv_coll
[junit4] 2> 1295969 INFO (qtp20456943-14481) [n:127.0.0.1:39439_solr c:dv_coll s:shard3 r:core_node3 x:dv_coll_shard3_replica_n1] o.a.s.c.S.Request [dv_coll_shard3_replica_n1] webapp=/solr path=/schema params={wt=javabin&version=2} status=0 QTime=117
[junit4] 2> 1295969 INFO (qtp20456943-14481) [n:127.0.0.1:39439_solr c:dv_coll s:shard3 r:core_node3 x:dv_coll_shard3_replica_n1] o.a.s.c.SolrCore [dv_coll_shard3_replica_n1] CLOSING SolrCore org.apache.solr.core.SolrCore@1a25e9d
[junit4] 2> 1295970 INFO (qtp20456943-14481) [n:127.0.0.1:39439_solr c:dv_coll s:shard3 r:core_node3 x:dv_coll_shard3_replica_n1] o.a.s.m.SolrMetricManager Closing metric reporters for registry=solr.core.dv_coll.shard3.replica_n1, tag=27418269
[junit4] 2> 1295973 INFO (Thread-5688) [n:127.0.0.1:39439_solr c:dv_coll s:shard3 r:core_node3 x:dv_coll_shard3_replica_n1] o.a.s.m.r.SolrJmxReporter JMX monitoring for 'solr_39439.solr.core.dv_coll.shard3.replica_n1' (registry 'solr.core.dv_coll.shard3.replica_n1') enabled at server: com.sun.jmx.mbeanserver.JmxMBeanServer@110ae24
[junit4] 2> 1295973 INFO (qtp20456943-14481) [n:127.0.0.1:39439_solr c:dv_coll s:shard3 r:core_node3 x:dv_coll_shard3_replica_n1] o.a.s.m.SolrMetricManager Closing metric reporters for registry=solr.collection.dv_coll.shard3.leader, tag=27418269
[junit4] 2> 1295973 INFO (Thread-5688) [n:127.0.0.1:39439_solr c:dv_coll s:shard3 r:core_node3 x:dv_coll_shard3_replica_n1] o.a.s.c.SolrCore [[dv_coll_shard3_replica_n1] ] Opening new SolrCore at [/home/jenkins/workspace/Lucene-Solr-master-Linux/solr/build/solr-core/test/J0/temp/solr.cloud.DocValuesNotIndexedTest_BBB496829EB0D1C0-001/tempDir-001/node1/dv_coll_shard3_replica_n1], dataDir=[/home/jenkins/workspace/Lucene-Solr-master-Linux/solr/build/solr-core/test/J0/temp/solr.cloud.DocValuesNotIndexedTest_BBB496829EB0D1C0-001/tempDir-001/node1/./dv_coll_shard3_replica_n1/data/]
[junit4] 2> 1295990 INFO (TEST-DocValuesNotIndexedTest.testGroupingDocAbsent-seed#[BBB496829EB0D1C0]) [ ] o.a.s.SolrTestCaseJ4 ###Starting testGroupingDocAbsent
[junit4] 2> 1295998 INFO (qtp20456943-14485) [n:127.0.0.1:39439_solr c:dv_coll s:shard1 r:core_node1 x:dv_coll_shard1_replica_n1] o.a.s.u.p.LogUpdateProcessorFactory [dv_coll_shard1_replica_n1] webapp=/solr path=/update params={update.distrib=TOLEADER&distrib.from=https://127.0.0.1:39439/solr/dv_coll_shard3_replica_n1/&wt=javabin&version=2}{deleteByQuery=*:* (-1571933722775650304)} 0 1
[junit4] 2> 1296001 INFO (qtp18810426-14480) [n:127.0.0.1:33565_solr c:dv_coll s:shard2 r:core_node2 x:dv_coll_shard2_replica_n1] o.a.s.u.p.LogUpdateProcessorFactory [dv_coll_shard2_replica_n1] webapp=/solr path=/update params={update.distrib=TOLEADER&distrib.from=https://127.0.0.1:39439/solr/dv_coll_shard3_replica_n1/&wt=javabin&version=2}{deleteByQuery=*:* (-1571933722779844608)} 0 1
[junit4] 2> 1296003 INFO (qtp18810426-14495) [n:127.0.0.1:33565_solr c:dv_coll s:shard4 r:core_node4 x:dv_coll_shard4_replica_n1] o.a.s.u.p.LogUpdateProcessorFactory [dv_coll_shard4_replica_n1] webapp=/solr path=/update params={update.distrib=TOLEADER&distrib.from=https://127.0.0.1:39439/solr/dv_coll_shard3_replica_n1/&wt=javabin&version=2}{deleteByQuery=*:* (-1571933722781941760)} 0 1
[junit4] 2> 1296003 INFO (qtp20456943-14492) [n:127.0.0.1:39439_solr c:dv_coll s:shard3 r:core_node3 x:dv_coll_shard3_replica_n1] o.a.s.u.p.LogUpdateProcessorFactory [dv_coll_shard3_replica_n1] webapp=/solr path=/update params={wt=javabin&version=2}{deleteByQuery=*:* (-1571933722772504576)} 0 12
[junit4] 2> 1296005 INFO (qtp20456943-14481) [n:127.0.0.1:39439_solr c:dv_coll s:shard1 r:core_node1 x:dv_coll_shard1_replica_n1] o.a.s.u.DirectUpdateHandler2 start commit{_version_=1571933722785087488,optimize=false,openSearcher=true,waitSearcher=true,expungeDeletes=false,softCommit=false,prepareCommit=false}
[junit4] 2> 1296005 INFO (qtp20456943-14481) [n:127.0.0.1:39439_solr c:dv_coll s:shard1 r:core_node1 x:dv_coll_shard1_replica_n1] o.a.s.u.DirectUpdateHandler2 No uncommitted changes. Skipping IW.commit.
[junit4] 2> 1296009 INFO (qtp20456943-14481) [n:127.0.0.1:39439_solr c:dv_coll s:shard1 r:core_node1 x:dv_coll_shard1_replica_n1] o.a.s.s.SolrIndexSearcher Opening [Searcher@78556d[dv_coll_shard1_replica_n1] main]
[junit4] 2> 1296009 INFO (qtp20456943-14481) [n:127.0.0.1:39439_solr c:dv_coll s:shard1 r:core_node1 x:dv_coll_shard1_replica_n1] o.a.s.u.DirectUpdateHandler2 end_commit_flush
[junit4] 2> 1296010 INFO (searcherExecutor-5068-thread-1-processing-n:127.0.0.1:39439_solr x:dv_coll_shard1_replica_n1 s:shard1 c:dv_coll r:core_node1) [n:127.0.0.1:39439_solr c:dv_coll s:shard1 r:core_node1 x:dv_coll_shard1_replica_n1] o.a.s.c.SolrCore [dv_coll_shard1_replica_n1] Registered new searcher Searcher@78556d[dv_coll_shard1_replica_n1] main{ExitableDirectoryReader(UninvertingDirectoryReader())}
[junit4] 2> 1296010 INFO (qtp20456943-14481) [n:127.0.0.1:39439_solr c:dv_coll s:shard1 r:core_node1 x:dv_coll_shard1_replica_n1] o.a.s.u.p.LogUpdateProcessorFactory [dv_coll_shard1_replica_n1] webapp=/solr path=/update params={update.distrib=FROMLEADER&waitSearcher=true&openSearcher=true&commit=true&softCommit=false&distrib.from=https://127.0.0.1:33565/solr/dv_coll_shard2_replica_n1/&commit_end_point=true&wt=javabin&version=2&expungeDeletes=false}{commit=} 0 5
[junit4] 2> 1296011 INFO (qtp18810426-14544) [n:127.0.0.1:33565_solr c:dv_coll s:shard2 r:core_node2 x:dv_coll_shard2_replica_n1] o.a.s.u.DirectUpdateHandler2 start commit{_version_=1571933722791378944,optimize=false,openSearcher=true,waitSearcher=true,expungeDeletes=false,softCommit=false,prepareCommit=false}
[junit4] 2> 1296011 INFO (qtp18810426-14544) [n:127.0.0.1:33565_solr c:dv_coll s:shard2 r:core_node2 x:dv_coll_shard2_replica_n1] o.a.s.u.DirectUpdateHandler2 No uncommitted changes. Skipping IW.commit.
[junit4] 2> 1296011 INFO (qtp18810426-14544) [n:127.0.0.1:33565_solr c:dv_coll s:shard2 r:core_node2 x:dv_coll_shard2_replica_n1] o.a.s.s.SolrIndexSearcher Opening [Searcher@139df87[dv_coll_shard2_replica_n1] main]
[junit4] 2> 1296012 INFO (qtp18810426-14544) [n:127.0.0.1:33565_solr c:dv_coll s:shard2 r:core_node2 x:dv_coll_shard2_replica_n1] o.a.s.u.DirectUpdateHandler2 end_commit_flush
[junit4] 2> 1296012 INFO (qtp20456943-14487) [n:127.0.0.1:39439_solr c:dv_coll s:shard3 r:core_node3 x:dv_coll_shard3_replica_n1] o.a.s.u.DirectUpdateHandler2 start commit{_version_=1571933722792427520,optimize=false,openSearcher=true,waitSearcher=true,expungeDeletes=false,softCommit=false,prepareCommit=false}
[junit4] 2> 1296012 INFO (qtp20456943-14487) [n:127.0.0.1:39439_solr c:dv_coll s:shard3 r:core_node3 x:dv_coll_shard3_replica_n1] o.a.s.u.DirectUpdateHandler2 No uncommitted changes. Skipping IW.commit.
[junit4] 2> 1296013 INFO (qtp20456943-14487) [n:127.0.0.1:39439_solr c:dv_coll s:shard3 r:core_node3 x:dv_coll_shard3_replica_n1] o.a.s.u.DirectUpdateHandler2 end_commit_flush
[junit4] 2> 1296013 INFO (qtp20456943-14487) [n:127.0.0.1:39439_solr c:dv_coll s:shard3 r:core_node3 x:dv_coll_shard3_replica_n1] o.a.s.u.p.LogUpdateProcessorFactory [dv_coll_shard3_replica_n1] webapp=/solr path=/update params={update.distrib=FROMLEADER&waitSearcher=true&openSearcher=true&commit=true&softCommit=false&distrib.from=https://127.0.0.1:33565/solr/dv_coll_shard2_replica_n1/&commit_end_point=true&wt=javabin&version=2&expungeDeletes=false}{commit=} 0 0
[junit4] 2> 1296013 INFO (searcherExecutor-5065-thread-1-processing-n:127.0.0.1:33565_solr x:dv_coll_shard2_replica_n1 s:shard2 c:dv_coll r:core_node2) [n:127.0.0.1:33565_solr c:dv_coll s:shard2 r:core_node2 x:dv_coll_shard2_replica_n1] o.a.s.c.SolrCore [dv_coll_shard2_replica_n1] Registered new searcher Searcher@139df87[dv_coll_shard2_replica_n1] main{ExitableDirectoryReader(UninvertingDirectoryReader())}
[junit4] 2> 1296013 INFO (qtp18810426-14544) [n:127.0.0.1:33565_solr c:dv_coll s:shard2 r:core_node2 x:dv_coll_shard2_replica_n1] o.a.s.u.p.LogUpdateProcessorFactory [dv_coll_shard2_replica_n1] webapp=/solr path=/update params={update.distrib=FROMLEADER&waitSearcher=true&openSearcher=true&commit=true&softCommit=false&distrib.from=https://127.0.0.1:33565/solr/dv_coll_shard2_replica_n1/&commit_end_point=true&wt=javabin&version=2&expungeDeletes=false}{commit=} 0 2
[junit4] 2> 1296016 INFO (qtp18810426-14482) [n:127.0.0.1:33565_solr c:dv_coll s:shard4 r:core_node4 x:dv_coll_shard4_replica_n1] o.a.s.u.DirectUpdateHandler2 start commit{_version_=1571933722796621824,optimize=false,openSearcher=true,waitSearcher=true,expungeDeletes=false,softCommit=false,prepareCommit=false}
[junit4] 2> 1296016 INFO (qtp18810426-14482) [n:127.0.0.1:33565_solr c:dv_coll s:shard4 r:core_node4 x:dv_coll_shard4_replica_n1] o.a.s.u.DirectUpdateHandler2 No uncommitted changes. Skipping IW.commit.
[junit4] 2> 1296016 INFO (qtp18810426-14482) [n:127.0.0.1:33565_solr c:dv_coll s:shard4 r:core_node4 x:dv_coll_shard4_replica_n1] o.a.s.s.SolrIndexSearcher Opening [Searcher@91f8c4[dv_coll_shard4_replica_n1] main]
[junit4] 2> 1296017 INFO (qtp18810426-14482) [n:127.0.0.1:33565_solr c:dv_coll s:shard4 r:core_node4 x:dv_coll_shard4_replica_n1] o.a.s.u.DirectUpdateHandler2 end_commit_flush
[junit4] 2> 1296018 INFO (searcherExecutor-5066-thread-1-processing-n:127.0.0.1:33565_solr x:dv_coll_shard4_replica_n1 s:shard4 c:dv_coll r:core_node4) [n:127.0.0.1:33565_solr c:dv_coll s:shard4 r:core_node4 x:dv_coll_shard4_replica_n1] o.a.s.c.SolrCore [dv_coll_shard4_replica_n1] Registered new searcher Searcher@91f8c4[dv_coll_shard4_replica_n1] main{ExitableDirectoryReader(UninvertingDirectoryReader())}
[junit4] 2> 1296018 INFO (qtp18810426-14482) [n:127.0.0.1:33565_solr c:dv_coll s:shard4 r:core_node4 x:dv_coll_shard4_replica_n1] o.a.s.u.p.LogUpdateProcessorFactory [dv_coll_shard4_replica_n1] webapp=/solr path=/update params={update.distrib=FROMLEADER&waitSearcher=true&openSearcher=true&commit=true&softCommit=false&distrib.from=https://127.0.0.1:33565/solr/dv_coll_shard2_replica_n1/&commit_end_point=true&wt=javabin&version=2&expungeDeletes=false}{commit=} 0 2
[junit4] 2> 1296018 INFO (qtp18810426-14494) [n:127.0.0.1:33565_solr c:dv_coll s:shard2 r:core_node2 x:dv_coll_shard2_replica_n1] o.a.s.u.p.LogUpdateProcessorFactory [dv_coll_shard2_replica_n1] webapp=/solr path=/update params={_stateVer_=dv_coll:4&waitSearcher=true&commit=true&softCommit=false&wt=javabin&version=2}{commit=} 0 14
[junit4] 2> 1296020 INFO (qtp20456943-14493) [n:127.0.0.1:39439_solr c:dv_coll s:shard1 r:core_node1 x:dv_coll_shard1_replica_n1] o.a.s.u.p.LogUpdateProcessorFactory [dv_coll_shard1_replica_n1] webapp=/solr path=/update params={_stateVer_=dv_coll:4&wt=javabin&version=2}{add=[1 (1571933722799767552)]} 0 1
[junit4] 2> 1296020 INFO (qtp18810426-14543) [n:127.0.0.1:33565_solr c:dv_coll s:shard2 r:core_node2 x:dv_coll_shard2_replica_n1] o.a.s.u.p.LogUpdateProcessorFactory [dv_coll_shard2_replica_n1] webapp=/solr path=/update params={_stateVer_=dv_coll:4&wt=javabin&version=2}{add=[4 (1571933722799767552)]} 0 0
[junit4] 2> 1296021 INFO (Thread-5688) [n:127.0.0.1:39439_solr c:dv_coll s:shard3 r:core_node3 x:dv_coll_shard3_replica_n1] o.a.s.u.CommitTracker Hard AutoCommit: disabled
[junit4] 2> 1296021 INFO (Thread-5688) [n:127.0.0.1:39439_solr c:dv_coll s:shard3 r:core_node3 x:dv_coll_shard3_replica_n1] o.a.s.u.CommitTracker Soft AutoCommit: disabled
[junit4] 2> 1296023 INFO (qtp20456943-14481) [n:127.0.0.1:39439_solr c:dv_coll s:shard3 r:core_node3 x:dv_coll_shard3_replica_n1] o.a.s.u.p.LogUpdateProcessorFactory [dv_coll_shard3_replica_n1] webapp=/solr path=/update params={_stateVer_=dv_coll:4&wt=javabin&version=2}{add=[2 (1571933722802913280), 3 (1571933722803961856)]} 0 1
[junit4] 2> 1296024 INFO (Thread-5688) [n:127.0.0.1:39439_solr c:dv_coll s:shard3 r:core_node3 x:dv_coll_shard3_replica_n1] o.a.s.s.SolrIndexSearcher Opening [Searcher@c5c79f[dv_coll_shard3_replica_n1] main]
[junit4] 2> 1296025 INFO (qtp20456943-14542) [n:127.0.0.1:39439_solr c:dv_coll s:shard1 r:core_node1 x:dv_coll_shard1_replica_n1] o.a.s.u.DirectUpdateHandler2 start commit{_version_=1571933722806059008,optimize=false,openSearcher=true,waitSearcher=true,expungeDeletes=false,softCommit=false,prepareCommit=false}
[junit4] 2> 1296025 INFO (qtp20456943-14542) [n:127.0.0.1:39439_solr c:dv_coll s:shard1 r:core_node1 x:dv_coll_shard1_replica_n1] o.a.s.u.SolrIndexWriter Calling setCommitData with IW:org.apache.solr.update.SolrIndexWriter@130b5c9 commitCommandVersion:1571933722806059008
[junit4] 2> 1296025 INFO (qtp18810426-14544) [n:127.0.0.1:33565_solr c:dv_coll s:shard4 r:core_node4 x:dv_coll_shard4_replica_n1] o.a.s.u.DirectUpdateHandler2 start commit{_version_=1571933722806059008,optimize=false,openSearcher=true,waitSearcher=true,expungeDeletes=false,softCommit=false,prepareCommit=false}
[junit4] 2> 1296025 INFO (qtp18810426-14544) [n:127.0.0.1:33565_solr c:dv_coll s:shard4 r:core_node4 x:dv_coll_shard4_replica_n1] o.a.s.u.DirectUpdateHandler2 No uncommitted changes. Skipping IW.commit.
[junit4] 2> 1296025 INFO (qtp18810426-14495) [n:127.0.0.1:33565_solr c:dv_coll s:shard2 r:core_node2 x:dv_coll_shard2_replica_n1] o.a.s.u.DirectUpdateHandler2 start commit{_version_=1571933722806059008,optimize=false,openSearcher=true,waitSearcher=true,expungeDeletes=false,softCommit=false,prepareCommit=false}
[junit4] 2> 1296025 INFO (qtp18810426-14495) [n:127.0.0.1:33565_solr c:dv_coll s:shard2 r:core_node2 x:dv_coll_shard2_replica_n1] o.a.s.u.SolrIndexWriter Calling setCommitData with IW:org.apache.solr.update.SolrIndexWriter@60d7 commitCommandVersion:1571933722806059008
[junit4] 2> 1296025 INFO (qtp18810426-14544) [n:127.0.0.1:33565_solr c:dv_coll s:shard4 r:core_node4 x:dv_coll_shard4_replica_n1] o.a.s.u.DirectUpdateHandler2 end_commit_flush
[junit4] 2> 1296025 INFO (qtp18810426-14544) [n:127.0.0.1:33565_solr c:dv_coll s:shard4 r:core_node4 x:dv_coll_shard4_replica_n1] o.a.s.u.p.LogUpdateProcessorFactory [dv_coll_shard4_replica_n1] webapp=/solr path=/update params={update.distrib=FROMLEADER&waitSearcher=true&openSearcher=true&commit=true&softCommit=false&distrib.from=https://127.0.0.1:33565/solr/dv_coll_shard2_replica_n1/&commit_end_point=true&wt=javabin&version=2&expungeDeletes=false}{commit=} 0 0
[junit4] 2> 1296026 INFO (qtp20456943-14485) [n:127.0.0.1:39439_solr c:dv_coll s:shard3 r:core_node3 x:dv_coll_shard3_replica_n1] o.a.s.u.DirectUpdateHandler2 start commit{_version_=1571933722807107584,optimize=false,openSearcher=true,waitSearcher=true,expungeDeletes=false,softCommit=false,prepareCommit=false}
[junit4] 2> 1296026 INFO (qtp20456943-14485) [n:127.0.0.1:39439_solr c:dv_coll s:shard3 r:core_node3 x:dv_coll_shard3_replica_n1] o.a.s.u.SolrIndexWriter Calling setCommitData with IW:org.apache.solr.update.SolrIndexWriter@1a43bdc commitCommandVersion:1571933722807107584
[junit4] 2> 1296026 INFO (Thread-5688) [n:127.0.0.1:39439_solr c:dv_coll s:shard3 r:core_node3 x:dv_coll_shard3_replica_n1] o.a.s.r.ManagedResourceStorage Configured ZooKeeperStorageIO with znodeBase: /configs/conf1
[junit4] 2> 1296026 INFO (Thread-5688) [n:127.0.0.1:39439_solr c:dv_coll s:shard3 r:core_node3 x:dv_coll_shard3_replica_n1] o.a.s.r.ManagedResourceStorage Loaded null at path _rest_managed.json using ZooKeeperStorageIO:path=/configs/conf1
[junit4] 2> 1296026 INFO (Thread-5688) [n:127.0.0.1:39439_solr c:dv_coll s:shard3 r:core_node3 x:dv_coll_shard3_replica_n1] o.a.s.s.ZkIndexSchemaReader Creating ZooKeeper watch for the managed schema at /configs/conf1/managed-schema
[junit4] 2> 1296027 INFO (Thread-5688) [n:127.0.0.1:39439_solr c:dv_coll s:shard3 r:core_node3 x:dv_coll_shard3_replica_n1] o.a.s.s.ZkIndexSchemaReader Current schema version 1 is already the latest
[junit4] 2> 1296027 INFO (qtp20456943-14542) [n:127.0.0.1:39439_solr c:dv_coll s:shard1 r:core_node1 x:dv_coll_shard1_replica_n1] o.a.s.s.SolrIndexSearcher Opening [Searcher@1e508fd[dv_coll_shard1_replica_n1] main]
[junit4] 2> 1296028 INFO (Thread-5688) [n:127.0.0.1:39439_solr c:dv_coll s:shard3 r:core_node3 x:dv_coll_shard3_replica_n1] o.a.s.h.ReplicationHandler Commits will be reserved for 10000
[junit4] 2> 1296029 INFO (qtp20456943-14542) [n:127.0.0.1:39439_solr c:dv_coll s:shard1 r:core_node1 x:dv_coll_shard1_replica_n1] o.a.s.u.DirectUpdateHandler2 end_commit_flush
[junit4] 2> 1296029 INFO (qtp20456943-14485) [n:127.0.0.1:39439_solr c:dv_coll s:shard3 r:core_node3 x:dv_coll_shard3_replica_n1] o.a.s.s.SolrIndexSearcher Opening [Searcher@1241c6b[dv_coll_shard3_replica_n1] main]
[junit4] 2> 1296029 INFO (qtp20456943-14485) [n:127.0.0.1:39439_solr c:dv_coll s:shard3 r:core_node3 x:dv_coll_shard3_replica_n1] o.a.s.u.DirectUpdateHandler2 end_commit_flush
[junit4] 2> 1296032 INFO (searcherExecutor-5068-thread-1-processing-n:127.0.0.1:39439_solr x:dv_coll_shard1_replica_n1 s:shard1 c:dv_coll r:core_node1) [n:127.0.0.1:39439_solr c:dv_coll s:shard1 r:core_node1 x:dv_coll_shard1_replica_n1] o.a.s.c.SolrCore [dv_coll_shard1_replica_n1] Registered new searcher Searcher@1e508fd[dv_coll_shard1_replica_n1] main{ExitableDirectoryReader(UninvertingDirectoryReader(Uninverting(_0(8.0.0):C1)))}
[junit4] 2> 1296032 INFO (qtp18810426-14495) [n:127.0.0.1:33565_solr c:dv_coll s:shard2 r:core_node2 x:dv_coll_shard2_replica_n1] o.a.s.s.SolrIndexSearcher Opening [Searcher@2abeda[dv_coll_shard2_replica_n1] main]
[junit4] 2> 1296032 INFO (qtp20456943-14542) [n:127.0.0.1:39439_solr c:dv_coll s:shard1 r:core_node1 x:dv_coll_shard1_replica_n1] o.a.s.u.p.LogUpdateProcessorFactory [dv_coll_shard1_replica_n1] webapp=/solr path=/update params={update.distrib=FROMLEADER&waitSearcher=true&openSearcher=true&commit=true&softCommit=false&distrib.from=https://127.0.0.1:33565/solr/dv_coll_shard2_replica_n1/&commit_end_point=true&wt=javabin&version=2&expungeDeletes=false}{commit=} 0 7
[junit4] 2> 1296033 INFO (qtp18810426-14495) [n:127.0.0.1:33565_solr c:dv_coll s:shard2 r:core_node2 x:dv_coll_shard2_replica_n1] o.a.s.u.DirectUpdateHandler2 end_commit_flush
[junit4] 2> 1296033 INFO (searcherExecutor-5065-thread-1-processing-n:127.0.0.1:33565_solr x:dv_coll_shard2_replica_n1 s:shard2 c:dv_coll r:core_node2) [n:127.0.0.1:33565_solr c:dv_coll s:shard2 r:core_node2 x:dv_coll_shard2_replica_n1] o.a.s.c.SolrCore [dv_coll_shard2_replica_n1] Registered new searcher Searcher@2abeda[dv_coll_shard2_replica_n1] main{ExitableDirectoryReader(UninvertingDirectoryReader(Uninverting(_0(8.0.0):C1)))}
[junit4] 2> 1296033 INFO (qtp18810426-14495) [n:127.0.0.1:33565_solr c:dv_coll s:shard2 r:core_node2 x:dv_coll_shard2_replica_n1] o.a.s.u.p.LogUpdateProcessorFactory [dv_coll_shard2_replica_n1] webapp=/solr path=/update params={update.distrib=FROMLEADER&waitSearcher=true&openSearcher=true&commit=true&softCommit=false&distrib.from=https://127.0.0.1:33565/solr/dv_coll_shard2_replica_n1/&commit_end_point=true&wt=javabin&version=2&expungeDeletes=false}{commit=} 0 8
[junit4] 2> 1296034 INFO (searcherExecutor-5085-thread-1-processing-n:127.0.0.1:39439_solr x:dv_coll_shard3_replica_n1 s:shard3 c:dv_coll r:core_node3) [n:127.0.0.1:39439_solr c:dv_coll s:shard3 r:core_node3 x:dv_coll_shard3_replica_n1] o.a.s.c.SolrCore [dv_coll_shard3_replica_n1] Registered new searcher Searcher@1241c6b[dv_coll_shard3_replica_n1] main{ExitableDirectoryReader(UninvertingDirectoryReader(Uninverting(_0(8.0.0):C1) Uninverting(_1(8.0.0):C1)))}
[junit4] 2> 12960
[...truncated too long message...]
ed#[BBB496829EB0D1C0]) [ ] o.a.s.c.ZkTestServer connecting to 127.0.0.1:44171 44171
[junit4] 2> 1430534 INFO (Thread-4447) [ ] o.a.s.c.ZkTestServer connecting to 127.0.0.1:44171 44171
[junit4] 2> 1430535 WARN (Thread-4447) [ ] o.a.s.c.ZkTestServer Watch limit violations:
[junit4] 2> Maximum concurrent create/delete watches above limit:
[junit4] 2>
[junit4] 2> 6 /solr/aliases.json
[junit4] 2> 4 /solr/security.json
[junit4] 2> 4 /solr/configs/conf1
[junit4] 2>
[junit4] 2> Maximum concurrent data watches above limit:
[junit4] 2>
[junit4] 2> 6 /solr/clusterprops.json
[junit4] 2> 6 /solr/clusterstate.json
[junit4] 2> 3 /solr/collections/collection1/state.json
[junit4] 2> 3 /solr/collections/c8n_1x3_lf/state.json
[junit4] 2> 2 /solr/overseer_elect/election/98245858051424260-127.0.0.1:39283_-n_0000000000
[junit4] 2>
[junit4] 2> Maximum concurrent children watches above limit:
[junit4] 2>
[junit4] 2> 6 /solr/live_nodes
[junit4] 2> 6 /solr/collections
[junit4] 2> 3 /solr/overseer/queue
[junit4] 2> 3 /solr/overseer/collection-queue-work
[junit4] 2>
[junit4] 2> 1430535 WARN (TEST-LeaderFailoverAfterPartitionTest.test-seed#[BBB496829EB0D1C0]) [ ] o.a.s.c.SocketProxy Closing 0 connections to: http://127.0.0.1:38719/, target: http://127.0.0.1:46289/
[junit4] 2> 1430535 WARN (TEST-LeaderFailoverAfterPartitionTest.test-seed#[BBB496829EB0D1C0]) [ ] o.a.s.c.SocketProxy Closing 1 connections to: http://127.0.0.1:39283/, target: http://127.0.0.1:36457/
[junit4] 2> 1430535 WARN (TEST-LeaderFailoverAfterPartitionTest.test-seed#[BBB496829EB0D1C0]) [ ] o.a.s.c.SocketProxy Closing 6 connections to: http://127.0.0.1:38231/, target: http://127.0.0.1:43521/
[junit4] 2> 1430535 WARN (TEST-LeaderFailoverAfterPartitionTest.test-seed#[BBB496829EB0D1C0]) [ ] o.a.s.c.SocketProxy Closing 3 connections to: http://127.0.0.1:42895/, target: http://127.0.0.1:33319/
[junit4] 2> NOTE: reproduce with: ant test -Dtestcase=LeaderFailoverAfterPartitionTest -Dtests.method=test -Dtests.seed=BBB496829EB0D1C0 -Dtests.multiplier=3 -Dtests.slow=true -Dtests.locale=es-UY -Dtests.timezone=Etc/GMT-3 -Dtests.asserts=true -Dtests.file.encoding=UTF-8
[junit4] FAILURE 128s J2 | LeaderFailoverAfterPartitionTest.test <<<
[junit4] > Throwable #1: java.lang.AssertionError: Expected 2 of 3 replicas to be active but only found 1; [core_node2:{"core":"c8n_1x3_lf_shard1_replica_n2","base_url":"http://127.0.0.1:38231","node_name":"127.0.0.1:38231_","state":"active","type":"NRT","leader":"true"}]; clusterState: DocCollection(c8n_1x3_lf//collections/c8n_1x3_lf/state.json/17)={
[junit4] > "pullReplicas":"0",
[junit4] > "replicationFactor":"1",
[junit4] > "shards":{"shard1":{
[junit4] > "range":"80000000-7fffffff",
[junit4] > "state":"active",
[junit4] > "replicas":{
[junit4] > "core_node1":{
[junit4] > "state":"down",
[junit4] > "base_url":"http://127.0.0.1:39283",
[junit4] > "core":"c8n_1x3_lf_shard1_replica_n1",
[junit4] > "node_name":"127.0.0.1:39283_",
[junit4] > "type":"NRT"},
[junit4] > "core_node2":{
[junit4] > "core":"c8n_1x3_lf_shard1_replica_n2",
[junit4] > "base_url":"http://127.0.0.1:38231",
[junit4] > "node_name":"127.0.0.1:38231_",
[junit4] > "state":"active",
[junit4] > "type":"NRT",
[junit4] > "leader":"true"},
[junit4] > "core_node3":{
[junit4] > "core":"c8n_1x3_lf_shard1_replica_n3",
[junit4] > "base_url":"http://127.0.0.1:38719",
[junit4] > "node_name":"127.0.0.1:38719_",
[junit4] > "state":"down",
[junit4] > "type":"NRT"}}}},
[junit4] > "router":{"name":"compositeId"},
[junit4] > "maxShardsPerNode":"1",
[junit4] > "autoAddReplicas":"false",
[junit4] > "nrtReplicas":"3",
[junit4] > "tlogReplicas":"0"}
[junit4] > at __randomizedtesting.SeedInfo.seed([BBB496829EB0D1C0:33E0A958304CBC38]:0)
[junit4] > at org.apache.solr.cloud.LeaderFailoverAfterPartitionTest.testRf3WithLeaderFailover(LeaderFailoverAfterPartitionTest.java:169)
[junit4] > at org.apache.solr.cloud.LeaderFailoverAfterPartitionTest.test(LeaderFailoverAfterPartitionTest.java:56)
[junit4] > at org.apache.solr.BaseDistributedSearchTestCase$ShardsRepeatRule$ShardsFixedStatement.callStatement(BaseDistributedSearchTestCase.java:985)
[junit4] > at org.apache.solr.BaseDistributedSearchTestCase$ShardsRepeatRule$ShardsStatement.evaluate(BaseDistributedSearchTestCase.java:960)
[junit4] > at java.lang.Thread.run(Thread.java:748)
[junit4] 2> NOTE: leaving temporary files on disk at: /home/jenkins/workspace/Lucene-Solr-master-Linux/solr/build/solr-core/test/J2/temp/solr.cloud.LeaderFailoverAfterPartitionTest_BBB496829EB0D1C0-001
[junit4] 2> Jul 03, 2017 8:15:51 PM com.carrotsearch.randomizedtesting.ThreadLeakControl checkThreadLeaks
[junit4] 2> WARNING: Will linger awaiting termination of 5 leaked thread(s).
[junit4] 2> NOTE: test params are: codec=CheapBastard, sim=RandomSimilarity(queryNorm=false): {}, locale=es-UY, timezone=Etc/GMT-3
[junit4] 2> NOTE: Linux 4.10.0-21-generic i386/Oracle Corporation 1.8.0_131 (32-bit)/cpus=8,threads=1,free=160162760,total=445292544
[junit4] 2> NOTE: All tests run in this JVM: [HdfsDirectoryFactoryTest, CollectionsAPISolrJTest, DeleteInactiveReplicaTest, CleanupOldIndexTest, FastVectorHighlighterTest, CollectionStateFormat2Test, TestRecovery, SolrCloudExampleTest, ForceLeaderTest, HdfsWriteToMultipleCollectionsTest, TestLockTree, HdfsBasicDistributedZkTest, TestManagedSchema, TestDeleteCollectionOnDownNodes, OutOfBoxZkACLAndCredentialsProvidersTest, AliasIntegrationTest, TestUseDocValuesAsStored, TestQueryWrapperFilter, SaslZkACLProviderTest, TestReqParamsAPI, DistributedFacetExistsSmallTest, SimplePostToolTest, TestApiFramework, LeaderElectionTest, BasicAuthStandaloneTest, ReturnFieldsTest, TestClusterProperties, TestFilteredDocIdSet, TestMiniSolrCloudClusterSSL, DateMathParserTest, CdcrReplicationHandlerTest, TestCloudNestedDocsSort, UpdateLogTest, PreAnalyzedUpdateProcessorTest, TestLeaderElectionZkExpiry, TestQueryUtils, PreAnalyzedFieldManagedSchemaCloudTest, SolrTestCaseJ4Test, TestCloudDeleteByQuery, TestFileDictionaryLookup, TestSolrXml, TestRequestForwarding, DirectUpdateHandlerOptimizeTest, AtomicUpdateProcessorFactoryTest, TestDynamicLoading, TestJmxIntegration, ResponseLogComponentTest, TestMissingGroups, TestOverriddenPrefixQueryForCustomFieldType, TestConfigReload, TestSchemaSimilarityResource, SimpleMLTQParserTest, SignatureUpdateProcessorFactoryTest, UniqFieldsUpdateProcessorFactoryTest, CheckHdfsIndexTest, TestCustomDocTransformer, TestFoldingMultitermQuery, RequestLoggingTest, TestSortByMinMaxFunction, TestExactStatsCache, SearchHandlerTest, PrimitiveFieldTypeTest, DeleteReplicaTest, TermVectorComponentDistributedTest, FacetPivotSmallTest, PolyFieldTest, CoreAdminCreateDiscoverTest, SpellPossibilityIteratorTest, TestFieldTypeResource, TestSQLHandlerNonCloud, FullSolrCloudDistribCmdsTest, LeaderInitiatedRecoveryOnShardRestartTest, TestCodecSupport, OverseerTest, CopyFieldTest, TlogReplayBufferedWhileIndexingTest, TestZkChroot, TestAnalyzedSuggestions, TestNamedUpdateProcessors, TestStandardQParsers, TestLMJelinekMercerSimilarityFactory, TestInitQParser, TestSolr4Spatial2, TestChildDocTransformer, SolrJmxReporterTest, NumericFieldsTest, HttpSolrCallGetCoreTest, TestDelegationWithHadoopAuth, TestSurroundQueryParser, HdfsThreadLeakTest, TestLFUCache, SpellCheckCollatorWithCollapseTest, TestLegacyFieldCache, TestStressCloudBlindAtomicUpdates, HardAutoCommitTest, TestSuggestSpellingConverter, TestNumericRangeQuery32, RecoveryZkTest, DistanceUnitsTest, StatsComponentTest, TestUtils, JavabinLoaderTest, AutoCommitTest, TestRandomRequestDistribution, MoveReplicaTest, TestQuerySenderListener, TestComplexPhraseQParserPlugin, XsltUpdateRequestHandlerTest, TestConfigSetsAPIExclusivity, TestXmlQParser, TestRTimerTree, TestCloudPivotFacet, RequiredFieldsTest, InfoHandlerTest, TestNonDefinedSimilarityFactory, TestDistributedMissingSort, TestIndexSearcher, ShufflingReplicaListTransformerTest, BadIndexSchemaTest, PeerSyncTest, ShowFileRequestHandlerTest, AnalysisAfterCoreReloadTest, TestExtendedDismaxParser, SuggesterFSTTest, SolrRequestParserTest, SuggesterTest, TestTrie, SpatialFilterTest, NoCacheHeaderTest, SchemaVersionSpecificBehaviorTest, TestUpdate, TestAtomicUpdateErrorCases, SortByFunctionTest, TestRemoteStreaming, CacheHeaderTest, LukeRequestHandlerTest, DirectSolrSpellCheckerTest, TestReversedWildcardFilterFactory, TermsComponentTest, RequestHandlersTest, PathHierarchyTokenizerFactoryTest, FieldAnalysisRequestHandlerTest, IndexSchemaRuntimeFieldTest, RegexBoostProcessorTest, TestCSVResponseWriter, BinaryUpdateRequestHandlerTest, TestPHPSerializedResponseWriter, CSVRequestHandlerTest, TestComponentsName, HighlighterConfigTest, SOLR749Test, UpdateParamsTest, AlternateDirectoryTest, BadComponentTest, TestMergePolicyConfig, TestSolrDeletionPolicy2, MultiTermTest, TestBinaryField, MinimalSchemaTest, TestSolrCoreProperties, TestPhraseSuggestions, TestPerFieldSimilarity, TestFastWriter, ResourceLoaderTest, OpenExchangeRatesOrgProviderTest, PluginInfoTest, DateFieldTest, FileUtilsTest, DistributedIntervalFacetingTest, CdcrVersionReplicationTest, ChaosMonkeyNothingIsSafeWithPullReplicasTest, DeleteNodeTest, DeleteStatusTest, DistribJoinFromCollectionTest, DistributedQueueTest, LeaderFailoverAfterPartitionTest]
[junit4] Completed [522/725 (2!)] on J2 in 127.93s, 1 test, 1 failure <<< FAILURES!
[...truncated 40062 lines...]