You are viewing a plain text version of this content. The canonical link for it is here.
Posted to commits@flex.apache.org by fl...@gmail.com on 2017/01/18 04:07:51 UTC
Build failed in Jenkins: flex-asjs #1879
See <http://apacheflexbuild.cloudapp.net:8080/job/flex-asjs/1879/>
------------------------------------------
[...truncated 3997 lines...]
[java] Dependencies calculated for '<http://apacheflexbuild.cloudapp.net:8080/job/flex-asjs/ws/mustella/tests/basicTests/bin/js-debug/org/apache/flex/events/ElementEvents.js'>
[java] Dependencies calculated for '<http://apacheflexbuild.cloudapp.net:8080/job/flex-asjs/ws/mustella/tests/basicTests/bin/js-debug/org/apache/flex/events/Event.js'>
[java] Dependencies calculated for '<http://apacheflexbuild.cloudapp.net:8080/job/flex-asjs/ws/mustella/tests/basicTests/bin/js-debug/org/apache/flex/core/IFlexJSElement.js'>
[java] Dependencies calculated for '<http://apacheflexbuild.cloudapp.net:8080/job/flex-asjs/ws/mustella/tests/basicTests/bin/js-debug/org/apache/flex/events/IFlexJSEvent.js'>
[java] Dependencies calculated for '<http://apacheflexbuild.cloudapp.net:8080/job/flex-asjs/ws/mustella/tests/basicTests/bin/js-debug/org/apache/flex/events/EventDispatcher.js'>
[java] Dependencies calculated for '<http://apacheflexbuild.cloudapp.net:8080/job/flex-asjs/ws/mustella/tests/basicTests/bin/js-debug/org/apache/flex/events/IEventDispatcher.js'>
[java] Dependencies calculated for '<http://apacheflexbuild.cloudapp.net:8080/job/flex-asjs/ws/mustella/tests/basicTests/bin/js-debug/org/apache/flex/events/utils/EventUtils.js'>
[java] Dependencies calculated for '<http://apacheflexbuild.cloudapp.net:8080/job/flex-asjs/ws/mustella/tests/basicTests/bin/js-debug/org/apache/flex/core/IStrand.js'>
[java] Dependencies calculated for '<http://apacheflexbuild.cloudapp.net:8080/job/flex-asjs/ws/mustella/tests/basicTests/bin/js-debug/org/apache/flex/core/ValuesManager.js'>
[java] Dependencies calculated for '<http://apacheflexbuild.cloudapp.net:8080/job/flex-asjs/ws/mustella/tests/basicTests/bin/js-debug/org/apache/flex/core/IBead.js'>
[java] Dependencies calculated for '<http://apacheflexbuild.cloudapp.net:8080/job/flex-asjs/ws/mustella/tests/basicTests/bin/js-debug/org/apache/flex/core/IBeadModel.js'>
[java] Dependencies calculated for '<http://apacheflexbuild.cloudapp.net:8080/job/flex-asjs/ws/mustella/tests/basicTests/bin/js-debug/org/apache/flex/core/IStrandWithModel.js'>
[java] Dependencies calculated for '<http://apacheflexbuild.cloudapp.net:8080/job/flex-asjs/ws/mustella/tests/basicTests/bin/js-debug/org/apache/flex/utils/StringUtil.js'>
[java] Dependencies calculated for '<http://apacheflexbuild.cloudapp.net:8080/job/flex-asjs/ws/mustella/tests/basicTests/bin/js-debug/org/apache/flex/utils/StringTrimmer.js'>
[java] Dependencies calculated for '<http://apacheflexbuild.cloudapp.net:8080/job/flex-asjs/ws/mustella/tests/basicTests/bin/js-debug/org/apache/flex/core/IBeadController.js'>
[java] Dependencies calculated for '<http://apacheflexbuild.cloudapp.net:8080/job/flex-asjs/ws/mustella/tests/basicTests/bin/js-debug/org/apache/flex/core/IBeadView.js'>
[java] Dependencies calculated for '<http://apacheflexbuild.cloudapp.net:8080/job/flex-asjs/ws/mustella/tests/basicTests/bin/js-debug/org/apache/flex/core/ILayoutChild.js'>
[java] Dependencies calculated for '<http://apacheflexbuild.cloudapp.net:8080/job/flex-asjs/ws/mustella/tests/basicTests/bin/js-debug/org/apache/flex/core/IChild.js'>
[java] Dependencies calculated for '<http://apacheflexbuild.cloudapp.net:8080/job/flex-asjs/ws/mustella/tests/basicTests/bin/js-debug/org/apache/flex/core/IRenderedObject.js'>
[java] Dependencies calculated for '<http://apacheflexbuild.cloudapp.net:8080/job/flex-asjs/ws/mustella/tests/basicTests/bin/js-debug/org/apache/flex/core/IUIBase.js'>
[java] Dependencies calculated for '<http://apacheflexbuild.cloudapp.net:8080/job/flex-asjs/ws/mustella/tests/basicTests/bin/js-debug/org/apache/flex/core/IMeasurementBead.js'>
[java] Dependencies calculated for '<http://apacheflexbuild.cloudapp.net:8080/job/flex-asjs/ws/mustella/tests/basicTests/bin/js-debug/org/apache/flex/core/IParentIUIBase.js'>
[java] Dependencies calculated for '<http://apacheflexbuild.cloudapp.net:8080/job/flex-asjs/ws/mustella/tests/basicTests/bin/js-debug/org/apache/flex/core/IParent.js'>
[java] Dependencies calculated for '<http://apacheflexbuild.cloudapp.net:8080/job/flex-asjs/ws/mustella/tests/basicTests/bin/js-debug/org/apache/flex/core/IStyleableObject.js'>
[java] Dependencies calculated for '<http://apacheflexbuild.cloudapp.net:8080/job/flex-asjs/ws/mustella/tests/basicTests/bin/js-debug/org/apache/flex/core/ITransformHost.js'>
[java] Dependencies calculated for '<http://apacheflexbuild.cloudapp.net:8080/job/flex-asjs/ws/mustella/tests/basicTests/bin/js-debug/org/apache/flex/core/IContentView.js'>
[java] Dependencies calculated for '<http://apacheflexbuild.cloudapp.net:8080/job/flex-asjs/ws/mustella/tests/basicTests/bin/js-debug/org/apache/flex/html/beads/layouts/BasicLayout.js'>
[java] Dependencies calculated for '<http://apacheflexbuild.cloudapp.net:8080/job/flex-asjs/ws/mustella/tests/basicTests/bin/js-debug/org/apache/flex/core/IBeadLayout.js'>
[java] Dependencies calculated for '<http://apacheflexbuild.cloudapp.net:8080/job/flex-asjs/ws/mustella/tests/basicTests/bin/js-debug/org/apache/flex/core/ILayoutParent.js'>
[java] Dependencies calculated for '<http://apacheflexbuild.cloudapp.net:8080/job/flex-asjs/ws/mustella/tests/basicTests/bin/js-debug/org/apache/flex/html/supportClasses/Viewport.js'>
[java] Dependencies calculated for '<http://apacheflexbuild.cloudapp.net:8080/job/flex-asjs/ws/mustella/tests/basicTests/bin/js-debug/org/apache/flex/geom/Size.js'>
[java] Dependencies calculated for '<http://apacheflexbuild.cloudapp.net:8080/job/flex-asjs/ws/mustella/tests/basicTests/bin/js-debug/org/apache/flex/utils/CSSContainerUtils.js'>
[java] Dependencies calculated for '<http://apacheflexbuild.cloudapp.net:8080/job/flex-asjs/ws/mustella/tests/basicTests/bin/js-debug/org/apache/flex/geom/Rectangle.js'>
[java] Dependencies calculated for '<http://apacheflexbuild.cloudapp.net:8080/job/flex-asjs/ws/mustella/tests/basicTests/bin/js-debug/org/apache/flex/geom/Point.js'>
[java] Dependencies calculated for '<http://apacheflexbuild.cloudapp.net:8080/job/flex-asjs/ws/mustella/tests/basicTests/bin/js-debug/org/apache/flex/utils/CSSUtils.js'>
[java] Dependencies calculated for '<http://apacheflexbuild.cloudapp.net:8080/job/flex-asjs/ws/mustella/tests/basicTests/bin/js-debug/org/apache/flex/utils/StringPadder.js'>
[java] Dependencies calculated for '<http://apacheflexbuild.cloudapp.net:8080/job/flex-asjs/ws/mustella/tests/basicTests/bin/js-debug/org/apache/flex/core/IViewport.js'>
[java] Dependencies calculated for '<http://apacheflexbuild.cloudapp.net:8080/job/flex-asjs/ws/mustella/tests/basicTests/bin/js-debug/org/apache/flex/html/beads/ContainerView.js'>
[java] Dependencies calculated for '<http://apacheflexbuild.cloudapp.net:8080/job/flex-asjs/ws/mustella/tests/basicTests/bin/js-debug/org/apache/flex/core/BeadViewBase.js'>
[java] Dependencies calculated for '<http://apacheflexbuild.cloudapp.net:8080/job/flex-asjs/ws/mustella/tests/basicTests/bin/js-debug/org/apache/flex/core/IContainerView.js'>
[java] Dependencies calculated for '<http://apacheflexbuild.cloudapp.net:8080/job/flex-asjs/ws/mustella/tests/basicTests/bin/js-debug/org/apache/flex/core/IContentViewHost.js'>
[java] Dependencies calculated for '<http://apacheflexbuild.cloudapp.net:8080/job/flex-asjs/ws/mustella/tests/basicTests/bin/js-debug/org/apache/flex/core/ILayoutHost.js'>
[java] Dependencies calculated for '<http://apacheflexbuild.cloudapp.net:8080/job/flex-asjs/ws/mustella/tests/basicTests/bin/js-debug/org/apache/flex/core/IViewportModel.js'>
[java] Dependencies calculated for '<http://apacheflexbuild.cloudapp.net:8080/job/flex-asjs/ws/mustella/tests/basicTests/bin/js-debug/org/apache/flex/html/beads/IBackgroundBead.js'>
[java] Dependencies calculated for '<http://apacheflexbuild.cloudapp.net:8080/job/flex-asjs/ws/mustella/tests/basicTests/bin/js-debug/org/apache/flex/html/beads/IBorderBead.js'>
[java] Dependencies calculated for '<http://apacheflexbuild.cloudapp.net:8080/job/flex-asjs/ws/mustella/tests/basicTests/bin/js-debug/org/apache/flex/html/beads/models/ViewportModel.js'>
[java] Dependencies calculated for '<http://apacheflexbuild.cloudapp.net:8080/job/flex-asjs/ws/mustella/tests/basicTests/bin/js-debug/org/apache/flex/utils/EffectTimer.js'>
[java] Dependencies calculated for '<http://apacheflexbuild.cloudapp.net:8080/job/flex-asjs/ws/mustella/tests/basicTests/bin/js-debug/org/apache/flex/events/ValueEvent.js'>
[java] Dependencies calculated for '<http://apacheflexbuild.cloudapp.net:8080/job/flex-asjs/ws/mustella/tests/basicTests/bin/js-debug/org/apache/flex/core/IEffectTimer.js'>
[java] Dependencies calculated for '<http://apacheflexbuild.cloudapp.net:8080/job/flex-asjs/ws/mustella/tests/basicTests/bin/js-debug/org/apache/flex/core/SimpleStatesImpl.js'>
[java] Dependencies calculated for '<http://apacheflexbuild.cloudapp.net:8080/job/flex-asjs/ws/mustella/tests/basicTests/bin/js-debug/org/apache/flex/events/ValueChangeEvent.js'>
[java] Dependencies calculated for '<http://apacheflexbuild.cloudapp.net:8080/job/flex-asjs/ws/mustella/tests/basicTests/bin/js-debug/org/apache/flex/states/AddItems.js'>
[java] Dependencies calculated for '<http://apacheflexbuild.cloudapp.net:8080/job/flex-asjs/ws/mustella/tests/basicTests/bin/js-debug/org/apache/flex/states/ItemAndDescriptor.js'>
[java] Dependencies calculated for '<http://apacheflexbuild.cloudapp.net:8080/job/flex-asjs/ws/mustella/tests/basicTests/bin/js-debug/org/apache/flex/core/IDocument.js'>
[java] Dependencies calculated for '<http://apacheflexbuild.cloudapp.net:8080/job/flex-asjs/ws/mustella/tests/basicTests/bin/js-debug/org/apache/flex/states/SetEventHandler.js'>
[java] Dependencies calculated for '<http://apacheflexbuild.cloudapp.net:8080/job/flex-asjs/ws/mustella/tests/basicTests/bin/js-debug/org/apache/flex/states/SetProperty.js'>
[java] Dependencies calculated for '<http://apacheflexbuild.cloudapp.net:8080/job/flex-asjs/ws/mustella/tests/basicTests/bin/js-debug/org/apache/flex/utils/MXMLDataInterpreter.js'>
[java] Dependencies calculated for '<http://apacheflexbuild.cloudapp.net:8080/job/flex-asjs/ws/mustella/tests/basicTests/bin/js-debug/org/apache/flex/core/IContainer.js'>
[java] Dependencies calculated for '<http://apacheflexbuild.cloudapp.net:8080/job/flex-asjs/ws/mustella/tests/basicTests/bin/js-debug/org/apache/flex/core/IMXMLDocument.js'>
[java] Dependencies calculated for '<http://apacheflexbuild.cloudapp.net:8080/job/flex-asjs/ws/mustella/tests/basicTests/bin/js-debug/org/apache/flex/core/IStatesImpl.js'>
[java] Dependencies calculated for '<http://apacheflexbuild.cloudapp.net:8080/job/flex-asjs/ws/mustella/tests/basicTests/bin/js-debug/org/apache/flex/core/IStatesObject.js'>
[java] Dependencies calculated for '<http://apacheflexbuild.cloudapp.net:8080/job/flex-asjs/ws/mustella/tests/basicTests/bin/js-debug/org/apache/flex/html/beads/layouts/VerticalLayout.js'>
[java] Dependencies calculated for '<http://apacheflexbuild.cloudapp.net:8080/job/flex-asjs/ws/mustella/tests/basicTests/bin/js-debug/org/apache/flex/core/Application.js'>
[java] Dependencies calculated for '<http://apacheflexbuild.cloudapp.net:8080/job/flex-asjs/ws/mustella/tests/basicTests/bin/js-debug/org/apache/flex/core/ApplicationBase.js'>
[java] Dependencies calculated for '<http://apacheflexbuild.cloudapp.net:8080/job/flex-asjs/ws/mustella/tests/basicTests/bin/js-debug/org/apache/flex/core/IFlexInfo.js'>
[java] Dependencies calculated for '<http://apacheflexbuild.cloudapp.net:8080/job/flex-asjs/ws/mustella/tests/basicTests/bin/js-debug/org/apache/flex/utils/Timer.js'>
[java] Dependencies calculated for '<http://apacheflexbuild.cloudapp.net:8080/job/flex-asjs/ws/mustella/tests/basicTests/bin/js-debug/org/apache/flex/core/IInitialViewApplication.js'>
[java] Dependencies calculated for '<http://apacheflexbuild.cloudapp.net:8080/job/flex-asjs/ws/mustella/tests/basicTests/bin/js-debug/org/apache/flex/core/IPopUpHost.js'>
[java] Dependencies calculated for '<http://apacheflexbuild.cloudapp.net:8080/job/flex-asjs/ws/mustella/tests/basicTests/bin/js-debug/org/apache/flex/core/ISWFApplication.js'>
[java] Dependencies calculated for '<http://apacheflexbuild.cloudapp.net:8080/job/flex-asjs/ws/mustella/tests/basicTests/bin/js-debug/org/apache/flex/core/SimpleCSSValuesImpl.js'>
[java] Dependencies calculated for '<http://apacheflexbuild.cloudapp.net:8080/job/flex-asjs/ws/mustella/tests/basicTests/bin/js-debug/org/apache/flex/core/ICSSImpl.js'>
[java] Dependencies calculated for '<http://apacheflexbuild.cloudapp.net:8080/job/flex-asjs/ws/mustella/tests/basicTests/bin/js-debug/org/apache/flex/core/IValuesImpl.js'>
[java] Dependencies calculated for '<http://apacheflexbuild.cloudapp.net:8080/job/flex-asjs/ws/mustella/tests/basicTests/bin/js-debug/BasicTests.js'>
[java] Dependencies calculated for '<http://apacheflexbuild.cloudapp.net:8080/job/flex-asjs/ws/mustella/tests/basicTests/bin/js-debug/org/apache/flex/core/View.js'>
[java] Dependencies calculated for '<http://apacheflexbuild.cloudapp.net:8080/job/flex-asjs/ws/mustella/tests/basicTests/bin/js-debug/org/apache/flex/core/ViewBase.js'>
[java] Dependencies calculated for '<http://apacheflexbuild.cloudapp.net:8080/job/flex-asjs/ws/mustella/tests/basicTests/bin/js-debug/org/apache/flex/core/ContainerBase.js'>
[java] Dependencies calculated for '<http://apacheflexbuild.cloudapp.net:8080/job/flex-asjs/ws/mustella/tests/basicTests/bin/js-debug/org/apache/flex/core/ContainerBaseStrandChildren.js'>
[java] Dependencies calculated for '<http://apacheflexbuild.cloudapp.net:8080/job/flex-asjs/ws/mustella/tests/basicTests/bin/js-debug/org/apache/flex/core/IApplicationView.js'>
[java] Dependencies calculated for '<http://apacheflexbuild.cloudapp.net:8080/job/flex-asjs/ws/mustella/tests/basicTests/bin/js-debug/org/apache/flex/states/State.js'>
[java] Dependencies calculated for '<http://apacheflexbuild.cloudapp.net:8080/job/flex-asjs/ws/mustella/tests/basicTests/bin/js-debug/halo/views/ButtonTests.js'>
[java] Dependencies calculated for '<http://apacheflexbuild.cloudapp.net:8080/job/flex-asjs/ws/mustella/tests/basicTests/bin/js-debug/shim/VBox.js'>
[java] Dependencies calculated for '<http://apacheflexbuild.cloudapp.net:8080/job/flex-asjs/ws/mustella/tests/basicTests/bin/js-debug/org/apache/flex/html/Container.js'>
[java] Dependencies calculated for '<http://apacheflexbuild.cloudapp.net:8080/job/flex-asjs/ws/mustella/tests/basicTests/bin/js-debug/org/apache/flex/html/TextButton.js'>
[java] Dependencies calculated for '<http://apacheflexbuild.cloudapp.net:8080/job/flex-asjs/ws/mustella/tests/basicTests/bin/js-debug/org/apache/flex/html/Button.js'>
[java] Dependencies calculated for '<http://apacheflexbuild.cloudapp.net:8080/job/flex-asjs/ws/mustella/tests/basicTests/bin/js-debug/org/apache/flex/html/ButtonBase.js'>
[java] Dependencies calculated for '<http://apacheflexbuild.cloudapp.net:8080/job/flex-asjs/ws/mustella/tests/basicTests/bin/js-debug/org/apache/flex/html/Label.js'>
[java] Dependencies calculated for '<http://apacheflexbuild.cloudapp.net:8080/job/flex-asjs/ws/mustella/tests/basicTests/bin/js-debug/org/apache/flex/events/MouseEvent.js'>
[java] Dependencies calculated for '<http://apacheflexbuild.cloudapp.net:8080/job/flex-asjs/ws/mustella/tests/basicTests/bin/js-debug/org/apache/flex/utils/PointUtils.js'>
[java] Dependencies calculated for '<http://apacheflexbuild.cloudapp.net:8080/job/flex-asjs/ws/mustella/tests/basicTests/bin/js-debug/halo/views/CheckBoxTests.js'>
[java] Dependencies calculated for '<http://apacheflexbuild.cloudapp.net:8080/job/flex-asjs/ws/mustella/tests/basicTests/bin/js-debug/org/apache/flex/html/CheckBox.js'>
[java] Dependencies calculated for '<http://apacheflexbuild.cloudapp.net:8080/job/flex-asjs/ws/mustella/tests/basicTests/bin/js-debug/org/apache/flex/html/supportClasses/CheckBoxIcon.js'>
[java] Dependencies calculated for '<http://apacheflexbuild.cloudapp.net:8080/job/flex-asjs/ws/mustella/tests/basicTests/bin/js-debug/org/apache/flex/utils/MixinManager.js'>
[java] Dependencies calculated for '<http://apacheflexbuild.cloudapp.net:8080/job/flex-asjs/ws/mustella/tests/basicTests/bin/js-debug/org/apache/flex/core/CSSFontFaceBead.js'>
[java] Dependencies calculated for '<http://apacheflexbuild.cloudapp.net:8080/job/flex-asjs/ws/mustella/tests/basicTests/bin/js-debug/halo/scripts/CheckBoxTestScript.js'>
[java] Dependencies calculated for '<http://apacheflexbuild.cloudapp.net:8080/job/flex-asjs/ws/mustella/tests/basicTests/bin/js-debug/UnitTester.js'>
[java] Dependencies calculated for '<http://apacheflexbuild.cloudapp.net:8080/job/flex-asjs/ws/mustella/tests/basicTests/bin/js-debug/TestCase.js'>
[java] Dependencies calculated for '<http://apacheflexbuild.cloudapp.net:8080/job/flex-asjs/ws/mustella/tests/basicTests/bin/js-debug/SetProperty.js'>
[java] Dependencies calculated for '<http://apacheflexbuild.cloudapp.net:8080/job/flex-asjs/ws/mustella/tests/basicTests/bin/js-debug/AssertPropertyValue.js'>
[java] Dependencies calculated for '<http://apacheflexbuild.cloudapp.net:8080/job/flex-asjs/ws/mustella/tests/basicTests/bin/js-debug/DispatchMouseEvent.js'>
[java] Dependencies calculated for '<http://apacheflexbuild.cloudapp.net:8080/job/flex-asjs/ws/mustella/tests/basicTests/bin/js-debug/DispatchMouseClickEvent.js'>
[java] Dependencies calculated for '<http://apacheflexbuild.cloudapp.net:8080/job/flex-asjs/ws/mustella/tests/basicTests/bin/js-debug/halo/scripts/ButtonTestScript.js'>
[java] Dependencies calculated for '<http://apacheflexbuild.cloudapp.net:8080/job/flex-asjs/ws/mustella/tests/basicTests/bin/js-debug/SetShowRTE.js'>
[java] Dependencies calculated for '<http://apacheflexbuild.cloudapp.net:8080/job/flex-asjs/ws/mustella/tests/basicTests/bin/js-debug/SendFormattedResultsToLog.js'>
[java] Dependencies calculated for '<http://apacheflexbuild.cloudapp.net:8080/job/flex-asjs/ws/mustella/tests/basicTests/bin/js-debug/FlexJSContext.js'>
[java] Dependencies calculated for '<http://apacheflexbuild.cloudapp.net:8080/job/flex-asjs/ws/mustella/tests/basicTests/bin/js-debug/ExitWhenDone.js'>
[java] The project 'BasicTestsApp' has been successfully compiled and optimized.
[java] 24.4693591 seconds
[java] Picked up JAVA_TOOL_OPTIONS: -Dfile.encoding=UTF8
basictests-compile-java:
[delete] Deleting directory <http://apacheflexbuild.cloudapp.net:8080/job/flex-asjs/ws/mustella/java/bin>
[mkdir] Created dir: <http://apacheflexbuild.cloudapp.net:8080/job/flex-asjs/ws/mustella/java/bin>
[javac] <http://apacheflexbuild.cloudapp.net:8080/job/flex-asjs/ws/build.xml>:1280: warning: 'includeantruntime' was not set, defaulting to build.sysclasspath=last; set to false for repeatable builds
[javac] Compiling 11 source files to <http://apacheflexbuild.cloudapp.net:8080/job/flex-asjs/ws/mustella/java/bin>
basictests-run-js:
[echo] url=file://<http://apacheflexbuild.cloudapp.net:8080/job/flex-asjs/ws/mustella/tests/basicTests/bin/js-debug/index.html>
[echo] script=<http://apacheflexbuild.cloudapp.net:8080/job/flex-asjs/ws/mustella/tests/basicTests/halo/scripts/ButtonTestScript.mxml>
[echo] script=<http://apacheflexbuild.cloudapp.net:8080/job/flex-asjs/ws/mustella/tests/basicTests/halo/scripts/CheckBoxTestScript.mxml>
[java] file://<http://apacheflexbuild.cloudapp.net:8080/job/flex-asjs/ws/mustella/tests/basicTests/bin/js-debug/index.html>
[java] running script <http://apacheflexbuild.cloudapp.net:8080/job/flex-asjs/ws/mustella/tests/basicTests/halo/scripts/ButtonTestScript.mxml>
[java] test case count: 2
[java] RESULT: scriptName=<http://apacheflexbuild.cloudapp.net:8080/job/flex-asjs/ws/mustella/tests/basicTests/halo/scripts/ButtonTestScript.mxml> id=SetupButtonTest result=pass elapsed=432 phase=body started=1484712356214 extraInfo= msg=
[java] RESULT: scriptName=<http://apacheflexbuild.cloudapp.net:8080/job/flex-asjs/ws/mustella/tests/basicTests/halo/scripts/ButtonTestScript.mxml> id=ButtonTest1 result=pass elapsed=961 phase=body started=1484712356647 extraInfo= msg=
[java] running script <http://apacheflexbuild.cloudapp.net:8080/job/flex-asjs/ws/mustella/tests/basicTests/halo/scripts/CheckBoxTestScript.mxml>
[java] test case count: 2
[java] RESULT: scriptName=<http://apacheflexbuild.cloudapp.net:8080/job/flex-asjs/ws/mustella/tests/basicTests/halo/scripts/CheckBoxTestScript.mxml> id=SetupCheckBoxTest result=pass elapsed=427 phase=body started=1484712357609 extraInfo= msg=
[java] RESULT: scriptName=<http://apacheflexbuild.cloudapp.net:8080/job/flex-asjs/ws/mustella/tests/basicTests/halo/scripts/CheckBoxTestScript.mxml> id=CheckBoxTest1 result=pass elapsed=856 phase=body started=1484712358036 extraInfo= msg=
[java] Picked up JAVA_TOOL_OPTIONS: -Dfile.encoding=UTF8
basictests-js:
basictests-marmotinni:
checkintests:
doc:
other.locales:
check-goog-home:
binary-package:
check-flex-home:
stage-source-no-scripts:
clean-temp:
[delete] Deleting directory <http://apacheflexbuild.cloudapp.net:8080/job/flex-asjs/ws/temp>
[copy] Copying 18 files to <http://apacheflexbuild.cloudapp.net:8080/job/flex-asjs/ws/temp>
stage-framework-as:
[copy] Copying 1486 files to <http://apacheflexbuild.cloudapp.net:8080/job/flex-asjs/ws/temp/frameworks>
[echo] Updating config file air-config.xml with version 0.8.0.20170118
[echo] Updating config file flex-config.xml with version 0.8.0.20170118
[echo] Updating config file js-config.xml with version 0.8.0.20170118
[echo] Updating config file jquery-config.xml with version 0.8.0.20170118
[echo] Updating config file createjs-config.xml with version 0.8.0.20170118
[echo] Updating config file node-config.xml with version 0.8.0.20170118
[copy] Copying 1 file to <http://apacheflexbuild.cloudapp.net:8080/job/flex-asjs/ws/temp/asdoc>
[copy] Copying 3 files to <http://apacheflexbuild.cloudapp.net:8080/job/flex-asjs/ws/temp>
[copy] Copying 12 files to <http://apacheflexbuild.cloudapp.net:8080/job/flex-asjs/ws/temp/ide>
[copy] Copying 14 files to <http://apacheflexbuild.cloudapp.net:8080/job/flex-asjs/ws/temp/js/bin>
[copy] Copying 436 files to <http://apacheflexbuild.cloudapp.net:8080/job/flex-asjs/ws/temp/examples>
[copy] Copying 1 file to <http://apacheflexbuild.cloudapp.net:8080/job/flex-asjs/ws/temp/templates>
stage-source:
stage-scripts:
[copy] Copying 4 files to <http://apacheflexbuild.cloudapp.net:8080/job/flex-asjs/ws/temp/scripts>
stage-nightly:
[copy] Copying 1 file to <http://apacheflexbuild.cloudapp.net:8080/job/flex-asjs/ws/temp>
[copy] Copying 95 files to <http://apacheflexbuild.cloudapp.net:8080/job/flex-asjs/ws/temp/frameworks>
[copy] Copying 460 files to <http://apacheflexbuild.cloudapp.net:8080/job/flex-asjs/ws/temp/frameworks>
copy-gcl-from-goog-home:
[echo] Copying GCL from C:\google\closure\Library
[copy] Copying 28 files to <http://apacheflexbuild.cloudapp.net:8080/job/flex-asjs/ws/temp/js/lib/google/closure-library>
[copy] Copied 161 empty directories to 145 empty directories under <http://apacheflexbuild.cloudapp.net:8080/job/flex-asjs/ws/temp/js/lib/google/closure-library>
copy-gcl-from-downloaded:
inject-asf-header:
binary-package-zip:
[zip] Building zip: <http://apacheflexbuild.cloudapp.net:8080/job/flex-asjs/1879/artifact/out/apache-flex-flexjs-0.8.0-bin.zip>
binary-package-tgz:
[tar] Building tar: <http://apacheflexbuild.cloudapp.net:8080/job/flex-asjs/1879/artifact/out/apache-flex-flexjs-0.8.0-bin.tar.gz>
[copy] Copying 1 file to <http://apacheflexbuild.cloudapp.net:8080/job/flex-asjs/ws/out>
ja-locale-samples:
additional-packages:
binary-release:
rat-taskdef:
have-rattasks:
no-rattasks:
[echo] Rat report not generated.
[echo] rat jars (apache-rat-*.jar, apache-rat-tasks-*.jar)
[echo] not found in anttask.classpath
rat-check:
release:
create-md5:
[echo] Generating MD5 hashes for release artifacts
BUILD SUCCESSFUL
Total time: 33 minutes 24 seconds
Picked up JAVA_TOOL_OPTIONS: -Dfile.encoding=UTF8
[flex-asjs] $ cmd.exe /C "c:\Jenkins\tools\hudson.tasks.Ant_AntInstallation\c_apache-ant-1.9.3\bin\ant.bat -file build.xml -Dnightly=true -Djshint=C:\Users\apacheflexbuild\AppData\Roaming\npm\jshint_jenkins.cmd '"-Dbrowser=C:\Program Files (x86)\Mozilla Firefox\firefox.exe"' -Dgjslint=C:\Python27\Scripts\gjslint.exe -Dbuild.noprompt=true -Ddoc_output=<http://apacheflexbuild.cloudapp.net:8080/job/flex-asjs/1879/artifact/out/asdoc> -Dplayerglobal.version=11.7 asdoc-package doc-create-md5 && exit %%ERRORLEVEL%%"
Buildfile: <http://apacheflexbuild.cloudapp.net:8080/job/flex-asjs/ws/build.xml>
asdoc-package:
clean-temp:
[delete] Deleting directory <http://apacheflexbuild.cloudapp.net:8080/job/flex-asjs/ws/temp>
asdoc:
[echo] FLEX_HOME = <http://apacheflexbuild.cloudapp.net:8080/job/flex-asjs/ws/asdoc/../../flex-sdk>
[echo] flexlib = <http://apacheflexbuild.cloudapp.net:8080/job/flex-asjs/ws/frameworks>
[echo] doc_output = <http://apacheflexbuild.cloudapp.net:8080/job/flex-asjs/1879/artifact/out/asdoc>
[echo] compiler.source-path = <http://apacheflexbuild.cloudapp.net:8080/job/flex-asjs/ws/frameworks/projects/*/src/main/flex>
clean:
doc:
[asdoc] Loading configuration file C:\Jenkins\workspace\flex-asjs\frameworks\asdoc-config.xml
[asdoc] C:\Jenkins\workspace\flex-asjs\frameworks\projects\Core\src\main\flex\org\apache\flex\events\utils\EventUtils.as: Error: A file found in a source-path must have an externally visible definition. If a definition in the file is meant to be externally visible, please put the definition in a package.
[asdoc]
[asdoc] Picked up JAVA_TOOL_OPTIONS: -Dfile.encoding=UTF8
BUILD FAILED
<http://apacheflexbuild.cloudapp.net:8080/job/flex-asjs/ws/build.xml>:1119: The following error occurred while executing this line:
<http://apacheflexbuild.cloudapp.net:8080/job/flex-asjs/ws/build.xml>:540: The following error occurred while executing this line:
<http://apacheflexbuild.cloudapp.net:8080/job/flex-asjs/ws/asdoc/build.xml>:73: asdoc task failed.
Total time: 37 seconds
Picked up JAVA_TOOL_OPTIONS: -Dfile.encoding=UTF8
Build step 'Invoke Ant' marked build as failure
Skipped archiving because build is not successful
Jenkins build is back to normal : flex-asjs #1881
Posted by fl...@gmail.com.
See <http://apacheflexbuild.cloudapp.net:8080/job/flex-asjs/1881/changes>
Build failed in Jenkins: flex-asjs #1880
Posted by fl...@gmail.com.
See <http://apacheflexbuild.cloudapp.net:8080/job/flex-asjs/1880/>
------------------------------------------
[...truncated 3999 lines...]
[java] Dependencies calculated for '<http://apacheflexbuild.cloudapp.net:8080/job/flex-asjs/ws/mustella/tests/basicTests/bin/js-debug/org/apache/flex/events/ElementEvents.js'>
[java] Dependencies calculated for '<http://apacheflexbuild.cloudapp.net:8080/job/flex-asjs/ws/mustella/tests/basicTests/bin/js-debug/org/apache/flex/events/Event.js'>
[java] Dependencies calculated for '<http://apacheflexbuild.cloudapp.net:8080/job/flex-asjs/ws/mustella/tests/basicTests/bin/js-debug/org/apache/flex/core/IFlexJSElement.js'>
[java] Dependencies calculated for '<http://apacheflexbuild.cloudapp.net:8080/job/flex-asjs/ws/mustella/tests/basicTests/bin/js-debug/org/apache/flex/events/IFlexJSEvent.js'>
[java] Dependencies calculated for '<http://apacheflexbuild.cloudapp.net:8080/job/flex-asjs/ws/mustella/tests/basicTests/bin/js-debug/org/apache/flex/events/EventDispatcher.js'>
[java] Dependencies calculated for '<http://apacheflexbuild.cloudapp.net:8080/job/flex-asjs/ws/mustella/tests/basicTests/bin/js-debug/org/apache/flex/events/IEventDispatcher.js'>
[java] Dependencies calculated for '<http://apacheflexbuild.cloudapp.net:8080/job/flex-asjs/ws/mustella/tests/basicTests/bin/js-debug/org/apache/flex/events/utils/EventUtils.js'>
[java] Dependencies calculated for '<http://apacheflexbuild.cloudapp.net:8080/job/flex-asjs/ws/mustella/tests/basicTests/bin/js-debug/org/apache/flex/core/IStrand.js'>
[java] Dependencies calculated for '<http://apacheflexbuild.cloudapp.net:8080/job/flex-asjs/ws/mustella/tests/basicTests/bin/js-debug/org/apache/flex/core/ValuesManager.js'>
[java] Dependencies calculated for '<http://apacheflexbuild.cloudapp.net:8080/job/flex-asjs/ws/mustella/tests/basicTests/bin/js-debug/org/apache/flex/core/IBead.js'>
[java] Dependencies calculated for '<http://apacheflexbuild.cloudapp.net:8080/job/flex-asjs/ws/mustella/tests/basicTests/bin/js-debug/org/apache/flex/core/IBeadModel.js'>
[java] Dependencies calculated for '<http://apacheflexbuild.cloudapp.net:8080/job/flex-asjs/ws/mustella/tests/basicTests/bin/js-debug/org/apache/flex/core/IStrandWithModel.js'>
[java] Dependencies calculated for '<http://apacheflexbuild.cloudapp.net:8080/job/flex-asjs/ws/mustella/tests/basicTests/bin/js-debug/org/apache/flex/utils/StringUtil.js'>
[java] Dependencies calculated for '<http://apacheflexbuild.cloudapp.net:8080/job/flex-asjs/ws/mustella/tests/basicTests/bin/js-debug/org/apache/flex/utils/StringTrimmer.js'>
[java] Dependencies calculated for '<http://apacheflexbuild.cloudapp.net:8080/job/flex-asjs/ws/mustella/tests/basicTests/bin/js-debug/org/apache/flex/core/IBeadController.js'>
[java] Dependencies calculated for '<http://apacheflexbuild.cloudapp.net:8080/job/flex-asjs/ws/mustella/tests/basicTests/bin/js-debug/org/apache/flex/core/IBeadView.js'>
[java] Dependencies calculated for '<http://apacheflexbuild.cloudapp.net:8080/job/flex-asjs/ws/mustella/tests/basicTests/bin/js-debug/org/apache/flex/core/ILayoutChild.js'>
[java] Dependencies calculated for '<http://apacheflexbuild.cloudapp.net:8080/job/flex-asjs/ws/mustella/tests/basicTests/bin/js-debug/org/apache/flex/core/IChild.js'>
[java] Dependencies calculated for '<http://apacheflexbuild.cloudapp.net:8080/job/flex-asjs/ws/mustella/tests/basicTests/bin/js-debug/org/apache/flex/core/IRenderedObject.js'>
[java] Dependencies calculated for '<http://apacheflexbuild.cloudapp.net:8080/job/flex-asjs/ws/mustella/tests/basicTests/bin/js-debug/org/apache/flex/core/IUIBase.js'>
[java] Dependencies calculated for '<http://apacheflexbuild.cloudapp.net:8080/job/flex-asjs/ws/mustella/tests/basicTests/bin/js-debug/org/apache/flex/core/IMeasurementBead.js'>
[java] Dependencies calculated for '<http://apacheflexbuild.cloudapp.net:8080/job/flex-asjs/ws/mustella/tests/basicTests/bin/js-debug/org/apache/flex/core/IParentIUIBase.js'>
[java] Dependencies calculated for '<http://apacheflexbuild.cloudapp.net:8080/job/flex-asjs/ws/mustella/tests/basicTests/bin/js-debug/org/apache/flex/core/IParent.js'>
[java] Dependencies calculated for '<http://apacheflexbuild.cloudapp.net:8080/job/flex-asjs/ws/mustella/tests/basicTests/bin/js-debug/org/apache/flex/core/IStyleableObject.js'>
[java] Dependencies calculated for '<http://apacheflexbuild.cloudapp.net:8080/job/flex-asjs/ws/mustella/tests/basicTests/bin/js-debug/org/apache/flex/core/ITransformHost.js'>
[java] Dependencies calculated for '<http://apacheflexbuild.cloudapp.net:8080/job/flex-asjs/ws/mustella/tests/basicTests/bin/js-debug/org/apache/flex/core/IContentView.js'>
[java] Dependencies calculated for '<http://apacheflexbuild.cloudapp.net:8080/job/flex-asjs/ws/mustella/tests/basicTests/bin/js-debug/org/apache/flex/html/beads/layouts/BasicLayout.js'>
[java] Dependencies calculated for '<http://apacheflexbuild.cloudapp.net:8080/job/flex-asjs/ws/mustella/tests/basicTests/bin/js-debug/org/apache/flex/core/IBeadLayout.js'>
[java] Dependencies calculated for '<http://apacheflexbuild.cloudapp.net:8080/job/flex-asjs/ws/mustella/tests/basicTests/bin/js-debug/org/apache/flex/core/ILayoutParent.js'>
[java] Dependencies calculated for '<http://apacheflexbuild.cloudapp.net:8080/job/flex-asjs/ws/mustella/tests/basicTests/bin/js-debug/org/apache/flex/html/supportClasses/Viewport.js'>
[java] Dependencies calculated for '<http://apacheflexbuild.cloudapp.net:8080/job/flex-asjs/ws/mustella/tests/basicTests/bin/js-debug/org/apache/flex/geom/Size.js'>
[java] Dependencies calculated for '<http://apacheflexbuild.cloudapp.net:8080/job/flex-asjs/ws/mustella/tests/basicTests/bin/js-debug/org/apache/flex/utils/CSSContainerUtils.js'>
[java] Dependencies calculated for '<http://apacheflexbuild.cloudapp.net:8080/job/flex-asjs/ws/mustella/tests/basicTests/bin/js-debug/org/apache/flex/geom/Rectangle.js'>
[java] Dependencies calculated for '<http://apacheflexbuild.cloudapp.net:8080/job/flex-asjs/ws/mustella/tests/basicTests/bin/js-debug/org/apache/flex/geom/Point.js'>
[java] Dependencies calculated for '<http://apacheflexbuild.cloudapp.net:8080/job/flex-asjs/ws/mustella/tests/basicTests/bin/js-debug/org/apache/flex/utils/CSSUtils.js'>
[java] Dependencies calculated for '<http://apacheflexbuild.cloudapp.net:8080/job/flex-asjs/ws/mustella/tests/basicTests/bin/js-debug/org/apache/flex/utils/StringPadder.js'>
[java] Dependencies calculated for '<http://apacheflexbuild.cloudapp.net:8080/job/flex-asjs/ws/mustella/tests/basicTests/bin/js-debug/org/apache/flex/core/IViewport.js'>
[java] Dependencies calculated for '<http://apacheflexbuild.cloudapp.net:8080/job/flex-asjs/ws/mustella/tests/basicTests/bin/js-debug/org/apache/flex/html/beads/ContainerView.js'>
[java] Dependencies calculated for '<http://apacheflexbuild.cloudapp.net:8080/job/flex-asjs/ws/mustella/tests/basicTests/bin/js-debug/org/apache/flex/core/BeadViewBase.js'>
[java] Dependencies calculated for '<http://apacheflexbuild.cloudapp.net:8080/job/flex-asjs/ws/mustella/tests/basicTests/bin/js-debug/org/apache/flex/core/IContainerView.js'>
[java] Dependencies calculated for '<http://apacheflexbuild.cloudapp.net:8080/job/flex-asjs/ws/mustella/tests/basicTests/bin/js-debug/org/apache/flex/core/IContentViewHost.js'>
[java] Dependencies calculated for '<http://apacheflexbuild.cloudapp.net:8080/job/flex-asjs/ws/mustella/tests/basicTests/bin/js-debug/org/apache/flex/core/ILayoutHost.js'>
[java] Dependencies calculated for '<http://apacheflexbuild.cloudapp.net:8080/job/flex-asjs/ws/mustella/tests/basicTests/bin/js-debug/org/apache/flex/core/IViewportModel.js'>
[java] Dependencies calculated for '<http://apacheflexbuild.cloudapp.net:8080/job/flex-asjs/ws/mustella/tests/basicTests/bin/js-debug/org/apache/flex/html/beads/IBackgroundBead.js'>
[java] Dependencies calculated for '<http://apacheflexbuild.cloudapp.net:8080/job/flex-asjs/ws/mustella/tests/basicTests/bin/js-debug/org/apache/flex/html/beads/IBorderBead.js'>
[java] Dependencies calculated for '<http://apacheflexbuild.cloudapp.net:8080/job/flex-asjs/ws/mustella/tests/basicTests/bin/js-debug/org/apache/flex/html/beads/models/ViewportModel.js'>
[java] Dependencies calculated for '<http://apacheflexbuild.cloudapp.net:8080/job/flex-asjs/ws/mustella/tests/basicTests/bin/js-debug/org/apache/flex/utils/EffectTimer.js'>
[java] Dependencies calculated for '<http://apacheflexbuild.cloudapp.net:8080/job/flex-asjs/ws/mustella/tests/basicTests/bin/js-debug/org/apache/flex/events/ValueEvent.js'>
[java] Dependencies calculated for '<http://apacheflexbuild.cloudapp.net:8080/job/flex-asjs/ws/mustella/tests/basicTests/bin/js-debug/org/apache/flex/core/IEffectTimer.js'>
[java] Dependencies calculated for '<http://apacheflexbuild.cloudapp.net:8080/job/flex-asjs/ws/mustella/tests/basicTests/bin/js-debug/org/apache/flex/core/SimpleStatesImpl.js'>
[java] Dependencies calculated for '<http://apacheflexbuild.cloudapp.net:8080/job/flex-asjs/ws/mustella/tests/basicTests/bin/js-debug/org/apache/flex/events/ValueChangeEvent.js'>
[java] Dependencies calculated for '<http://apacheflexbuild.cloudapp.net:8080/job/flex-asjs/ws/mustella/tests/basicTests/bin/js-debug/org/apache/flex/states/AddItems.js'>
[java] Dependencies calculated for '<http://apacheflexbuild.cloudapp.net:8080/job/flex-asjs/ws/mustella/tests/basicTests/bin/js-debug/org/apache/flex/states/ItemAndDescriptor.js'>
[java] Dependencies calculated for '<http://apacheflexbuild.cloudapp.net:8080/job/flex-asjs/ws/mustella/tests/basicTests/bin/js-debug/org/apache/flex/core/IDocument.js'>
[java] Dependencies calculated for '<http://apacheflexbuild.cloudapp.net:8080/job/flex-asjs/ws/mustella/tests/basicTests/bin/js-debug/org/apache/flex/states/SetEventHandler.js'>
[java] Dependencies calculated for '<http://apacheflexbuild.cloudapp.net:8080/job/flex-asjs/ws/mustella/tests/basicTests/bin/js-debug/org/apache/flex/states/SetProperty.js'>
[java] Dependencies calculated for '<http://apacheflexbuild.cloudapp.net:8080/job/flex-asjs/ws/mustella/tests/basicTests/bin/js-debug/org/apache/flex/utils/MXMLDataInterpreter.js'>
[java] Dependencies calculated for '<http://apacheflexbuild.cloudapp.net:8080/job/flex-asjs/ws/mustella/tests/basicTests/bin/js-debug/org/apache/flex/core/IContainer.js'>
[java] Dependencies calculated for '<http://apacheflexbuild.cloudapp.net:8080/job/flex-asjs/ws/mustella/tests/basicTests/bin/js-debug/org/apache/flex/core/IMXMLDocument.js'>
[java] Dependencies calculated for '<http://apacheflexbuild.cloudapp.net:8080/job/flex-asjs/ws/mustella/tests/basicTests/bin/js-debug/org/apache/flex/core/IStatesImpl.js'>
[java] Dependencies calculated for '<http://apacheflexbuild.cloudapp.net:8080/job/flex-asjs/ws/mustella/tests/basicTests/bin/js-debug/org/apache/flex/core/IStatesObject.js'>
[java] Dependencies calculated for '<http://apacheflexbuild.cloudapp.net:8080/job/flex-asjs/ws/mustella/tests/basicTests/bin/js-debug/org/apache/flex/html/beads/layouts/VerticalLayout.js'>
[java] Dependencies calculated for '<http://apacheflexbuild.cloudapp.net:8080/job/flex-asjs/ws/mustella/tests/basicTests/bin/js-debug/org/apache/flex/core/Application.js'>
[java] Dependencies calculated for '<http://apacheflexbuild.cloudapp.net:8080/job/flex-asjs/ws/mustella/tests/basicTests/bin/js-debug/org/apache/flex/core/ApplicationBase.js'>
[java] Dependencies calculated for '<http://apacheflexbuild.cloudapp.net:8080/job/flex-asjs/ws/mustella/tests/basicTests/bin/js-debug/org/apache/flex/core/IFlexInfo.js'>
[java] Dependencies calculated for '<http://apacheflexbuild.cloudapp.net:8080/job/flex-asjs/ws/mustella/tests/basicTests/bin/js-debug/org/apache/flex/utils/Timer.js'>
[java] Dependencies calculated for '<http://apacheflexbuild.cloudapp.net:8080/job/flex-asjs/ws/mustella/tests/basicTests/bin/js-debug/org/apache/flex/core/IInitialViewApplication.js'>
[java] Dependencies calculated for '<http://apacheflexbuild.cloudapp.net:8080/job/flex-asjs/ws/mustella/tests/basicTests/bin/js-debug/org/apache/flex/core/IPopUpHost.js'>
[java] Dependencies calculated for '<http://apacheflexbuild.cloudapp.net:8080/job/flex-asjs/ws/mustella/tests/basicTests/bin/js-debug/org/apache/flex/core/ISWFApplication.js'>
[java] Dependencies calculated for '<http://apacheflexbuild.cloudapp.net:8080/job/flex-asjs/ws/mustella/tests/basicTests/bin/js-debug/org/apache/flex/core/SimpleCSSValuesImpl.js'>
[java] Dependencies calculated for '<http://apacheflexbuild.cloudapp.net:8080/job/flex-asjs/ws/mustella/tests/basicTests/bin/js-debug/org/apache/flex/core/ICSSImpl.js'>
[java] Dependencies calculated for '<http://apacheflexbuild.cloudapp.net:8080/job/flex-asjs/ws/mustella/tests/basicTests/bin/js-debug/org/apache/flex/core/IValuesImpl.js'>
[java] Dependencies calculated for '<http://apacheflexbuild.cloudapp.net:8080/job/flex-asjs/ws/mustella/tests/basicTests/bin/js-debug/BasicTests.js'>
[java] Dependencies calculated for '<http://apacheflexbuild.cloudapp.net:8080/job/flex-asjs/ws/mustella/tests/basicTests/bin/js-debug/org/apache/flex/core/View.js'>
[java] Dependencies calculated for '<http://apacheflexbuild.cloudapp.net:8080/job/flex-asjs/ws/mustella/tests/basicTests/bin/js-debug/org/apache/flex/core/ViewBase.js'>
[java] Dependencies calculated for '<http://apacheflexbuild.cloudapp.net:8080/job/flex-asjs/ws/mustella/tests/basicTests/bin/js-debug/org/apache/flex/core/ContainerBase.js'>
[java] Dependencies calculated for '<http://apacheflexbuild.cloudapp.net:8080/job/flex-asjs/ws/mustella/tests/basicTests/bin/js-debug/org/apache/flex/core/ContainerBaseStrandChildren.js'>
[java] Dependencies calculated for '<http://apacheflexbuild.cloudapp.net:8080/job/flex-asjs/ws/mustella/tests/basicTests/bin/js-debug/org/apache/flex/core/IApplicationView.js'>
[java] Dependencies calculated for '<http://apacheflexbuild.cloudapp.net:8080/job/flex-asjs/ws/mustella/tests/basicTests/bin/js-debug/org/apache/flex/states/State.js'>
[java] Dependencies calculated for '<http://apacheflexbuild.cloudapp.net:8080/job/flex-asjs/ws/mustella/tests/basicTests/bin/js-debug/halo/views/ButtonTests.js'>
[java] Dependencies calculated for '<http://apacheflexbuild.cloudapp.net:8080/job/flex-asjs/ws/mustella/tests/basicTests/bin/js-debug/shim/VBox.js'>
[java] Dependencies calculated for '<http://apacheflexbuild.cloudapp.net:8080/job/flex-asjs/ws/mustella/tests/basicTests/bin/js-debug/org/apache/flex/html/Container.js'>
[java] Dependencies calculated for '<http://apacheflexbuild.cloudapp.net:8080/job/flex-asjs/ws/mustella/tests/basicTests/bin/js-debug/org/apache/flex/html/TextButton.js'>
[java] Dependencies calculated for '<http://apacheflexbuild.cloudapp.net:8080/job/flex-asjs/ws/mustella/tests/basicTests/bin/js-debug/org/apache/flex/html/Button.js'>
[java] Dependencies calculated for '<http://apacheflexbuild.cloudapp.net:8080/job/flex-asjs/ws/mustella/tests/basicTests/bin/js-debug/org/apache/flex/html/ButtonBase.js'>
[java] Dependencies calculated for '<http://apacheflexbuild.cloudapp.net:8080/job/flex-asjs/ws/mustella/tests/basicTests/bin/js-debug/org/apache/flex/html/Label.js'>
[java] Dependencies calculated for '<http://apacheflexbuild.cloudapp.net:8080/job/flex-asjs/ws/mustella/tests/basicTests/bin/js-debug/org/apache/flex/events/MouseEvent.js'>
[java] Dependencies calculated for '<http://apacheflexbuild.cloudapp.net:8080/job/flex-asjs/ws/mustella/tests/basicTests/bin/js-debug/org/apache/flex/utils/PointUtils.js'>
[java] Dependencies calculated for '<http://apacheflexbuild.cloudapp.net:8080/job/flex-asjs/ws/mustella/tests/basicTests/bin/js-debug/halo/views/CheckBoxTests.js'>
[java] Dependencies calculated for '<http://apacheflexbuild.cloudapp.net:8080/job/flex-asjs/ws/mustella/tests/basicTests/bin/js-debug/org/apache/flex/html/CheckBox.js'>
[java] Dependencies calculated for '<http://apacheflexbuild.cloudapp.net:8080/job/flex-asjs/ws/mustella/tests/basicTests/bin/js-debug/org/apache/flex/html/supportClasses/CheckBoxIcon.js'>
[java] Dependencies calculated for '<http://apacheflexbuild.cloudapp.net:8080/job/flex-asjs/ws/mustella/tests/basicTests/bin/js-debug/org/apache/flex/utils/MixinManager.js'>
[java] Dependencies calculated for '<http://apacheflexbuild.cloudapp.net:8080/job/flex-asjs/ws/mustella/tests/basicTests/bin/js-debug/org/apache/flex/core/CSSFontFaceBead.js'>
[java] Dependencies calculated for '<http://apacheflexbuild.cloudapp.net:8080/job/flex-asjs/ws/mustella/tests/basicTests/bin/js-debug/halo/scripts/CheckBoxTestScript.js'>
[java] Dependencies calculated for '<http://apacheflexbuild.cloudapp.net:8080/job/flex-asjs/ws/mustella/tests/basicTests/bin/js-debug/UnitTester.js'>
[java] Dependencies calculated for '<http://apacheflexbuild.cloudapp.net:8080/job/flex-asjs/ws/mustella/tests/basicTests/bin/js-debug/TestCase.js'>
[java] Dependencies calculated for '<http://apacheflexbuild.cloudapp.net:8080/job/flex-asjs/ws/mustella/tests/basicTests/bin/js-debug/SetProperty.js'>
[java] Dependencies calculated for '<http://apacheflexbuild.cloudapp.net:8080/job/flex-asjs/ws/mustella/tests/basicTests/bin/js-debug/AssertPropertyValue.js'>
[java] Dependencies calculated for '<http://apacheflexbuild.cloudapp.net:8080/job/flex-asjs/ws/mustella/tests/basicTests/bin/js-debug/DispatchMouseEvent.js'>
[java] Dependencies calculated for '<http://apacheflexbuild.cloudapp.net:8080/job/flex-asjs/ws/mustella/tests/basicTests/bin/js-debug/DispatchMouseClickEvent.js'>
[java] Dependencies calculated for '<http://apacheflexbuild.cloudapp.net:8080/job/flex-asjs/ws/mustella/tests/basicTests/bin/js-debug/halo/scripts/ButtonTestScript.js'>
[java] Dependencies calculated for '<http://apacheflexbuild.cloudapp.net:8080/job/flex-asjs/ws/mustella/tests/basicTests/bin/js-debug/SetShowRTE.js'>
[java] Dependencies calculated for '<http://apacheflexbuild.cloudapp.net:8080/job/flex-asjs/ws/mustella/tests/basicTests/bin/js-debug/SendFormattedResultsToLog.js'>
[java] Dependencies calculated for '<http://apacheflexbuild.cloudapp.net:8080/job/flex-asjs/ws/mustella/tests/basicTests/bin/js-debug/FlexJSContext.js'>
[java] Dependencies calculated for '<http://apacheflexbuild.cloudapp.net:8080/job/flex-asjs/ws/mustella/tests/basicTests/bin/js-debug/ExitWhenDone.js'>
[java] The project 'BasicTestsApp' has been successfully compiled and optimized.
[java] 25.5081075 seconds
[java] Picked up JAVA_TOOL_OPTIONS: -Dfile.encoding=UTF8
basictests-compile-java:
[delete] Deleting directory <http://apacheflexbuild.cloudapp.net:8080/job/flex-asjs/ws/mustella/java/bin>
[mkdir] Created dir: <http://apacheflexbuild.cloudapp.net:8080/job/flex-asjs/ws/mustella/java/bin>
[javac] <http://apacheflexbuild.cloudapp.net:8080/job/flex-asjs/ws/build.xml>:1280: warning: 'includeantruntime' was not set, defaulting to build.sysclasspath=last; set to false for repeatable builds
[javac] Compiling 11 source files to <http://apacheflexbuild.cloudapp.net:8080/job/flex-asjs/ws/mustella/java/bin>
basictests-run-js:
[echo] url=file://<http://apacheflexbuild.cloudapp.net:8080/job/flex-asjs/ws/mustella/tests/basicTests/bin/js-debug/index.html>
[echo] script=<http://apacheflexbuild.cloudapp.net:8080/job/flex-asjs/ws/mustella/tests/basicTests/halo/scripts/ButtonTestScript.mxml>
[echo] script=<http://apacheflexbuild.cloudapp.net:8080/job/flex-asjs/ws/mustella/tests/basicTests/halo/scripts/CheckBoxTestScript.mxml>
[java] file://<http://apacheflexbuild.cloudapp.net:8080/job/flex-asjs/ws/mustella/tests/basicTests/bin/js-debug/index.html>
[java] running script <http://apacheflexbuild.cloudapp.net:8080/job/flex-asjs/ws/mustella/tests/basicTests/halo/scripts/ButtonTestScript.mxml>
[java] test case count: 2
[java] RESULT: scriptName=<http://apacheflexbuild.cloudapp.net:8080/job/flex-asjs/ws/mustella/tests/basicTests/halo/scripts/ButtonTestScript.mxml> id=SetupButtonTest result=pass elapsed=464 phase=body started=1484720003015 extraInfo= msg=
[java] RESULT: scriptName=<http://apacheflexbuild.cloudapp.net:8080/job/flex-asjs/ws/mustella/tests/basicTests/halo/scripts/ButtonTestScript.mxml> id=ButtonTest1 result=pass elapsed=975 phase=body started=1484720003480 extraInfo= msg=
[java] running script <http://apacheflexbuild.cloudapp.net:8080/job/flex-asjs/ws/mustella/tests/basicTests/halo/scripts/CheckBoxTestScript.mxml>
[java] test case count: 2
[java] RESULT: scriptName=<http://apacheflexbuild.cloudapp.net:8080/job/flex-asjs/ws/mustella/tests/basicTests/halo/scripts/CheckBoxTestScript.mxml> id=SetupCheckBoxTest result=pass elapsed=317 phase=body started=1484720004465 extraInfo= msg=
[java] RESULT: scriptName=<http://apacheflexbuild.cloudapp.net:8080/job/flex-asjs/ws/mustella/tests/basicTests/halo/scripts/CheckBoxTestScript.mxml> id=CheckBoxTest1 result=pass elapsed=635 phase=body started=1484720004782 extraInfo= msg=
[java] Picked up JAVA_TOOL_OPTIONS: -Dfile.encoding=UTF8
basictests-js:
basictests-marmotinni:
checkintests:
doc:
other.locales:
check-goog-home:
binary-package:
check-flex-home:
stage-source-no-scripts:
clean-temp:
[delete] Deleting directory <http://apacheflexbuild.cloudapp.net:8080/job/flex-asjs/ws/temp>
[copy] Copying 18 files to <http://apacheflexbuild.cloudapp.net:8080/job/flex-asjs/ws/temp>
stage-framework-as:
[copy] Copying 1486 files to <http://apacheflexbuild.cloudapp.net:8080/job/flex-asjs/ws/temp/frameworks>
[echo] Updating config file air-config.xml with version 0.8.0.20170118
[echo] Updating config file flex-config.xml with version 0.8.0.20170118
[echo] Updating config file js-config.xml with version 0.8.0.20170118
[echo] Updating config file jquery-config.xml with version 0.8.0.20170118
[echo] Updating config file createjs-config.xml with version 0.8.0.20170118
[echo] Updating config file node-config.xml with version 0.8.0.20170118
[copy] Copying 1 file to <http://apacheflexbuild.cloudapp.net:8080/job/flex-asjs/ws/temp/asdoc>
[copy] Copying 3 files to <http://apacheflexbuild.cloudapp.net:8080/job/flex-asjs/ws/temp>
[copy] Copying 12 files to <http://apacheflexbuild.cloudapp.net:8080/job/flex-asjs/ws/temp/ide>
[copy] Copying 14 files to <http://apacheflexbuild.cloudapp.net:8080/job/flex-asjs/ws/temp/js/bin>
[copy] Copying 436 files to <http://apacheflexbuild.cloudapp.net:8080/job/flex-asjs/ws/temp/examples>
[copy] Copying 1 file to <http://apacheflexbuild.cloudapp.net:8080/job/flex-asjs/ws/temp/templates>
stage-source:
stage-scripts:
[copy] Copying 4 files to <http://apacheflexbuild.cloudapp.net:8080/job/flex-asjs/ws/temp/scripts>
stage-nightly:
[copy] Copying 1 file to <http://apacheflexbuild.cloudapp.net:8080/job/flex-asjs/ws/temp>
[copy] Copying 95 files to <http://apacheflexbuild.cloudapp.net:8080/job/flex-asjs/ws/temp/frameworks>
[copy] Copying 460 files to <http://apacheflexbuild.cloudapp.net:8080/job/flex-asjs/ws/temp/frameworks>
copy-gcl-from-goog-home:
[echo] Copying GCL from C:\google\closure\Library
[copy] Copying 28 files to <http://apacheflexbuild.cloudapp.net:8080/job/flex-asjs/ws/temp/js/lib/google/closure-library>
[copy] Copied 161 empty directories to 145 empty directories under <http://apacheflexbuild.cloudapp.net:8080/job/flex-asjs/ws/temp/js/lib/google/closure-library>
copy-gcl-from-downloaded:
inject-asf-header:
binary-package-zip:
[zip] Building zip: <http://apacheflexbuild.cloudapp.net:8080/job/flex-asjs/1880/artifact/out/apache-flex-flexjs-0.8.0-bin.zip>
binary-package-tgz:
[tar] Building tar: <http://apacheflexbuild.cloudapp.net:8080/job/flex-asjs/1880/artifact/out/apache-flex-flexjs-0.8.0-bin.tar.gz>
[copy] Copying 1 file to <http://apacheflexbuild.cloudapp.net:8080/job/flex-asjs/ws/out>
ja-locale-samples:
additional-packages:
binary-release:
rat-taskdef:
have-rattasks:
no-rattasks:
[echo] Rat report not generated.
[echo] rat jars (apache-rat-*.jar, apache-rat-tasks-*.jar)
[echo] not found in anttask.classpath
rat-check:
release:
create-md5:
[echo] Generating MD5 hashes for release artifacts
BUILD SUCCESSFUL
Total time: 34 minutes 30 seconds
Picked up JAVA_TOOL_OPTIONS: -Dfile.encoding=UTF8
[flex-asjs] $ cmd.exe /C "c:\Jenkins\tools\hudson.tasks.Ant_AntInstallation\c_apache-ant-1.9.3\bin\ant.bat -file build.xml -Dnightly=true -Djshint=C:\Users\apacheflexbuild\AppData\Roaming\npm\jshint_jenkins.cmd '"-Dbrowser=C:\Program Files (x86)\Mozilla Firefox\firefox.exe"' -Dgjslint=C:\Python27\Scripts\gjslint.exe -Dbuild.noprompt=true -Ddoc_output=<http://apacheflexbuild.cloudapp.net:8080/job/flex-asjs/1880/artifact/out/asdoc> -Dplayerglobal.version=11.7 asdoc-package doc-create-md5 && exit %%ERRORLEVEL%%"
Buildfile: <http://apacheflexbuild.cloudapp.net:8080/job/flex-asjs/ws/build.xml>
asdoc-package:
clean-temp:
[delete] Deleting directory <http://apacheflexbuild.cloudapp.net:8080/job/flex-asjs/ws/temp>
asdoc:
[echo] FLEX_HOME = <http://apacheflexbuild.cloudapp.net:8080/job/flex-asjs/ws/asdoc/../../flex-sdk>
[echo] flexlib = <http://apacheflexbuild.cloudapp.net:8080/job/flex-asjs/ws/frameworks>
[echo] doc_output = <http://apacheflexbuild.cloudapp.net:8080/job/flex-asjs/1880/artifact/out/asdoc>
[echo] compiler.source-path = <http://apacheflexbuild.cloudapp.net:8080/job/flex-asjs/ws/frameworks/projects/*/src/main/flex>
clean:
doc:
[asdoc] Loading configuration file C:\Jenkins\workspace\flex-asjs\frameworks\asdoc-config.xml
[asdoc] C:\Jenkins\workspace\flex-asjs\frameworks\projects\Core\src\main\flex\org\apache\flex\events\utils\EventUtils.as: Error: A file found in a source-path must have an externally visible definition. If a definition in the file is meant to be externally visible, please put the definition in a package.
[asdoc]
[asdoc] Picked up JAVA_TOOL_OPTIONS: -Dfile.encoding=UTF8
BUILD FAILED
<http://apacheflexbuild.cloudapp.net:8080/job/flex-asjs/ws/build.xml>:1119: The following error occurred while executing this line:
<http://apacheflexbuild.cloudapp.net:8080/job/flex-asjs/ws/build.xml>:540: The following error occurred while executing this line:
<http://apacheflexbuild.cloudapp.net:8080/job/flex-asjs/ws/asdoc/build.xml>:73: asdoc task failed.
Total time: 35 seconds
Picked up JAVA_TOOL_OPTIONS: -Dfile.encoding=UTF8
Build step 'Invoke Ant' marked build as failure
Skipped archiving because build is not successful
Re: Build failed in Jenkins: flex-asjs #1879
Posted by Alex Harui <ah...@adobe.com>.
On 1/17/17, 9:57 PM, "Piotr Zarzycki" <pi...@gmail.com> wrote:
>Hi Guys,
>
>I'm sorry about that. I don't know what exactly I should do with this
>file.
>Can someone help me with this?
I think I fixed it.
-Alex
Re: Build failed in Jenkins: flex-asjs #1879
Posted by Piotr Zarzycki <pi...@gmail.com>.
Hi Guys,
I'm sorry about that. I don't know what exactly I should do with this file.
Can someone help me with this?
Thanks,
Piotr
On Wed, Jan 18, 2017, 05:08 <fl...@gmail.com> wrote:
> See <http://apacheflexbuild.cloudapp.net:8080/job/flex-asjs/1879/>
>
> ------------------------------------------
> [...truncated 3997 lines...]
> [java] Dependencies calculated for '<
> http://apacheflexbuild.cloudapp.net:8080/job/flex-asjs/ws/mustella/tests/basicTests/bin/js-debug/org/apache/flex/events/ElementEvents.js
> '>
> [java] Dependencies calculated for '<
> http://apacheflexbuild.cloudapp.net:8080/job/flex-asjs/ws/mustella/tests/basicTests/bin/js-debug/org/apache/flex/events/Event.js
> '>
> [java] Dependencies calculated for '<
> http://apacheflexbuild.cloudapp.net:8080/job/flex-asjs/ws/mustella/tests/basicTests/bin/js-debug/org/apache/flex/core/IFlexJSElement.js
> '>
> [java] Dependencies calculated for '<
> http://apacheflexbuild.cloudapp.net:8080/job/flex-asjs/ws/mustella/tests/basicTests/bin/js-debug/org/apache/flex/events/IFlexJSEvent.js
> '>
> [java] Dependencies calculated for '<
> http://apacheflexbuild.cloudapp.net:8080/job/flex-asjs/ws/mustella/tests/basicTests/bin/js-debug/org/apache/flex/events/EventDispatcher.js
> '>
> [java] Dependencies calculated for '<
> http://apacheflexbuild.cloudapp.net:8080/job/flex-asjs/ws/mustella/tests/basicTests/bin/js-debug/org/apache/flex/events/IEventDispatcher.js
> '>
> [java] Dependencies calculated for '<
> http://apacheflexbuild.cloudapp.net:8080/job/flex-asjs/ws/mustella/tests/basicTests/bin/js-debug/org/apache/flex/events/utils/EventUtils.js
> '>
> [java] Dependencies calculated for '<
> http://apacheflexbuild.cloudapp.net:8080/job/flex-asjs/ws/mustella/tests/basicTests/bin/js-debug/org/apache/flex/core/IStrand.js
> '>
> [java] Dependencies calculated for '<
> http://apacheflexbuild.cloudapp.net:8080/job/flex-asjs/ws/mustella/tests/basicTests/bin/js-debug/org/apache/flex/core/ValuesManager.js
> '>
> [java] Dependencies calculated for '<
> http://apacheflexbuild.cloudapp.net:8080/job/flex-asjs/ws/mustella/tests/basicTests/bin/js-debug/org/apache/flex/core/IBead.js
> '>
> [java] Dependencies calculated for '<
> http://apacheflexbuild.cloudapp.net:8080/job/flex-asjs/ws/mustella/tests/basicTests/bin/js-debug/org/apache/flex/core/IBeadModel.js
> '>
> [java] Dependencies calculated for '<
> http://apacheflexbuild.cloudapp.net:8080/job/flex-asjs/ws/mustella/tests/basicTests/bin/js-debug/org/apache/flex/core/IStrandWithModel.js
> '>
> [java] Dependencies calculated for '<
> http://apacheflexbuild.cloudapp.net:8080/job/flex-asjs/ws/mustella/tests/basicTests/bin/js-debug/org/apache/flex/utils/StringUtil.js
> '>
> [java] Dependencies calculated for '<
> http://apacheflexbuild.cloudapp.net:8080/job/flex-asjs/ws/mustella/tests/basicTests/bin/js-debug/org/apache/flex/utils/StringTrimmer.js
> '>
> [java] Dependencies calculated for '<
> http://apacheflexbuild.cloudapp.net:8080/job/flex-asjs/ws/mustella/tests/basicTests/bin/js-debug/org/apache/flex/core/IBeadController.js
> '>
> [java] Dependencies calculated for '<
> http://apacheflexbuild.cloudapp.net:8080/job/flex-asjs/ws/mustella/tests/basicTests/bin/js-debug/org/apache/flex/core/IBeadView.js
> '>
> [java] Dependencies calculated for '<
> http://apacheflexbuild.cloudapp.net:8080/job/flex-asjs/ws/mustella/tests/basicTests/bin/js-debug/org/apache/flex/core/ILayoutChild.js
> '>
> [java] Dependencies calculated for '<
> http://apacheflexbuild.cloudapp.net:8080/job/flex-asjs/ws/mustella/tests/basicTests/bin/js-debug/org/apache/flex/core/IChild.js
> '>
> [java] Dependencies calculated for '<
> http://apacheflexbuild.cloudapp.net:8080/job/flex-asjs/ws/mustella/tests/basicTests/bin/js-debug/org/apache/flex/core/IRenderedObject.js
> '>
> [java] Dependencies calculated for '<
> http://apacheflexbuild.cloudapp.net:8080/job/flex-asjs/ws/mustella/tests/basicTests/bin/js-debug/org/apache/flex/core/IUIBase.js
> '>
> [java] Dependencies calculated for '<
> http://apacheflexbuild.cloudapp.net:8080/job/flex-asjs/ws/mustella/tests/basicTests/bin/js-debug/org/apache/flex/core/IMeasurementBead.js
> '>
> [java] Dependencies calculated for '<
> http://apacheflexbuild.cloudapp.net:8080/job/flex-asjs/ws/mustella/tests/basicTests/bin/js-debug/org/apache/flex/core/IParentIUIBase.js
> '>
> [java] Dependencies calculated for '<
> http://apacheflexbuild.cloudapp.net:8080/job/flex-asjs/ws/mustella/tests/basicTests/bin/js-debug/org/apache/flex/core/IParent.js
> '>
> [java] Dependencies calculated for '<
> http://apacheflexbuild.cloudapp.net:8080/job/flex-asjs/ws/mustella/tests/basicTests/bin/js-debug/org/apache/flex/core/IStyleableObject.js
> '>
> [java] Dependencies calculated for '<
> http://apacheflexbuild.cloudapp.net:8080/job/flex-asjs/ws/mustella/tests/basicTests/bin/js-debug/org/apache/flex/core/ITransformHost.js
> '>
> [java] Dependencies calculated for '<
> http://apacheflexbuild.cloudapp.net:8080/job/flex-asjs/ws/mustella/tests/basicTests/bin/js-debug/org/apache/flex/core/IContentView.js
> '>
> [java] Dependencies calculated for '<
> http://apacheflexbuild.cloudapp.net:8080/job/flex-asjs/ws/mustella/tests/basicTests/bin/js-debug/org/apache/flex/html/beads/layouts/BasicLayout.js
> '>
> [java] Dependencies calculated for '<
> http://apacheflexbuild.cloudapp.net:8080/job/flex-asjs/ws/mustella/tests/basicTests/bin/js-debug/org/apache/flex/core/IBeadLayout.js
> '>
> [java] Dependencies calculated for '<
> http://apacheflexbuild.cloudapp.net:8080/job/flex-asjs/ws/mustella/tests/basicTests/bin/js-debug/org/apache/flex/core/ILayoutParent.js
> '>
> [java] Dependencies calculated for '<
> http://apacheflexbuild.cloudapp.net:8080/job/flex-asjs/ws/mustella/tests/basicTests/bin/js-debug/org/apache/flex/html/supportClasses/Viewport.js
> '>
> [java] Dependencies calculated for '<
> http://apacheflexbuild.cloudapp.net:8080/job/flex-asjs/ws/mustella/tests/basicTests/bin/js-debug/org/apache/flex/geom/Size.js
> '>
> [java] Dependencies calculated for '<
> http://apacheflexbuild.cloudapp.net:8080/job/flex-asjs/ws/mustella/tests/basicTests/bin/js-debug/org/apache/flex/utils/CSSContainerUtils.js
> '>
> [java] Dependencies calculated for '<
> http://apacheflexbuild.cloudapp.net:8080/job/flex-asjs/ws/mustella/tests/basicTests/bin/js-debug/org/apache/flex/geom/Rectangle.js
> '>
> [java] Dependencies calculated for '<
> http://apacheflexbuild.cloudapp.net:8080/job/flex-asjs/ws/mustella/tests/basicTests/bin/js-debug/org/apache/flex/geom/Point.js
> '>
> [java] Dependencies calculated for '<
> http://apacheflexbuild.cloudapp.net:8080/job/flex-asjs/ws/mustella/tests/basicTests/bin/js-debug/org/apache/flex/utils/CSSUtils.js
> '>
> [java] Dependencies calculated for '<
> http://apacheflexbuild.cloudapp.net:8080/job/flex-asjs/ws/mustella/tests/basicTests/bin/js-debug/org/apache/flex/utils/StringPadder.js
> '>
> [java] Dependencies calculated for '<
> http://apacheflexbuild.cloudapp.net:8080/job/flex-asjs/ws/mustella/tests/basicTests/bin/js-debug/org/apache/flex/core/IViewport.js
> '>
> [java] Dependencies calculated for '<
> http://apacheflexbuild.cloudapp.net:8080/job/flex-asjs/ws/mustella/tests/basicTests/bin/js-debug/org/apache/flex/html/beads/ContainerView.js
> '>
> [java] Dependencies calculated for '<
> http://apacheflexbuild.cloudapp.net:8080/job/flex-asjs/ws/mustella/tests/basicTests/bin/js-debug/org/apache/flex/core/BeadViewBase.js
> '>
> [java] Dependencies calculated for '<
> http://apacheflexbuild.cloudapp.net:8080/job/flex-asjs/ws/mustella/tests/basicTests/bin/js-debug/org/apache/flex/core/IContainerView.js
> '>
> [java] Dependencies calculated for '<
> http://apacheflexbuild.cloudapp.net:8080/job/flex-asjs/ws/mustella/tests/basicTests/bin/js-debug/org/apache/flex/core/IContentViewHost.js
> '>
> [java] Dependencies calculated for '<
> http://apacheflexbuild.cloudapp.net:8080/job/flex-asjs/ws/mustella/tests/basicTests/bin/js-debug/org/apache/flex/core/ILayoutHost.js
> '>
> [java] Dependencies calculated for '<
> http://apacheflexbuild.cloudapp.net:8080/job/flex-asjs/ws/mustella/tests/basicTests/bin/js-debug/org/apache/flex/core/IViewportModel.js
> '>
> [java] Dependencies calculated for '<
> http://apacheflexbuild.cloudapp.net:8080/job/flex-asjs/ws/mustella/tests/basicTests/bin/js-debug/org/apache/flex/html/beads/IBackgroundBead.js
> '>
> [java] Dependencies calculated for '<
> http://apacheflexbuild.cloudapp.net:8080/job/flex-asjs/ws/mustella/tests/basicTests/bin/js-debug/org/apache/flex/html/beads/IBorderBead.js
> '>
> [java] Dependencies calculated for '<
> http://apacheflexbuild.cloudapp.net:8080/job/flex-asjs/ws/mustella/tests/basicTests/bin/js-debug/org/apache/flex/html/beads/models/ViewportModel.js
> '>
> [java] Dependencies calculated for '<
> http://apacheflexbuild.cloudapp.net:8080/job/flex-asjs/ws/mustella/tests/basicTests/bin/js-debug/org/apache/flex/utils/EffectTimer.js
> '>
> [java] Dependencies calculated for '<
> http://apacheflexbuild.cloudapp.net:8080/job/flex-asjs/ws/mustella/tests/basicTests/bin/js-debug/org/apache/flex/events/ValueEvent.js
> '>
> [java] Dependencies calculated for '<
> http://apacheflexbuild.cloudapp.net:8080/job/flex-asjs/ws/mustella/tests/basicTests/bin/js-debug/org/apache/flex/core/IEffectTimer.js
> '>
> [java] Dependencies calculated for '<
> http://apacheflexbuild.cloudapp.net:8080/job/flex-asjs/ws/mustella/tests/basicTests/bin/js-debug/org/apache/flex/core/SimpleStatesImpl.js
> '>
> [java] Dependencies calculated for '<
> http://apacheflexbuild.cloudapp.net:8080/job/flex-asjs/ws/mustella/tests/basicTests/bin/js-debug/org/apache/flex/events/ValueChangeEvent.js
> '>
> [java] Dependencies calculated for '<
> http://apacheflexbuild.cloudapp.net:8080/job/flex-asjs/ws/mustella/tests/basicTests/bin/js-debug/org/apache/flex/states/AddItems.js
> '>
> [java] Dependencies calculated for '<
> http://apacheflexbuild.cloudapp.net:8080/job/flex-asjs/ws/mustella/tests/basicTests/bin/js-debug/org/apache/flex/states/ItemAndDescriptor.js
> '>
> [java] Dependencies calculated for '<
> http://apacheflexbuild.cloudapp.net:8080/job/flex-asjs/ws/mustella/tests/basicTests/bin/js-debug/org/apache/flex/core/IDocument.js
> '>
> [java] Dependencies calculated for '<
> http://apacheflexbuild.cloudapp.net:8080/job/flex-asjs/ws/mustella/tests/basicTests/bin/js-debug/org/apache/flex/states/SetEventHandler.js
> '>
> [java] Dependencies calculated for '<
> http://apacheflexbuild.cloudapp.net:8080/job/flex-asjs/ws/mustella/tests/basicTests/bin/js-debug/org/apache/flex/states/SetProperty.js
> '>
> [java] Dependencies calculated for '<
> http://apacheflexbuild.cloudapp.net:8080/job/flex-asjs/ws/mustella/tests/basicTests/bin/js-debug/org/apache/flex/utils/MXMLDataInterpreter.js
> '>
> [java] Dependencies calculated for '<
> http://apacheflexbuild.cloudapp.net:8080/job/flex-asjs/ws/mustella/tests/basicTests/bin/js-debug/org/apache/flex/core/IContainer.js
> '>
> [java] Dependencies calculated for '<
> http://apacheflexbuild.cloudapp.net:8080/job/flex-asjs/ws/mustella/tests/basicTests/bin/js-debug/org/apache/flex/core/IMXMLDocument.js
> '>
> [java] Dependencies calculated for '<
> http://apacheflexbuild.cloudapp.net:8080/job/flex-asjs/ws/mustella/tests/basicTests/bin/js-debug/org/apache/flex/core/IStatesImpl.js
> '>
> [java] Dependencies calculated for '<
> http://apacheflexbuild.cloudapp.net:8080/job/flex-asjs/ws/mustella/tests/basicTests/bin/js-debug/org/apache/flex/core/IStatesObject.js
> '>
> [java] Dependencies calculated for '<
> http://apacheflexbuild.cloudapp.net:8080/job/flex-asjs/ws/mustella/tests/basicTests/bin/js-debug/org/apache/flex/html/beads/layouts/VerticalLayout.js
> '>
> [java] Dependencies calculated for '<
> http://apacheflexbuild.cloudapp.net:8080/job/flex-asjs/ws/mustella/tests/basicTests/bin/js-debug/org/apache/flex/core/Application.js
> '>
> [java] Dependencies calculated for '<
> http://apacheflexbuild.cloudapp.net:8080/job/flex-asjs/ws/mustella/tests/basicTests/bin/js-debug/org/apache/flex/core/ApplicationBase.js
> '>
> [java] Dependencies calculated for '<
> http://apacheflexbuild.cloudapp.net:8080/job/flex-asjs/ws/mustella/tests/basicTests/bin/js-debug/org/apache/flex/core/IFlexInfo.js
> '>
> [java] Dependencies calculated for '<
> http://apacheflexbuild.cloudapp.net:8080/job/flex-asjs/ws/mustella/tests/basicTests/bin/js-debug/org/apache/flex/utils/Timer.js
> '>
> [java] Dependencies calculated for '<
> http://apacheflexbuild.cloudapp.net:8080/job/flex-asjs/ws/mustella/tests/basicTests/bin/js-debug/org/apache/flex/core/IInitialViewApplication.js
> '>
> [java] Dependencies calculated for '<
> http://apacheflexbuild.cloudapp.net:8080/job/flex-asjs/ws/mustella/tests/basicTests/bin/js-debug/org/apache/flex/core/IPopUpHost.js
> '>
> [java] Dependencies calculated for '<
> http://apacheflexbuild.cloudapp.net:8080/job/flex-asjs/ws/mustella/tests/basicTests/bin/js-debug/org/apache/flex/core/ISWFApplication.js
> '>
> [java] Dependencies calculated for '<
> http://apacheflexbuild.cloudapp.net:8080/job/flex-asjs/ws/mustella/tests/basicTests/bin/js-debug/org/apache/flex/core/SimpleCSSValuesImpl.js
> '>
> [java] Dependencies calculated for '<
> http://apacheflexbuild.cloudapp.net:8080/job/flex-asjs/ws/mustella/tests/basicTests/bin/js-debug/org/apache/flex/core/ICSSImpl.js
> '>
> [java] Dependencies calculated for '<
> http://apacheflexbuild.cloudapp.net:8080/job/flex-asjs/ws/mustella/tests/basicTests/bin/js-debug/org/apache/flex/core/IValuesImpl.js
> '>
> [java] Dependencies calculated for '<
> http://apacheflexbuild.cloudapp.net:8080/job/flex-asjs/ws/mustella/tests/basicTests/bin/js-debug/BasicTests.js
> '>
> [java] Dependencies calculated for '<
> http://apacheflexbuild.cloudapp.net:8080/job/flex-asjs/ws/mustella/tests/basicTests/bin/js-debug/org/apache/flex/core/View.js
> '>
> [java] Dependencies calculated for '<
> http://apacheflexbuild.cloudapp.net:8080/job/flex-asjs/ws/mustella/tests/basicTests/bin/js-debug/org/apache/flex/core/ViewBase.js
> '>
> [java] Dependencies calculated for '<
> http://apacheflexbuild.cloudapp.net:8080/job/flex-asjs/ws/mustella/tests/basicTests/bin/js-debug/org/apache/flex/core/ContainerBase.js
> '>
> [java] Dependencies calculated for '<
> http://apacheflexbuild.cloudapp.net:8080/job/flex-asjs/ws/mustella/tests/basicTests/bin/js-debug/org/apache/flex/core/ContainerBaseStrandChildren.js
> '>
> [java] Dependencies calculated for '<
> http://apacheflexbuild.cloudapp.net:8080/job/flex-asjs/ws/mustella/tests/basicTests/bin/js-debug/org/apache/flex/core/IApplicationView.js
> '>
> [java] Dependencies calculated for '<
> http://apacheflexbuild.cloudapp.net:8080/job/flex-asjs/ws/mustella/tests/basicTests/bin/js-debug/org/apache/flex/states/State.js
> '>
> [java] Dependencies calculated for '<
> http://apacheflexbuild.cloudapp.net:8080/job/flex-asjs/ws/mustella/tests/basicTests/bin/js-debug/halo/views/ButtonTests.js
> '>
> [java] Dependencies calculated for '<
> http://apacheflexbuild.cloudapp.net:8080/job/flex-asjs/ws/mustella/tests/basicTests/bin/js-debug/shim/VBox.js
> '>
> [java] Dependencies calculated for '<
> http://apacheflexbuild.cloudapp.net:8080/job/flex-asjs/ws/mustella/tests/basicTests/bin/js-debug/org/apache/flex/html/Container.js
> '>
> [java] Dependencies calculated for '<
> http://apacheflexbuild.cloudapp.net:8080/job/flex-asjs/ws/mustella/tests/basicTests/bin/js-debug/org/apache/flex/html/TextButton.js
> '>
> [java] Dependencies calculated for '<
> http://apacheflexbuild.cloudapp.net:8080/job/flex-asjs/ws/mustella/tests/basicTests/bin/js-debug/org/apache/flex/html/Button.js
> '>
> [java] Dependencies calculated for '<
> http://apacheflexbuild.cloudapp.net:8080/job/flex-asjs/ws/mustella/tests/basicTests/bin/js-debug/org/apache/flex/html/ButtonBase.js
> '>
> [java] Dependencies calculated for '<
> http://apacheflexbuild.cloudapp.net:8080/job/flex-asjs/ws/mustella/tests/basicTests/bin/js-debug/org/apache/flex/html/Label.js
> '>
> [java] Dependencies calculated for '<
> http://apacheflexbuild.cloudapp.net:8080/job/flex-asjs/ws/mustella/tests/basicTests/bin/js-debug/org/apache/flex/events/MouseEvent.js
> '>
> [java] Dependencies calculated for '<
> http://apacheflexbuild.cloudapp.net:8080/job/flex-asjs/ws/mustella/tests/basicTests/bin/js-debug/org/apache/flex/utils/PointUtils.js
> '>
> [java] Dependencies calculated for '<
> http://apacheflexbuild.cloudapp.net:8080/job/flex-asjs/ws/mustella/tests/basicTests/bin/js-debug/halo/views/CheckBoxTests.js
> '>
> [java] Dependencies calculated for '<
> http://apacheflexbuild.cloudapp.net:8080/job/flex-asjs/ws/mustella/tests/basicTests/bin/js-debug/org/apache/flex/html/CheckBox.js
> '>
> [java] Dependencies calculated for '<
> http://apacheflexbuild.cloudapp.net:8080/job/flex-asjs/ws/mustella/tests/basicTests/bin/js-debug/org/apache/flex/html/supportClasses/CheckBoxIcon.js
> '>
> [java] Dependencies calculated for '<
> http://apacheflexbuild.cloudapp.net:8080/job/flex-asjs/ws/mustella/tests/basicTests/bin/js-debug/org/apache/flex/utils/MixinManager.js
> '>
> [java] Dependencies calculated for '<
> http://apacheflexbuild.cloudapp.net:8080/job/flex-asjs/ws/mustella/tests/basicTests/bin/js-debug/org/apache/flex/core/CSSFontFaceBead.js
> '>
> [java] Dependencies calculated for '<
> http://apacheflexbuild.cloudapp.net:8080/job/flex-asjs/ws/mustella/tests/basicTests/bin/js-debug/halo/scripts/CheckBoxTestScript.js
> '>
> [java] Dependencies calculated for '<
> http://apacheflexbuild.cloudapp.net:8080/job/flex-asjs/ws/mustella/tests/basicTests/bin/js-debug/UnitTester.js
> '>
> [java] Dependencies calculated for '<
> http://apacheflexbuild.cloudapp.net:8080/job/flex-asjs/ws/mustella/tests/basicTests/bin/js-debug/TestCase.js
> '>
> [java] Dependencies calculated for '<
> http://apacheflexbuild.cloudapp.net:8080/job/flex-asjs/ws/mustella/tests/basicTests/bin/js-debug/SetProperty.js
> '>
> [java] Dependencies calculated for '<
> http://apacheflexbuild.cloudapp.net:8080/job/flex-asjs/ws/mustella/tests/basicTests/bin/js-debug/AssertPropertyValue.js
> '>
> [java] Dependencies calculated for '<
> http://apacheflexbuild.cloudapp.net:8080/job/flex-asjs/ws/mustella/tests/basicTests/bin/js-debug/DispatchMouseEvent.js
> '>
> [java] Dependencies calculated for '<
> http://apacheflexbuild.cloudapp.net:8080/job/flex-asjs/ws/mustella/tests/basicTests/bin/js-debug/DispatchMouseClickEvent.js
> '>
> [java] Dependencies calculated for '<
> http://apacheflexbuild.cloudapp.net:8080/job/flex-asjs/ws/mustella/tests/basicTests/bin/js-debug/halo/scripts/ButtonTestScript.js
> '>
> [java] Dependencies calculated for '<
> http://apacheflexbuild.cloudapp.net:8080/job/flex-asjs/ws/mustella/tests/basicTests/bin/js-debug/SetShowRTE.js
> '>
> [java] Dependencies calculated for '<
> http://apacheflexbuild.cloudapp.net:8080/job/flex-asjs/ws/mustella/tests/basicTests/bin/js-debug/SendFormattedResultsToLog.js
> '>
> [java] Dependencies calculated for '<
> http://apacheflexbuild.cloudapp.net:8080/job/flex-asjs/ws/mustella/tests/basicTests/bin/js-debug/FlexJSContext.js
> '>
> [java] Dependencies calculated for '<
> http://apacheflexbuild.cloudapp.net:8080/job/flex-asjs/ws/mustella/tests/basicTests/bin/js-debug/ExitWhenDone.js
> '>
> [java] The project 'BasicTestsApp' has been successfully compiled and
> optimized.
> [java] 24.4693591 seconds
> [java] Picked up JAVA_TOOL_OPTIONS: -Dfile.encoding=UTF8
>
> basictests-compile-java:
> [delete] Deleting directory <
> http://apacheflexbuild.cloudapp.net:8080/job/flex-asjs/ws/mustella/java/bin
> >
> [mkdir] Created dir: <
> http://apacheflexbuild.cloudapp.net:8080/job/flex-asjs/ws/mustella/java/bin
> >
> [javac] <
> http://apacheflexbuild.cloudapp.net:8080/job/flex-asjs/ws/build.xml>:1280:
> warning: 'includeantruntime' was not set, defaulting to
> build.sysclasspath=last; set to false for repeatable builds
> [javac] Compiling 11 source files to <
> http://apacheflexbuild.cloudapp.net:8080/job/flex-asjs/ws/mustella/java/bin
> >
>
> basictests-run-js:
> [echo] url=file://<
> http://apacheflexbuild.cloudapp.net:8080/job/flex-asjs/ws/mustella/tests/basicTests/bin/js-debug/index.html
> >
> [echo] script=<
> http://apacheflexbuild.cloudapp.net:8080/job/flex-asjs/ws/mustella/tests/basicTests/halo/scripts/ButtonTestScript.mxml
> >
> [echo] script=<
> http://apacheflexbuild.cloudapp.net:8080/job/flex-asjs/ws/mustella/tests/basicTests/halo/scripts/CheckBoxTestScript.mxml
> >
> [java] file://<
> http://apacheflexbuild.cloudapp.net:8080/job/flex-asjs/ws/mustella/tests/basicTests/bin/js-debug/index.html
> >
> [java] running script <
> http://apacheflexbuild.cloudapp.net:8080/job/flex-asjs/ws/mustella/tests/basicTests/halo/scripts/ButtonTestScript.mxml
> >
> [java] test case count: 2
> [java] RESULT: scriptName=<
> http://apacheflexbuild.cloudapp.net:8080/job/flex-asjs/ws/mustella/tests/basicTests/halo/scripts/ButtonTestScript.mxml>
> id=SetupButtonTest result=pass elapsed=432 phase=body started=1484712356214
> extraInfo= msg=
> [java] RESULT: scriptName=<
> http://apacheflexbuild.cloudapp.net:8080/job/flex-asjs/ws/mustella/tests/basicTests/halo/scripts/ButtonTestScript.mxml>
> id=ButtonTest1 result=pass elapsed=961 phase=body started=1484712356647
> extraInfo= msg=
> [java] running script <
> http://apacheflexbuild.cloudapp.net:8080/job/flex-asjs/ws/mustella/tests/basicTests/halo/scripts/CheckBoxTestScript.mxml
> >
> [java] test case count: 2
> [java] RESULT: scriptName=<
> http://apacheflexbuild.cloudapp.net:8080/job/flex-asjs/ws/mustella/tests/basicTests/halo/scripts/CheckBoxTestScript.mxml>
> id=SetupCheckBoxTest result=pass elapsed=427 phase=body
> started=1484712357609 extraInfo= msg=
> [java] RESULT: scriptName=<
> http://apacheflexbuild.cloudapp.net:8080/job/flex-asjs/ws/mustella/tests/basicTests/halo/scripts/CheckBoxTestScript.mxml>
> id=CheckBoxTest1 result=pass elapsed=856 phase=body started=1484712358036
> extraInfo= msg=
> [java] Picked up JAVA_TOOL_OPTIONS: -Dfile.encoding=UTF8
>
> basictests-js:
>
> basictests-marmotinni:
>
> checkintests:
>
> doc:
>
> other.locales:
>
> check-goog-home:
>
> binary-package:
>
> check-flex-home:
>
> stage-source-no-scripts:
>
> clean-temp:
> [delete] Deleting directory <
> http://apacheflexbuild.cloudapp.net:8080/job/flex-asjs/ws/temp>
> [copy] Copying 18 files to <
> http://apacheflexbuild.cloudapp.net:8080/job/flex-asjs/ws/temp>
>
> stage-framework-as:
> [copy] Copying 1486 files to <
> http://apacheflexbuild.cloudapp.net:8080/job/flex-asjs/ws/temp/frameworks>
> [echo] Updating config file air-config.xml with version 0.8.0.20170118
> [echo] Updating config file flex-config.xml with version
> 0.8.0.20170118
> [echo] Updating config file js-config.xml with version 0.8.0.20170118
> [echo] Updating config file jquery-config.xml with version
> 0.8.0.20170118
> [echo] Updating config file createjs-config.xml with version
> 0.8.0.20170118
> [echo] Updating config file node-config.xml with version
> 0.8.0.20170118
> [copy] Copying 1 file to <
> http://apacheflexbuild.cloudapp.net:8080/job/flex-asjs/ws/temp/asdoc>
> [copy] Copying 3 files to <
> http://apacheflexbuild.cloudapp.net:8080/job/flex-asjs/ws/temp>
> [copy] Copying 12 files to <
> http://apacheflexbuild.cloudapp.net:8080/job/flex-asjs/ws/temp/ide>
> [copy] Copying 14 files to <
> http://apacheflexbuild.cloudapp.net:8080/job/flex-asjs/ws/temp/js/bin>
> [copy] Copying 436 files to <
> http://apacheflexbuild.cloudapp.net:8080/job/flex-asjs/ws/temp/examples>
> [copy] Copying 1 file to <
> http://apacheflexbuild.cloudapp.net:8080/job/flex-asjs/ws/temp/templates>
>
> stage-source:
>
> stage-scripts:
> [copy] Copying 4 files to <
> http://apacheflexbuild.cloudapp.net:8080/job/flex-asjs/ws/temp/scripts>
>
> stage-nightly:
> [copy] Copying 1 file to <
> http://apacheflexbuild.cloudapp.net:8080/job/flex-asjs/ws/temp>
> [copy] Copying 95 files to <
> http://apacheflexbuild.cloudapp.net:8080/job/flex-asjs/ws/temp/frameworks>
> [copy] Copying 460 files to <
> http://apacheflexbuild.cloudapp.net:8080/job/flex-asjs/ws/temp/frameworks>
>
> copy-gcl-from-goog-home:
> [echo] Copying GCL from C:\google\closure\Library
> [copy] Copying 28 files to <
> http://apacheflexbuild.cloudapp.net:8080/job/flex-asjs/ws/temp/js/lib/google/closure-library
> >
> [copy] Copied 161 empty directories to 145 empty directories under <
> http://apacheflexbuild.cloudapp.net:8080/job/flex-asjs/ws/temp/js/lib/google/closure-library
> >
>
> copy-gcl-from-downloaded:
>
> inject-asf-header:
>
> binary-package-zip:
> [zip] Building zip: <
> http://apacheflexbuild.cloudapp.net:8080/job/flex-asjs/1879/artifact/out/apache-flex-flexjs-0.8.0-bin.zip
> >
>
> binary-package-tgz:
> [tar] Building tar: <
> http://apacheflexbuild.cloudapp.net:8080/job/flex-asjs/1879/artifact/out/apache-flex-flexjs-0.8.0-bin.tar.gz
> >
> [copy] Copying 1 file to <
> http://apacheflexbuild.cloudapp.net:8080/job/flex-asjs/ws/out>
>
> ja-locale-samples:
>
> additional-packages:
>
> binary-release:
>
> rat-taskdef:
>
> have-rattasks:
>
> no-rattasks:
> [echo] Rat report not generated.
> [echo] rat jars (apache-rat-*.jar, apache-rat-tasks-*.jar)
> [echo] not found in anttask.classpath
>
> rat-check:
>
> release:
>
> create-md5:
> [echo] Generating MD5 hashes for release artifacts
>
> BUILD SUCCESSFUL
> Total time: 33 minutes 24 seconds
> Picked up JAVA_TOOL_OPTIONS: -Dfile.encoding=UTF8
> [flex-asjs] $ cmd.exe /C
> "c:\Jenkins\tools\hudson.tasks.Ant_AntInstallation\c_apache-ant-1.9.3\bin\ant.bat
> -file build.xml -Dnightly=true
> -Djshint=C:\Users\apacheflexbuild\AppData\Roaming\npm\jshint_jenkins.cmd
> '"-Dbrowser=C:\Program Files (x86)\Mozilla Firefox\firefox.exe"'
> -Dgjslint=C:\Python27\Scripts\gjslint.exe -Dbuild.noprompt=true
> -Ddoc_output=<
> http://apacheflexbuild.cloudapp.net:8080/job/flex-asjs/1879/artifact/out/asdoc>
> -Dplayerglobal.version=11.7 asdoc-package doc-create-md5 && exit
> %%ERRORLEVEL%%"
> Buildfile: <
> http://apacheflexbuild.cloudapp.net:8080/job/flex-asjs/ws/build.xml>
>
> asdoc-package:
>
> clean-temp:
> [delete] Deleting directory <
> http://apacheflexbuild.cloudapp.net:8080/job/flex-asjs/ws/temp>
>
> asdoc:
> [echo] FLEX_HOME = <
> http://apacheflexbuild.cloudapp.net:8080/job/flex-asjs/ws/asdoc/../../flex-sdk
> >
> [echo] flexlib = <
> http://apacheflexbuild.cloudapp.net:8080/job/flex-asjs/ws/frameworks>
> [echo] doc_output = <
> http://apacheflexbuild.cloudapp.net:8080/job/flex-asjs/1879/artifact/out/asdoc
> >
> [echo] compiler.source-path = <
> http://apacheflexbuild.cloudapp.net:8080/job/flex-asjs/ws/frameworks/projects/*/src/main/flex
> >
>
> clean:
>
> doc:
> [asdoc] Loading configuration file
> C:\Jenkins\workspace\flex-asjs\frameworks\asdoc-config.xml
> [asdoc]
> C:\Jenkins\workspace\flex-asjs\frameworks\projects\Core\src\main\flex\org\apache\flex\events\utils\EventUtils.as:
> Error: A file found in a source-path must have an externally visible
> definition. If a definition in the file is meant to be externally visible,
> please put the definition in a package.
> [asdoc]
> [asdoc] Picked up JAVA_TOOL_OPTIONS: -Dfile.encoding=UTF8
>
> BUILD FAILED
> <http://apacheflexbuild.cloudapp.net:8080/job/flex-asjs/ws/build.xml>:1119:
> The following error occurred while executing this line:
> <http://apacheflexbuild.cloudapp.net:8080/job/flex-asjs/ws/build.xml>:540:
> The following error occurred while executing this line:
> <http://apacheflexbuild.cloudapp.net:8080/job/flex-asjs/ws/asdoc/build.xml>:73:
> asdoc task failed.
>
> Total time: 37 seconds
> Picked up JAVA_TOOL_OPTIONS: -Dfile.encoding=UTF8
> Build step 'Invoke Ant' marked build as failure
> Skipped archiving because build is not successful
>