You are viewing a plain text version of this content. The canonical link for it is here.
Posted to alerts@harmony.apache.org by no...@intel.com on 2009/08/04 18:09:53 UTC

[build-test alert] FAILED Linux x86_64: drlvm-test debug

BUILD FAILED:
	Ant Error Message:
/home/laichunrong/harmony.regularcc/infra/scripts/cc-exec-adaptor.xml:68: The following error occurred while executing this line: /home/laichunrong/harmony.regularcc/infra/adaptors/drlvm-test/adaptor.xml:81: There were drlvm-test failures

Date of build:	2009-08-04 21:30:28 +0800
Time to build:	159 minutes 7 seconds
Last changed:	08/04/2009 21:04:05
Last log entry:	hdk

***********************************************************
Errors/Warnings:	(21)
            
[java] Java Result: 1
[java] Java Result: 1
[java] Java Result: 130
[java] Java Result: 1
[java] Java Result: 1
[java] Java Result: 130
[java] Java Result: 1
[java] Java Result: 1
[java] Java Result: 130
[java] Java Result: 1
[java] Java Result: 127
[java] Java Result: 1
[java] Java Result: 130
[java] Java Result: 1
[java] Java Result: 1
[java] Java Result: 130
BUILD FAILED
/home/laichunrong/harmony.regularcc/infra/build/checkouts/hdk/working_vm/build.xml:286: Some tests failed
Total time: 158 minutes 38 seconds
The execution FAILED with the following exception:
The following error occurred while executing this line:
/home/laichunrong/harmony.regularcc/infra/adaptors/drlvm-test/adaptor.xml:81: There were drlvm-test failures

***********************************************************
Unit Tests: (4187)
        
failure: interpreter outofmemory.Vector_int
Unit Test Error Details:	(1)
                
Test: interpreterClass: outofmemory.Vector_intExit code: 127 Err: /home/laichunrong/harmony.regularcc/infra/build/checkouts/hdk/target/hdk/jdk/jre/bin/java: symbol lookup error: /home/laichunrong/harmony.regularcc/infra/build/checkouts/hdk/target/hdk/jdk/jre/bin/libhythr.so: undefined symbol: hythread_lib_state, version HYTHR_0.1

***********************************************************
Modifications since last successful build:	(1)
            
add cc-hdk log20090804210405Lbuild.219 08/04/2009 21:04:05hdk