You are viewing a plain text version of this content. The canonical link for it is here.
Posted to dev@lucene.apache.org by Policeman Jenkins Server <je...@sd-datasolutions.de> on 2012/12/19 03:12:07 UTC

[JENKINS] Lucene-Solr-4.x-Linux (64bit/jdk1.8.0-ea-b65) - Build # 3283 - Failure!

Build: http://jenkins.sd-datasolutions.de/job/Lucene-Solr-4.x-Linux/3283/
Java: 64bit/jdk1.8.0-ea-b65 -XX:+UseG1GC

1 tests failed.
REGRESSION:  org.apache.solr.TestDistributedGrouping.testDistribSearch

Error Message:
.grouped.id:5!=a_t:kings OR a_t:eggs (unordered or missing)

Stack Trace:
junit.framework.AssertionFailedError: .grouped.id:5!=a_t:kings OR a_t:eggs (unordered or missing)
	at __randomizedtesting.SeedInfo.seed([1D4B7E576A9CA812:9CADF04F1DC3C82E]:0)
	at junit.framework.Assert.fail(Assert.java:50)
	at org.apache.solr.BaseDistributedSearchTestCase.compareResponses(BaseDistributedSearchTestCase.java:785)
	at org.apache.solr.BaseDistributedSearchTestCase.query(BaseDistributedSearchTestCase.java:495)
	at org.apache.solr.BaseDistributedSearchTestCase.query(BaseDistributedSearchTestCase.java:475)
	at org.apache.solr.TestDistributedGrouping.doTest(TestDistributedGrouping.java:168)
	at org.apache.solr.BaseDistributedSearchTestCase.testDistribSearch(BaseDistributedSearchTestCase.java:800)
	at sun.reflect.NativeMethodAccessorImpl.invoke0(Native Method)
	at sun.reflect.NativeMethodAccessorImpl.invoke(NativeMethodAccessorImpl.java:57)
	at sun.reflect.DelegatingMethodAccessorImpl.invoke(DelegatingMethodAccessorImpl.java:43)
	at java.lang.reflect.Method.invoke(Method.java:474)
	at com.carrotsearch.randomizedtesting.RandomizedRunner.invoke(RandomizedRunner.java:1559)
	at com.carrotsearch.randomizedtesting.RandomizedRunner.access$600(RandomizedRunner.java:79)
	at com.carrotsearch.randomizedtesting.RandomizedRunner$6.evaluate(RandomizedRunner.java:737)
	at com.carrotsearch.randomizedtesting.RandomizedRunner$7.evaluate(RandomizedRunner.java:773)
	at com.carrotsearch.randomizedtesting.RandomizedRunner$8.evaluate(RandomizedRunner.java:787)
	at com.carrotsearch.randomizedtesting.rules.SystemPropertiesRestoreRule$1.evaluate(SystemPropertiesRestoreRule.java:53)
	at org.apache.lucene.util.TestRuleSetupTeardownChained$1.evaluate(TestRuleSetupTeardownChained.java:50)
	at org.apache.lucene.util.TestRuleFieldCacheSanity$1.evaluate(TestRuleFieldCacheSanity.java:51)
	at org.apache.lucene.util.AbstractBeforeAfterRule$1.evaluate(AbstractBeforeAfterRule.java:46)
	at com.carrotsearch.randomizedtesting.rules.SystemPropertiesInvariantRule$1.evaluate(SystemPropertiesInvariantRule.java:55)
	at org.apache.lucene.util.TestRuleThreadAndTestName$1.evaluate(TestRuleThreadAndTestName.java:49)
	at org.apache.lucene.util.TestRuleIgnoreAfterMaxFailures$1.evaluate(TestRuleIgnoreAfterMaxFailures.java:70)
	at org.apache.lucene.util.TestRuleMarkFailure$1.evaluate(TestRuleMarkFailure.java:48)
	at com.carrotsearch.randomizedtesting.rules.StatementAdapter.evaluate(StatementAdapter.java:36)
	at com.carrotsearch.randomizedtesting.ThreadLeakControl$StatementRunner.run(ThreadLeakControl.java:358)
	at com.carrotsearch.randomizedtesting.ThreadLeakControl.forkTimeoutingTask(ThreadLeakControl.java:782)
	at com.carrotsearch.randomizedtesting.ThreadLeakControl$3.evaluate(ThreadLeakControl.java:442)
	at com.carrotsearch.randomizedtesting.RandomizedRunner.runSingleTest(RandomizedRunner.java:746)
	at com.carrotsearch.randomizedtesting.RandomizedRunner$3.evaluate(RandomizedRunner.java:648)
	at com.carrotsearch.randomizedtesting.RandomizedRunner$4.evaluate(RandomizedRunner.java:682)
	at com.carrotsearch.randomizedtesting.RandomizedRunner$5.evaluate(RandomizedRunner.java:693)
	at com.carrotsearch.randomizedtesting.rules.StatementAdapter.evaluate(StatementAdapter.java:36)
	at com.carrotsearch.randomizedtesting.rules.SystemPropertiesRestoreRule$1.evaluate(SystemPropertiesRestoreRule.java:53)
	at org.apache.lucene.util.AbstractBeforeAfterRule$1.evaluate(AbstractBeforeAfterRule.java:46)
	at org.apache.lucene.util.TestRuleStoreClassName$1.evaluate(TestRuleStoreClassName.java:42)
	at com.carrotsearch.randomizedtesting.rules.SystemPropertiesInvariantRule$1.evaluate(SystemPropertiesInvariantRule.java:55)
	at com.carrotsearch.randomizedtesting.rules.NoShadowingOrOverridesOnMethodsRule$1.evaluate(NoShadowingOrOverridesOnMethodsRule.java:39)
	at com.carrotsearch.randomizedtesting.rules.NoShadowingOrOverridesOnMethodsRule$1.evaluate(NoShadowingOrOverridesOnMethodsRule.java:39)
	at com.carrotsearch.randomizedtesting.rules.StatementAdapter.evaluate(StatementAdapter.java:36)
	at org.apache.lucene.util.TestRuleAssertionsRequired$1.evaluate(TestRuleAssertionsRequired.java:43)
	at org.apache.lucene.util.TestRuleMarkFailure$1.evaluate(TestRuleMarkFailure.java:48)
	at org.apache.lucene.util.TestRuleIgnoreAfterMaxFailures$1.evaluate(TestRuleIgnoreAfterMaxFailures.java:70)
	at org.apache.lucene.util.TestRuleIgnoreTestSuites$1.evaluate(TestRuleIgnoreTestSuites.java:55)
	at com.carrotsearch.randomizedtesting.rules.StatementAdapter.evaluate(StatementAdapter.java:36)
	at com.carrotsearch.randomizedtesting.ThreadLeakControl$StatementRunner.run(ThreadLeakControl.java:358)
	at java.lang.Thread.run(Thread.java:722)




Build Log:
[...truncated 8724 lines...]
[junit4:junit4] Suite: org.apache.solr.TestDistributedGrouping
[junit4:junit4]   2> 5 T257 oas.BaseDistributedSearchTestCase.initHostContext Setting hostContext system property: /ldtfh/i
[junit4:junit4]   2> 8 T257 oas.SolrTestCaseJ4.setUp ###Starting testDistribSearch
[junit4:junit4]   2> 10 T257 oejs.Server.doStart jetty-8.1.8.v20121106
[junit4:junit4]   2> 16 T257 oejs.AbstractConnector.doStart Started SelectChannelConnector@127.0.0.1:60309
[junit4:junit4]   2> 17 T257 oasc.SolrResourceLoader.locateSolrHome JNDI not configured for solr (NoInitialContextEx)
[junit4:junit4]   2> 18 T257 oasc.SolrResourceLoader.locateSolrHome using system property solr.solr.home: /mnt/ssd/jenkins/workspace/Lucene-Solr-4.x-Linux/solr/build/solr-core/test-files/solr
[junit4:junit4]   2> 18 T257 oasc.SolrResourceLoader.<init> new SolrResourceLoader for deduced Solr Home: '/mnt/ssd/jenkins/workspace/Lucene-Solr-4.x-Linux/solr/build/solr-core/test-files/solr/'
[junit4:junit4]   2> 39 T257 oass.SolrDispatchFilter.init SolrDispatchFilter.init()
[junit4:junit4]   2> 40 T257 oasc.SolrResourceLoader.locateSolrHome JNDI not configured for solr (NoInitialContextEx)
[junit4:junit4]   2> 41 T257 oasc.SolrResourceLoader.locateSolrHome using system property solr.solr.home: /mnt/ssd/jenkins/workspace/Lucene-Solr-4.x-Linux/solr/build/solr-core/test-files/solr
[junit4:junit4]   2> 41 T257 oasc.CoreContainer$Initializer.initialize looking for solr.xml: /mnt/ssd/jenkins/workspace/Lucene-Solr-4.x-Linux/solr/build/solr-core/test-files/solr/solr.xml
[junit4:junit4]   2> 41 T257 oasc.CoreContainer.<init> New CoreContainer 1867308719
[junit4:junit4]   2> 42 T257 oasc.CoreContainer.load Loading CoreContainer using Solr Home: '/mnt/ssd/jenkins/workspace/Lucene-Solr-4.x-Linux/solr/build/solr-core/test-files/solr/'
[junit4:junit4]   2> 42 T257 oasc.SolrResourceLoader.<init> new SolrResourceLoader for directory: '/mnt/ssd/jenkins/workspace/Lucene-Solr-4.x-Linux/solr/build/solr-core/test-files/solr/'
[junit4:junit4]   2> 58 T257 oashc.HttpShardHandlerFactory.getParameter Setting socketTimeout to: 30000
[junit4:junit4]   2> 59 T257 oashc.HttpShardHandlerFactory.getParameter Setting urlScheme to: http://
[junit4:junit4]   2> 59 T257 oashc.HttpShardHandlerFactory.getParameter Setting connTimeout to: 15000
[junit4:junit4]   2> 60 T257 oashc.HttpShardHandlerFactory.getParameter Setting maxConnectionsPerHost to: 20
[junit4:junit4]   2> 60 T257 oashc.HttpShardHandlerFactory.getParameter Setting corePoolSize to: 0
[junit4:junit4]   2> 61 T257 oashc.HttpShardHandlerFactory.getParameter Setting maximumPoolSize to: 2147483647
[junit4:junit4]   2> 61 T257 oashc.HttpShardHandlerFactory.getParameter Setting maxThreadIdleTime to: 5
[junit4:junit4]   2> 62 T257 oashc.HttpShardHandlerFactory.getParameter Setting sizeOfQueue to: -1
[junit4:junit4]   2> 62 T257 oashc.HttpShardHandlerFactory.getParameter Setting fairnessPolicy to: false
[junit4:junit4]   2> 62 T257 oascsi.HttpClientUtil.createClient Creating new http client, config:maxConnectionsPerHost=20&maxConnections=10000&socketTimeout=30000&connTimeout=15000&retry=false
[junit4:junit4]   2> 74 T257 oasc.CoreContainer.load Registering Log Listener
[junit4:junit4]   2> 92 T267 oasc.CoreContainer.create Creating SolrCore 'collection1' using instanceDir: /mnt/ssd/jenkins/workspace/Lucene-Solr-4.x-Linux/solr/build/solr-core/test-files/solr/collection1
[junit4:junit4]   2> 93 T267 oasc.SolrResourceLoader.<init> new SolrResourceLoader for directory: '/mnt/ssd/jenkins/workspace/Lucene-Solr-4.x-Linux/solr/build/solr-core/test-files/solr/collection1/'
[junit4:junit4]   2> 93 T267 oasc.SolrResourceLoader.replaceClassLoader Adding 'file:/mnt/ssd/jenkins/workspace/Lucene-Solr-4.x-Linux/solr/build/solr-core/test-files/solr/collection1/lib/README' to classloader
[junit4:junit4]   2> 94 T267 oasc.SolrResourceLoader.replaceClassLoader Adding 'file:/mnt/ssd/jenkins/workspace/Lucene-Solr-4.x-Linux/solr/build/solr-core/test-files/solr/collection1/lib/classes/' to classloader
[junit4:junit4]   2> 125 T267 oasc.SolrConfig.<init> Using Lucene MatchVersion: LUCENE_41
[junit4:junit4]   2> 167 T267 oasc.SolrConfig.<init> Loaded SolrConfig: solrconfig.xml
[junit4:junit4]   2> 167 T267 oass.IndexSchema.readSchema Reading Solr Schema
[junit4:junit4]   2> 171 T267 oass.IndexSchema.readSchema Schema name=test
[junit4:junit4]   2> 475 T267 oass.OpenExchangeRatesOrgProvider.init Initialized with rates=open-exchange-rates.json, refreshInterval=1440.
[junit4:junit4]   2> 480 T267 oass.IndexSchema.readSchema default search field in schema is text
[junit4:junit4]   2> 482 T267 oass.IndexSchema.readSchema unique key field: id
[junit4:junit4]   2> 486 T267 oass.FileExchangeRateProvider.reload Reloading exchange rates from file currency.xml
[junit4:junit4]   2> 490 T267 oass.FileExchangeRateProvider.reload Reloading exchange rates from file currency.xml
[junit4:junit4]   2> 493 T267 oass.OpenExchangeRatesOrgProvider.reload Reloading exchange rates from open-exchange-rates.json
[junit4:junit4]   2> 493 T267 oass.OpenExchangeRatesOrgProvider.reload Reloading exchange rates from open-exchange-rates.json
[junit4:junit4]   2> 494 T267 oasc.SolrCore.<init> [collection1] Opening new SolrCore at /mnt/ssd/jenkins/workspace/Lucene-Solr-4.x-Linux/solr/build/solr-core/test-files/solr/collection1/, dataDir=./org.apache.solr.TestDistributedGrouping-1355882546117/control/data/
[junit4:junit4]   2> 494 T267 oasc.JmxMonitoredMap.<init> JMX monitoring is enabled. Adding Solr mbeans to JMX Server: com.sun.jmx.mbeanserver.JmxMBeanServer@4bb807ac
[junit4:junit4]   2> 495 T267 oasc.SolrCore.initDirectoryFactory org.apache.solr.core.MockDirectoryFactory
[junit4:junit4]   2> 495 T267 oasc.CachingDirectoryFactory.get return new directory for /mnt/ssd/jenkins/workspace/Lucene-Solr-4.x-Linux/solr/build/solr-core/test/J1/./org.apache.solr.TestDistributedGrouping-1355882546117/control/data forceNew:false
[junit4:junit4]   2> 496 T267 oasc.CachingDirectoryFactory.close Releasing directory:/mnt/ssd/jenkins/workspace/Lucene-Solr-4.x-Linux/solr/build/solr-core/test/J1/./org.apache.solr.TestDistributedGrouping-1355882546117/control/data
[junit4:junit4]   2> 496 T267 oasc.SolrCore.getNewIndexDir New index directory detected: old=null new=./org.apache.solr.TestDistributedGrouping-1355882546117/control/data/index/
[junit4:junit4]   2> 496 T267 oasc.SolrCore.initIndex WARNING [collection1] Solr index directory './org.apache.solr.TestDistributedGrouping-1355882546117/control/data/index' doesn't exist. Creating new index...
[junit4:junit4]   2> 497 T267 oasc.CachingDirectoryFactory.get return new directory for /mnt/ssd/jenkins/workspace/Lucene-Solr-4.x-Linux/solr/build/solr-core/test/J1/./org.apache.solr.TestDistributedGrouping-1355882546117/control/data/index forceNew:false
[junit4:junit4]   2> 499 T267 oasc.SolrDeletionPolicy.onCommit SolrDeletionPolicy.onCommit: commits:num=1
[junit4:junit4]   2> 		commit{dir=RateLimitedDirectoryWrapper(MockDirWrapper(org.apache.lucene.store.RAMDirectory@e59a459 lockFactory=org.apache.lucene.store.NativeFSLockFactory@45e91ace)),segFN=segments_1,generation=1,filenames=[segments_1]
[junit4:junit4]   2> 499 T267 oasc.SolrDeletionPolicy.updateCommits newest commit = 1[segments_1]
[junit4:junit4]   2> 499 T267 oasc.CachingDirectoryFactory.close Releasing directory:/mnt/ssd/jenkins/workspace/Lucene-Solr-4.x-Linux/solr/build/solr-core/test/J1/./org.apache.solr.TestDistributedGrouping-1355882546117/control/data/index
[junit4:junit4]   2> 499 T267 oasc.SolrCore.initWriters created xml: solr.XMLResponseWriter
[junit4:junit4]   2> 500 T267 oasup.UpdateRequestProcessorChain.init inserting DistributedUpdateProcessorFactory into updateRequestProcessorChain "dedupe"
[junit4:junit4]   2> 501 T267 oasup.UpdateRequestProcessorChain.init inserting DistributedUpdateProcessorFactory into updateRequestProcessorChain "dedupe-allfields"
[junit4:junit4]   2> 501 T267 oasup.UpdateRequestProcessorChain.init inserting DistributedUpdateProcessorFactory into updateRequestProcessorChain "stored_sig"
[junit4:junit4]   2> 501 T267 oasup.UpdateRequestProcessorChain.init inserting DistributedUpdateProcessorFactory into updateRequestProcessorChain "uniq-fields"
[junit4:junit4]   2> 501 T267 oasup.UpdateRequestProcessorChain.init inserting DistributedUpdateProcessorFactory into updateRequestProcessorChain "distrib-dup-test-chain-implicit"
[junit4:junit4]   2> 502 T267 oasc.RequestHandlers.initHandlersFromConfig adding lazy requestHandler: solr.ReplicationHandler
[junit4:junit4]   2> 502 T267 oasc.RequestHandlers.initHandlersFromConfig created /replication: solr.ReplicationHandler
[junit4:junit4]   2> 502 T267 oasc.RequestHandlers.initHandlersFromConfig created standard: solr.StandardRequestHandler
[junit4:junit4]   2> 503 T267 oasc.RequestHandlers.initHandlersFromConfig created /get: solr.RealTimeGetHandler
[junit4:junit4]   2> 503 T267 oasc.RequestHandlers.initHandlersFromConfig created dismax: solr.SearchHandler
[junit4:junit4]   2> 504 T267 oasc.RequestHandlers.initHandlersFromConfig created mock: org.apache.solr.core.MockQuerySenderListenerReqHandler
[junit4:junit4]   2> 504 T267 oasc.RequestHandlers.initHandlersFromConfig created /admin/: org.apache.solr.handler.admin.AdminHandlers
[junit4:junit4]   2> 504 T267 oasc.RequestHandlers.initHandlersFromConfig created defaults: solr.StandardRequestHandler
[junit4:junit4]   2> 504 T267 oasc.RequestHandlers.initHandlersFromConfig adding lazy requestHandler: solr.StandardRequestHandler
[junit4:junit4]   2> 505 T267 oasc.RequestHandlers.initHandlersFromConfig created lazy: solr.StandardRequestHandler
[junit4:junit4]   2> 505 T267 oasc.RequestHandlers.initHandlersFromConfig created /update: solr.UpdateRequestHandler
[junit4:junit4]   2> 505 T267 oasc.RequestHandlers.initHandlersFromConfig created /terms: org.apache.solr.handler.component.SearchHandler
[junit4:junit4]   2> 506 T267 oasc.RequestHandlers.initHandlersFromConfig created spellCheckCompRH: org.apache.solr.handler.component.SearchHandler
[junit4:junit4]   2> 506 T267 oasc.RequestHandlers.initHandlersFromConfig created spellCheckCompRH_Direct: org.apache.solr.handler.component.SearchHandler
[junit4:junit4]   2> 507 T267 oasc.RequestHandlers.initHandlersFromConfig created spellCheckWithWordbreak: org.apache.solr.handler.component.SearchHandler
[junit4:junit4]   2> 507 T267 oasc.RequestHandlers.initHandlersFromConfig created spellCheckWithWordbreak_Direct: org.apache.solr.handler.component.SearchHandler
[junit4:junit4]   2> 508 T267 oasc.RequestHandlers.initHandlersFromConfig created spellCheckCompRH1: org.apache.solr.handler.component.SearchHandler
[junit4:junit4]   2> 508 T267 oasc.RequestHandlers.initHandlersFromConfig created mltrh: org.apache.solr.handler.component.SearchHandler
[junit4:junit4]   2> 508 T267 oasc.RequestHandlers.initHandlersFromConfig created tvrh: org.apache.solr.handler.component.SearchHandler
[junit4:junit4]   2> 509 T267 oasc.RequestHandlers.initHandlersFromConfig created /mlt: solr.MoreLikeThisHandler
[junit4:junit4]   2> 509 T267 oasc.RequestHandlers.initHandlersFromConfig created /debug/dump: solr.DumpRequestHandler
[junit4:junit4]   2> 511 T267 oashl.XMLLoader.init xsltCacheLifetimeSeconds=60
[junit4:junit4]   2> 513 T267 oasc.SolrCore.initDeprecatedSupport WARNING solrconfig.xml uses deprecated <admin/gettableFiles>, Please update your config to use the ShowFileRequestHandler.
[junit4:junit4]   2> 514 T267 oasc.SolrCore.initDeprecatedSupport WARNING adding ShowFileRequestHandler with hidden files: [BAD-SCHEMA-EXTERNAL-FILEFIELD.XML, SCHEMA-COPYFIELD-TEST.XML, SOLRCONFIG-BASIC-LUCENEVERSION31.XML, SCHEMA-SPELLCHECKER.XML, SOLRCONFIG-BASIC.XML, SCHEMA-EFF.XML, SCHEMA-LMDIRICHLET.XML, ELEVATE.XML, SOLRCONFIG-NATIVELOCK.XML, BAD-SCHEMA-OMIT-TF-BUT-NOT-POS.XML, BAD-SCHEMA-ANALYZER-CLASS-AND-NESTED.XML, FUZZYSUGGEST.TXT, COMPOUNDDICTIONARY.TXT, STOPTYPES-1.TXT, STEMDICT.TXT, SOLRCONFIG-ENABLEPLUGIN.XML, SOLRCONFIG-SCRIPT-UPDATEPROCESSOR.XML, HUNSPELL-TEST.DIC, SOLRCONFIG-ELEVATE.XML, SCHEMA-BINARYFIELD.XML, STOP-2.TXT, BAD-SCHEMA-UNIQUEKEY-IS-COPYFIELD-DEST.XML, BAD-SOLRCONFIG-INVALID-SCRIPTFILE.XML, STOP-1.TXT, XSLT, BAD-SCHEMA-NONTEXT-ANALYZER.XML, CURRENCY.XML, SCHEMA-STOP-KEEP.XML, SCHEMA-XINCLUDE.XML, BAD-SCHEMA-UNIQUEKEY-MULTIVALUED.XML, MAPPING-ISOLATIN1ACCENT.TXT, BAD-MP-SOLRCONFIG.XML, SOLRCONFIG-SPELLCHECKCOMPONENT.XML, SOLRCONFIG-CACHING.XML, SOLRCONFIG-NOCACHE.XML, SOLRCONFIG-XINCLUDE.XML, SYNONYMS.TXT, SCHEMA-LMJELINEKMERCER.XML, BAD-SCHEMA-NOT-INDEXED-BUT-POS.XML, SCHEMA-BM25.XML, SOLRCONFIG-QUERYSENDER-NOQUERY.XML, SCHEMA-PHRASESUGGEST.XML, BAD-SCHEMA-DUP-DYNAMICFIELD.XML, SOLRCONFIG-PROPINJECT-INDEXDEFAULT.XML, STOPWORDS.TXT, BAD-SCHEMA-CURRENCY-DYNAMIC-MULTIVALUED.XML, ADDFIELDS.UPDATEPROCESSOR.JS, SOLRCONFIG-MASTER2.XML, JASUGGEST.TXT, DA_COMPOUNDDICTIONARY.TXT, SOLRCONFIG-QUERYSENDER.XML, BAD-SOLRCONFIG-BOGUS-SCRIPTENGINE-NAME.XML, SOLRCONFIG-UPDATE-PROCESSOR-CHAINS.XML, OLD_SYNONYMS.TXT, SOLRCONFIG-REQHANDLER.INCL, PHRASESUGGEST.TXT, BAD-SCHEMA-NOT-INDEXED-BUT-TF.XML, SCHEMA-NOT-REQUIRED-UNIQUE-KEY.XML, SOLRCONFIG-DELPOLICY2.XML, SOLRCONFIG-TERMINDEX.XML, SCHEMA-SPATIAL.XML, BAD-SCHEMA-DUP-FIELDTYPE.XML, SCHEMA-DFR.XML, BAD-SCHEMA-UNIQUEKEY-USES-DEFAULT.XML, SCHEMA15.XML, SCHEMA-REQUIRED-FIELDS.XML, SOLRCONFIG-FUNCTIONQUERY.XML, SOLRCONFIG-SOLCOREPROPERTIES.XML, SCHEMA12.XML, SCHEMA-TFIDF.XML, OPEN-EXCHANGE-RATES.JSON, HYPHENATION.DTD, SCHEMASURROUND.XML, SOLRCONFIG-ALTDIRECTORY.XML, SOLRCONFIG-SLAVE.XML, SOLRCONFIG-MERGEPOLICY.XML, BAD-SOLRCONFIG-MISSING-SCRIPTFILE.XML, BAD-SCHEMA-CURRENCY-FT-MULTIVALUED.XML, SCHEMA-SNIPPET-FIELD.XML, SCHEMA-MINIMAL.XML, SCHEMA11.XML, SCHEMA_CODEC.XML, SCHEMA.XML, SOLRCONFIG-SLAVE1.XML, SCHEMA-SNIPPET-TYPE.XML, SCHEMA-TRIE.XML, BAD-SCHEMA-CURRENCY-MULTIVALUED.XML, SOLRCONFIG-MASTER.XML, STOPTYPES-2.TXT, KEEP-1.TXT, SOLRCONFIG-MASTER3.XML, SOLRCONFIG-SNIPPET-PROCESSOR.XML, SCHEMA-COLLATE.XML, SOLRCONFIG-DELPOLICY1.XML, WDFTYPES.TXT, SCHEMA-CHARFILTERS.XML, SOLRCONFIG-MASTER1.XML, STOPWORDSWRONGENCODING.TXT, SOLRCONFIG-HIGHLIGHT.XML, SOLRCONFIG-TLOG.XML, SCHEMA-BEHAVIOR.XML, CONDITIONAL.UPDATEPROCESSOR.JS, TRIVIAL.UPDATEPROCESSOR1.JS, SCHEMA-SIM.XML, DA_UTF8.XML, STOP-SNOWBALL.TXT, STOPWITHBOM.TXT, BAD-SCHEMA-CODEC-GLOBAL-VS-FT-MISMATCH.XML, SOLRCONFIG-SIMPLELOCK.XML, SCHEMA-REVERSED.XML, SCHEMA-REPLICATION2.XML, BAD_SOLRCONFIG.XML, SOLRCONFIG-LAZYWRITER.XML, SCHEMA-REPLICATION1.XML, SOLRCONFIG-SOLR-749.XML, THROW.ERROR.ON.ADD.UPDATEPROCESSOR.JS, SOLRCONFIG-INDEXCONFIG.XML, SOLRCONFIG_CODEC.XML, SOLRCONFIG-RESPONSE-LOG-COMPONENT.XML, PROTWORDS.TXT, SOLRCONFIG-MASTER1-KEEPONEBACKUP.XML, SOLRCONFIG-REPEATER.XML, MISSLEADING.EXTENSION.UPDATEPROCESSOR.JS.TXT, FRENCHARTICLES.TXT, MISSING.FUNCTIONS.UPDATEPROCESSOR.JS, SCHEMA-FOLDING.XML, SCHEMA-NUMERIC.XML, SOLRCONFIG_PERF.XML, SOLRCONFIG-PROPINJECT.XML, TRIVIAL.UPDATEPROCESSOR0.JS, SCHEMA-COLLATEFILTER.XML, BAD-SCHEMA-NOT-INDEXED-BUT-NORMS.XML, SCHEMA-LUCENEMATCHVERSION.XML, KEEP-2.TXT, SOLRCONFIG-SPELLCHECKER.XML, BAD-SCHEMA-DUP-FIELD.XML, SOLRCONFIG-TRANSFORMERS.XML, SOLRCONFIG-PHRASESUGGEST.XML, BAD-SCHEMA-SIM-GLOBAL-VS-FT-MISMATCH.XML, HUNSPELL-TEST.AFF, SCHEMA-IB.XML]
[junit4:junit4]   2> 516 T267 oasc.CachingDirectoryFactory.close Releasing directory:/mnt/ssd/jenkins/workspace/Lucene-Solr-4.x-Linux/solr/build/solr-core/test/J1/./org.apache.solr.TestDistributedGrouping-1355882546117/control/data
[junit4:junit4]   2> 516 T267 oass.SolrIndexSearcher.<init> Opening Searcher@5ccac201 main
[junit4:junit4]   2> 517 T267 oasu.CommitTracker.<init> Hard AutoCommit: disabled
[junit4:junit4]   2> 517 T267 oasu.CommitTracker.<init> Soft AutoCommit: disabled
[junit4:junit4]   2> 517 T267 oashc.SpellCheckComponent.inform Initializing spell checkers
[junit4:junit4]   2> 521 T267 oass.DirectSolrSpellChecker.init init: {name=direct,classname=DirectSolrSpellChecker,field=lowerfilt,minQueryLength=3}
[junit4:junit4]   2> 539 T268 oasc.SolrCore.registerSearcher [collection1] Registered new searcher Searcher@5ccac201 main{StandardDirectoryReader(segments_1:1)}
[junit4:junit4]   2> 541 T267 oasc.CoreContainer.registerCore registering core: collection1
[junit4:junit4]   2> 542 T257 oass.SolrDispatchFilter.init user.dir=/mnt/ssd/jenkins/workspace/Lucene-Solr-4.x-Linux/solr/build/solr-core/test/J1
[junit4:junit4]   2> 542 T257 oass.SolrDispatchFilter.init SolrDispatchFilter.init() done
[junit4:junit4]   2> 542 T257 oascsi.HttpClientUtil.createClient Creating new http client, config:maxConnections=128&maxConnectionsPerHost=32&followRedirects=false
[junit4:junit4]   2> 546 T257 oejs.Server.doStart jetty-8.1.8.v20121106
[junit4:junit4]   2> 549 T257 oejs.AbstractConnector.doStart Started SelectChannelConnector@127.0.0.1:33418
[junit4:junit4]   2> 550 T257 oasc.SolrResourceLoader.locateSolrHome JNDI not configured for solr (NoInitialContextEx)
[junit4:junit4]   2> 551 T257 oasc.SolrResourceLoader.locateSolrHome using system property solr.solr.home: /mnt/ssd/jenkins/workspace/Lucene-Solr-4.x-Linux/solr/build/solr-core/test-files/solr
[junit4:junit4]   2> 551 T257 oasc.SolrResourceLoader.<init> new SolrResourceLoader for deduced Solr Home: '/mnt/ssd/jenkins/workspace/Lucene-Solr-4.x-Linux/solr/build/solr-core/test-files/solr/'
[junit4:junit4]   2> 569 T257 oass.SolrDispatchFilter.init SolrDispatchFilter.init()
[junit4:junit4]   2> 570 T257 oasc.SolrResourceLoader.locateSolrHome JNDI not configured for solr (NoInitialContextEx)
[junit4:junit4]   2> 571 T257 oasc.SolrResourceLoader.locateSolrHome using system property solr.solr.home: /mnt/ssd/jenkins/workspace/Lucene-Solr-4.x-Linux/solr/build/solr-core/test-files/solr
[junit4:junit4]   2> 571 T257 oasc.CoreContainer$Initializer.initialize looking for solr.xml: /mnt/ssd/jenkins/workspace/Lucene-Solr-4.x-Linux/solr/build/solr-core/test-files/solr/solr.xml
[junit4:junit4]   2> 571 T257 oasc.CoreContainer.<init> New CoreContainer 1442666266
[junit4:junit4]   2> 572 T257 oasc.CoreContainer.load Loading CoreContainer using Solr Home: '/mnt/ssd/jenkins/workspace/Lucene-Solr-4.x-Linux/solr/build/solr-core/test-files/solr/'
[junit4:junit4]   2> 572 T257 oasc.SolrResourceLoader.<init> new SolrResourceLoader for directory: '/mnt/ssd/jenkins/workspace/Lucene-Solr-4.x-Linux/solr/build/solr-core/test-files/solr/'
[junit4:junit4]   2> 589 T257 oashc.HttpShardHandlerFactory.getParameter Setting socketTimeout to: 30000
[junit4:junit4]   2> 590 T257 oashc.HttpShardHandlerFactory.getParameter Setting urlScheme to: http://
[junit4:junit4]   2> 590 T257 oashc.HttpShardHandlerFactory.getParameter Setting connTimeout to: 15000
[junit4:junit4]   2> 591 T257 oashc.HttpShardHandlerFactory.getParameter Setting maxConnectionsPerHost to: 20
[junit4:junit4]   2> 591 T257 oashc.HttpShardHandlerFactory.getParameter Setting corePoolSize to: 0
[junit4:junit4]   2> 592 T257 oashc.HttpShardHandlerFactory.getParameter Setting maximumPoolSize to: 2147483647
[junit4:junit4]   2> 592 T257 oashc.HttpShardHandlerFactory.getParameter Setting maxThreadIdleTime to: 5
[junit4:junit4]   2> 593 T257 oashc.HttpShardHandlerFactory.getParameter Setting sizeOfQueue to: -1
[junit4:junit4]   2> 593 T257 oashc.HttpShardHandlerFactory.getParameter Setting fairnessPolicy to: false
[junit4:junit4]   2> 594 T257 oascsi.HttpClientUtil.createClient Creating new http client, config:maxConnectionsPerHost=20&maxConnections=10000&socketTimeout=30000&connTimeout=15000&retry=false
[junit4:junit4]   2> 601 T257 oasc.CoreContainer.load Registering Log Listener
[junit4:junit4]   2> 616 T278 oasc.CoreContainer.create Creating SolrCore 'collection1' using instanceDir: /mnt/ssd/jenkins/workspace/Lucene-Solr-4.x-Linux/solr/build/solr-core/test-files/solr/collection1
[junit4:junit4]   2> 617 T278 oasc.SolrResourceLoader.<init> new SolrResourceLoader for directory: '/mnt/ssd/jenkins/workspace/Lucene-Solr-4.x-Linux/solr/build/solr-core/test-files/solr/collection1/'
[junit4:junit4]   2> 617 T278 oasc.SolrResourceLoader.replaceClassLoader Adding 'file:/mnt/ssd/jenkins/workspace/Lucene-Solr-4.x-Linux/solr/build/solr-core/test-files/solr/collection1/lib/README' to classloader
[junit4:junit4]   2> 618 T278 oasc.SolrResourceLoader.replaceClassLoader Adding 'file:/mnt/ssd/jenkins/workspace/Lucene-Solr-4.x-Linux/solr/build/solr-core/test-files/solr/collection1/lib/classes/' to classloader
[junit4:junit4]   2> 655 T278 oasc.SolrConfig.<init> Using Lucene MatchVersion: LUCENE_41
[junit4:junit4]   2> 689 T278 oasc.SolrConfig.<init> Loaded SolrConfig: solrconfig.xml
[junit4:junit4]   2> 689 T278 oass.IndexSchema.readSchema Reading Solr Schema
[junit4:junit4]   2> 693 T278 oass.IndexSchema.readSchema Schema name=test
[junit4:junit4]   2> 993 T278 oass.OpenExchangeRatesOrgProvider.init Initialized with rates=open-exchange-rates.json, refreshInterval=1440.
[junit4:junit4]   2> 998 T278 oass.IndexSchema.readSchema default search field in schema is text
[junit4:junit4]   2> 1000 T278 oass.IndexSchema.readSchema unique key field: id
[junit4:junit4]   2> 1004 T278 oass.FileExchangeRateProvider.reload Reloading exchange rates from file currency.xml
[junit4:junit4]   2> 1006 T278 oass.FileExchangeRateProvider.reload Reloading exchange rates from file currency.xml
[junit4:junit4]   2> 1009 T278 oass.OpenExchangeRatesOrgProvider.reload Reloading exchange rates from open-exchange-rates.json
[junit4:junit4]   2> 1009 T278 oass.OpenExchangeRatesOrgProvider.reload Reloading exchange rates from open-exchange-rates.json
[junit4:junit4]   2> 1009 T278 oasc.SolrCore.<init> [collection1] Opening new SolrCore at /mnt/ssd/jenkins/workspace/Lucene-Solr-4.x-Linux/solr/build/solr-core/test-files/solr/collection1/, dataDir=./org.apache.solr.TestDistributedGrouping-1355882546117/shard0/data/
[junit4:junit4]   2> 1010 T278 oasc.JmxMonitoredMap.<init> JMX monitoring is enabled. Adding Solr mbeans to JMX Server: com.sun.jmx.mbeanserver.JmxMBeanServer@4bb807ac
[junit4:junit4]   2> 1010 T278 oasc.SolrCore.initDirectoryFactory org.apache.solr.core.MockDirectoryFactory
[junit4:junit4]   2> 1010 T278 oasc.CachingDirectoryFactory.get return new directory for /mnt/ssd/jenkins/workspace/Lucene-Solr-4.x-Linux/solr/build/solr-core/test/J1/./org.apache.solr.TestDistributedGrouping-1355882546117/shard0/data forceNew:false
[junit4:junit4]   2> 1011 T278 oasc.CachingDirectoryFactory.close Releasing directory:/mnt/ssd/jenkins/workspace/Lucene-Solr-4.x-Linux/solr/build/solr-core/test/J1/./org.apache.solr.TestDistributedGrouping-1355882546117/shard0/data
[junit4:junit4]   2> 1011 T278 oasc.SolrCore.getNewIndexDir New index directory detected: old=null new=./org.apache.solr.TestDistributedGrouping-1355882546117/shard0/data/index/
[junit4:junit4]   2> 1011 T278 oasc.SolrCore.initIndex WARNING [collection1] Solr index directory './org.apache.solr.TestDistributedGrouping-1355882546117/shard0/data/index' doesn't exist. Creating new index...
[junit4:junit4]   2> 1012 T278 oasc.CachingDirectoryFactory.get return new directory for /mnt/ssd/jenkins/workspace/Lucene-Solr-4.x-Linux/solr/build/solr-core/test/J1/./org.apache.solr.TestDistributedGrouping-1355882546117/shard0/data/index forceNew:false
[junit4:junit4]   2> 1013 T278 oasc.SolrDeletionPolicy.onCommit SolrDeletionPolicy.onCommit: commits:num=1
[junit4:junit4]   2> 		commit{dir=RateLimitedDirectoryWrapper(MockDirWrapper(org.apache.lucene.store.RAMDirectory@9620413 lockFactory=org.apache.lucene.store.NativeFSLockFactory@23501896)),segFN=segments_1,generation=1,filenames=[segments_1]
[junit4:junit4]   2> 1013 T278 oasc.SolrDeletionPolicy.updateCommits newest commit = 1[segments_1]
[junit4:junit4]   2> 1013 T278 oasc.CachingDirectoryFactory.close Releasing directory:/mnt/ssd/jenkins/workspace/Lucene-Solr-4.x-Linux/solr/build/solr-core/test/J1/./org.apache.solr.TestDistributedGrouping-1355882546117/shard0/data/index
[junit4:junit4]   2> 1014 T278 oasc.SolrCore.initWriters created xml: solr.XMLResponseWriter
[junit4:junit4]   2> 1015 T278 oasup.UpdateRequestProcessorChain.init inserting DistributedUpdateProcessorFactory into updateRequestProcessorChain "dedupe"
[junit4:junit4]   2> 1015 T278 oasup.UpdateRequestProcessorChain.init inserting DistributedUpdateProcessorFactory into updateRequestProcessorChain "dedupe-allfields"
[junit4:junit4]   2> 1016 T278 oasup.UpdateRequestProcessorChain.init inserting DistributedUpdateProcessorFactory into updateRequestProcessorChain "stored_sig"
[junit4:junit4]   2> 1016 T278 oasup.UpdateRequestProcessorChain.init inserting DistributedUpdateProcessorFactory into updateRequestProcessorChain "uniq-fields"
[junit4:junit4]   2> 1016 T278 oasup.UpdateRequestProcessorChain.init inserting DistributedUpdateProcessorFactory into updateRequestProcessorChain "distrib-dup-test-chain-implicit"
[junit4:junit4]   2> 1016 T278 oasc.RequestHandlers.initHandlersFromConfig adding lazy requestHandler: solr.ReplicationHandler
[junit4:junit4]   2> 1017 T278 oasc.RequestHandlers.initHandlersFromConfig created /replication: solr.ReplicationHandler
[junit4:junit4]   2> 1017 T278 oasc.RequestHandlers.initHandlersFromConfig created standard: solr.StandardRequestHandler
[junit4:junit4]   2> 1018 T278 oasc.RequestHandlers.initHandlersFromConfig created /get: solr.RealTimeGetHandler
[junit4:junit4]   2> 1019 T278 oasc.RequestHandlers.initHandlersFromConfig created dismax: solr.SearchHandler
[junit4:junit4]   2> 1019 T278 oasc.RequestHandlers.initHandlersFromConfig created mock: org.apache.solr.core.MockQuerySenderListenerReqHandler
[junit4:junit4]   2> 1019 T278 oasc.RequestHandlers.initHandlersFromConfig created /admin/: org.apache.solr.handler.admin.AdminHandlers
[junit4:junit4]   2> 1020 T278 oasc.RequestHandlers.initHandlersFromConfig created defaults: solr.StandardRequestHandler
[junit4:junit4]   2> 1020 T278 oasc.RequestHandlers.initHandlersFromConfig adding lazy requestHandler: solr.StandardRequestHandler
[junit4:junit4]   2> 1020 T278 oasc.RequestHandlers.initHandlersFromConfig created lazy: solr.StandardRequestHandler
[junit4:junit4]   2> 1021 T278 oasc.RequestHandlers.initHandlersFromConfig created /update: solr.UpdateRequestHandler
[junit4:junit4]   2> 1021 T278 oasc.RequestHandlers.initHandlersFromConfig created /terms: org.apache.solr.handler.component.SearchHandler
[junit4:junit4]   2> 1022 T278 oasc.RequestHandlers.initHandlersFromConfig created spellCheckCompRH: org.apache.solr.handler.component.SearchHandler
[junit4:junit4]   2> 1022 T278 oasc.RequestHandlers.initHandlersFromConfig created spellCheckCompRH_Direct: org.apache.solr.handler.component.SearchHandler
[junit4:junit4]   2> 1023 T278 oasc.RequestHandlers.initHandlersFromConfig created spellCheckWithWordbreak: org.apache.solr.handler.component.SearchHandler
[junit4:junit4]   2> 1023 T278 oasc.RequestHandlers.initHandlersFromConfig created spellCheckWithWordbreak_Direct: org.apache.solr.handler.component.SearchHandler
[junit4:junit4]   2> 1024 T278 oasc.RequestHandlers.initHandlersFromConfig created spellCheckCompRH1: org.apache.solr.handler.component.SearchHandler
[junit4:junit4]   2> 1024 T278 oasc.RequestHandlers.initHandlersFromConfig created mltrh: org.apache.solr.handler.component.SearchHandler
[junit4:junit4]   2> 1025 T278 oasc.RequestHandlers.initHandlersFromConfig created tvrh: org.apache.solr.handler.component.SearchHandler
[junit4:junit4]   2> 1025 T278 oasc.RequestHandlers.initHandlersFromConfig created /mlt: solr.MoreLikeThisHandler
[junit4:junit4]   2> 1026 T278 oasc.RequestHandlers.initHandlersFromConfig created /debug/dump: solr.DumpRequestHandler
[junit4:junit4]   2> 1028 T278 oashl.XMLLoader.init xsltCacheLifetimeSeconds=60
[junit4:junit4]   2> 1029 T278 oasc.SolrCore.initDeprecatedSupport WARNING solrconfig.xml uses deprecated <admin/gettableFiles>, Please update your config to use the ShowFileRequestHandler.
[junit4:junit4]   2> 1030 T278 oasc.SolrCore.initDeprecatedSupport WARNING adding ShowFileRequestHandler with hidden files: [BAD-SCHEMA-EXTERNAL-FILEFIELD.XML, SCHEMA-COPYFIELD-TEST.XML, SOLRCONFIG-BASIC-LUCENEVERSION31.XML, SCHEMA-SPELLCHECKER.XML, SOLRCONFIG-BASIC.XML, SCHEMA-EFF.XML, SCHEMA-LMDIRICHLET.XML, ELEVATE.XML, SOLRCONFIG-NATIVELOCK.XML, BAD-SCHEMA-OMIT-TF-BUT-NOT-POS.XML, BAD-SCHEMA-ANALYZER-CLASS-AND-NESTED.XML, FUZZYSUGGEST.TXT, COMPOUNDDICTIONARY.TXT, STOPTYPES-1.TXT, STEMDICT.TXT, SOLRCONFIG-ENABLEPLUGIN.XML, SOLRCONFIG-SCRIPT-UPDATEPROCESSOR.XML, HUNSPELL-TEST.DIC, SOLRCONFIG-ELEVATE.XML, SCHEMA-BINARYFIELD.XML, STOP-2.TXT, BAD-SCHEMA-UNIQUEKEY-IS-COPYFIELD-DEST.XML, BAD-SOLRCONFIG-INVALID-SCRIPTFILE.XML, STOP-1.TXT, XSLT, BAD-SCHEMA-NONTEXT-ANALYZER.XML, CURRENCY.XML, SCHEMA-STOP-KEEP.XML, SCHEMA-XINCLUDE.XML, BAD-SCHEMA-UNIQUEKEY-MULTIVALUED.XML, MAPPING-ISOLATIN1ACCENT.TXT, BAD-MP-SOLRCONFIG.XML, SOLRCONFIG-SPELLCHECKCOMPONENT.XML, SOLRCONFIG-CACHING.XML, SOLRCONFIG-NOCACHE.XML, SOLRCONFIG-XINCLUDE.XML, SYNONYMS.TXT, SCHEMA-LMJELINEKMERCER.XML, BAD-SCHEMA-NOT-INDEXED-BUT-POS.XML, SCHEMA-BM25.XML, SOLRCONFIG-QUERYSENDER-NOQUERY.XML, SCHEMA-PHRASESUGGEST.XML, BAD-SCHEMA-DUP-DYNAMICFIELD.XML, SOLRCONFIG-PROPINJECT-INDEXDEFAULT.XML, STOPWORDS.TXT, BAD-SCHEMA-CURRENCY-DYNAMIC-MULTIVALUED.XML, ADDFIELDS.UPDATEPROCESSOR.JS, SOLRCONFIG-MASTER2.XML, JASUGGEST.TXT, DA_COMPOUNDDICTIONARY.TXT, SOLRCONFIG-QUERYSENDER.XML, BAD-SOLRCONFIG-BOGUS-SCRIPTENGINE-NAME.XML, SOLRCONFIG-UPDATE-PROCESSOR-CHAINS.XML, OLD_SYNONYMS.TXT, SOLRCONFIG-REQHANDLER.INCL, PHRASESUGGEST.TXT, BAD-SCHEMA-NOT-INDEXED-BUT-TF.XML, SCHEMA-NOT-REQUIRED-UNIQUE-KEY.XML, SOLRCONFIG-DELPOLICY2.XML, SOLRCONFIG-TERMINDEX.XML, SCHEMA-SPATIAL.XML, BAD-SCHEMA-DUP-FIELDTYPE.XML, SCHEMA-DFR.XML, BAD-SCHEMA-UNIQUEKEY-USES-DEFAULT.XML, SCHEMA15.XML, SCHEMA-REQUIRED-FIELDS.XML, SOLRCONFIG-FUNCTIONQUERY.XML, SOLRCONFIG-SOLCOREPROPERTIES.XML, SCHEMA12.XML, SCHEMA-TFIDF.XML, OPEN-EXCHANGE-RATES.JSON, HYPHENATION.DTD, SCHEMASURROUND.XML, SOLRCONFIG-ALTDIRECTORY.XML, SOLRCONFIG-SLAVE.XML, SOLRCONFIG-MERGEPOLICY.XML, BAD-SOLRCONFIG-MISSING-SCRIPTFILE.XML, BAD-SCHEMA-CURRENCY-FT-MULTIVALUED.XML, SCHEMA-SNIPPET-FIELD.XML, SCHEMA-MINIMAL.XML, SCHEMA11.XML, SCHEMA_CODEC.XML, SCHEMA.XML, SOLRCONFIG-SLAVE1.XML, SCHEMA-SNIPPET-TYPE.XML, SCHEMA-TRIE.XML, BAD-SCHEMA-CURRENCY-MULTIVALUED.XML, SOLRCONFIG-MASTER.XML, STOPTYPES-2.TXT, KEEP-1.TXT, SOLRCONFIG-MASTER3.XML, SOLRCONFIG-SNIPPET-PROCESSOR.XML, SCHEMA-COLLATE.XML, SOLRCONFIG-DELPOLICY1.XML, WDFTYPES.TXT, SCHEMA-CHARFILTERS.XML, SOLRCONFIG-MASTER1.XML, STOPWORDSWRONGENCODING.TXT, SOLRCONFIG-HIGHLIGHT.XML, SOLRCONFIG-TLOG.XML, SCHEMA-BEHAVIOR.XML, CONDITIONAL.UPDATEPROCESSOR.JS, TRIVIAL.UPDATEPROCESSOR1.JS, SCHEMA-SIM.XML, DA_UTF8.XML, STOP-SNOWBALL.TXT, STOPWITHBOM.TXT, BAD-SCHEMA-CODEC-GLOBAL-VS-FT-MISMATCH.XML, SOLRCONFIG-SIMPLELOCK.XML, SCHEMA-REVERSED.XML, SCHEMA-REPLICATION2.XML, BAD_SOLRCONFIG.XML, SOLRCONFIG-LAZYWRITER.XML, SCHEMA-REPLICATION1.XML, SOLRCONFIG-SOLR-749.XML, THROW.ERROR.ON.ADD.UPDATEPROCESSOR.JS, SOLRCONFIG-INDEXCONFIG.XML, SOLRCONFIG_CODEC.XML, SOLRCONFIG-RESPONSE-LOG-COMPONENT.XML, PROTWORDS.TXT, SOLRCONFIG-MASTER1-KEEPONEBACKUP.XML, SOLRCONFIG-REPEATER.XML, MISSLEADING.EXTENSION.UPDATEPROCESSOR.JS.TXT, FRENCHARTICLES.TXT, MISSING.FUNCTIONS.UPDATEPROCESSOR.JS, SCHEMA-FOLDING.XML, SCHEMA-NUMERIC.XML, SOLRCONFIG_PERF.XML, SOLRCONFIG-PROPINJECT.XML, TRIVIAL.UPDATEPROCESSOR0.JS, SCHEMA-COLLATEFILTER.XML, BAD-SCHEMA-NOT-INDEXED-BUT-NORMS.XML, SCHEMA-LUCENEMATCHVERSION.XML, KEEP-2.TXT, SOLRCONFIG-SPELLCHECKER.XML, BAD-SCHEMA-DUP-FIELD.XML, SOLRCONFIG-TRANSFORMERS.XML, SOLRCONFIG-PHRASESUGGEST.XML, BAD-SCHEMA-SIM-GLOBAL-VS-FT-MISMATCH.XML, HUNSPELL-TEST.AFF, SCHEMA-IB.XML]
[junit4:junit4]   2> 1032 T278 oasc.CachingDirectoryFactory.close Releasing directory:/mnt/ssd/jenkins/workspace/Lucene-Solr-4.x-Linux/solr/build/solr-core/test/J1/./org.apache.solr.TestDistributedGrouping-1355882546117/shard0/data
[junit4:junit4]   2> 1032 T278 oass.SolrIndexSearcher.<init> Opening Searcher@184c4ddb main
[junit4:junit4]   2> 1033 T278 oasu.CommitTracker.<init> Hard AutoCommit: disabled
[junit4:junit4]   2> 1033 T278 oasu.CommitTracker.<init> Soft AutoCommit: disabled
[junit4:junit4]   2> 1034 T278 oashc.SpellCheckComponent.inform Initializing spell checkers
[junit4:junit4]   2> 1037 T278 oass.DirectSolrSpellChecker.init init: {name=direct,classname=DirectSolrSpellChecker,field=lowerfilt,minQueryLength=3}
[junit4:junit4]   2> 1071 T279 oasc.SolrCore.registerSearcher [collection1] Registered new searcher Searcher@184c4ddb main{StandardDirectoryReader(segments_1:1)}
[junit4:junit4]   2> 1074 T278 oasc.CoreContainer.registerCore registering core: collection1
[junit4:junit4]   2> 1075 T257 oass.SolrDispatchFilter.init user.dir=/mnt/ssd/jenkins/workspace/Lucene-Solr-4.x-Linux/solr/build/solr-core/test/J1
[junit4:junit4]   2> 1075 T257 oass.SolrDispatchFilter.init SolrDispatchFilter.init() done
[junit4:junit4]   2> 1075 T257 oascsi.HttpClientUtil.createClient Creating new http client, config:maxConnections=128&maxConnectionsPerHost=32&followRedirects=false
[junit4:junit4]   2> ASYNC  NEW_CORE C15 name=collection1 org.apache.solr.core.SolrCore@6bf22341
[junit4:junit4]   2> 1083 T265 C15 oasu.DirectUpdateHandler2.deleteAll [collection1] REMOVING ALL DOCUMENTS FROM INDEX
[junit4:junit4]   2> 1084 T265 C15 oasc.CachingDirectoryFactory.close Releasing directory:/mnt/ssd/jenkins/workspace/Lucene-Solr-4.x-Linux/solr/build/solr-core/test/J1/./org.apache.solr.TestDistributedGrouping-1355882546117/control/data
[junit4:junit4]   2> 1085 T265 C15 oasc.SolrDeletionPolicy.onInit SolrDeletionPolicy.onInit: commits:num=1
[junit4:junit4]   2> 		commit{dir=RateLimitedDirectoryWrapper(MockDirWrapper(org.apache.lucene.store.RAMDirectory@e59a459 lockFactory=org.apache.lucene.store.NativeFSLockFactory@45e91ace)),segFN=segments_1,generation=1,filenames=[segments_1]
[junit4:junit4]   2> 1086 T265 C15 oasc.SolrDeletionPolicy.updateCommits newest commit = 1[segments_1]
[junit4:junit4]   2> 1086 T265 C15 UPDATE [collection1] webapp=/ldtfh/i path=/update params={version=2&wt=javabin} {deleteByQuery=*:*} 0 3
[junit4:junit4]   2> ASYNC  NEW_CORE C16 name=collection1 org.apache.solr.core.SolrCore@48d17ce7
[junit4:junit4]   2> 1092 T277 C16 oasu.DirectUpdateHandler2.deleteAll [collection1] REMOVING ALL DOCUMENTS FROM INDEX
[junit4:junit4]   2> 1093 T277 C16 oasc.CachingDirectoryFactory.close Releasing directory:/mnt/ssd/jenkins/workspace/Lucene-Solr-4.x-Linux/solr/build/solr-core/test/J1/./org.apache.solr.TestDistributedGrouping-1355882546117/shard0/data
[junit4:junit4]   2> 1095 T277 C16 oasc.SolrDeletionPolicy.onInit SolrDeletionPolicy.onInit: commits:num=1
[junit4:junit4]   2> 		commit{dir=RateLimitedDirectoryWrapper(MockDirWrapper(org.apache.lucene.store.RAMDirectory@9620413 lockFactory=org.apache.lucene.store.NativeFSLockFactory@23501896)),segFN=segments_1,generation=1,filenames=[segments_1]
[junit4:junit4]   2> 1095 T277 C16 oasc.SolrDeletionPolicy.updateCommits newest commit = 1[segments_1]
[junit4:junit4]   2> 1096 T277 C16 UPDATE [collection1] webapp=/ldtfh/i path=/update params={version=2&wt=javabin} {deleteByQuery=*:*} 0 4
[junit4:junit4]   2> 1100 T266 C15 oasu.DirectUpdateHandler2.commit start commit{flags=0,_version_=0,optimize=false,openSearcher=true,waitSearcher=true,expungeDeletes=false,softCommit=false}
[junit4:junit4]   2> 1101 T266 C15 oasc.SolrDeletionPolicy.onCommit SolrDeletionPolicy.onCommit: commits:num=2
[junit4:junit4]   2> 		commit{dir=RateLimitedDirectoryWrapper(MockDirWrapper(org.apache.lucene.store.RAMDirectory@e59a459 lockFactory=org.apache.lucene.store.NativeFSLockFactory@45e91ace)),segFN=segments_1,generation=1,filenames=[segments_1]
[junit4:junit4]   2> 		commit{dir=RateLimitedDirectoryWrapper(MockDirWrapper(org.apache.lucene.store.RAMDirectory@e59a459 lockFactory=org.apache.lucene.store.NativeFSLockFactory@45e91ace)),segFN=segments_2,generation=2,filenames=[segments_2]
[junit4:junit4]   2> 1101 T266 C15 oasc.SolrDeletionPolicy.updateCommits newest commit = 2[segments_2]
[junit4:junit4]   2> 1102 T266 C15 oasc.CachingDirectoryFactory.close Releasing directory:/mnt/ssd/jenkins/workspace/Lucene-Solr-4.x-Linux/solr/build/solr-core/test/J1/./org.apache.solr.TestDistributedGrouping-1355882546117/control/data
[junit4:junit4]   2> 1102 T266 C15 oass.SolrIndexSearcher.<init> Opening Searcher@350d4df5 main
[junit4:junit4]   2> 1102 T266 C15 oasu.DirectUpdateHandler2.commit end_commit_flush
[junit4:junit4]   2> 1103 T268 oasc.SolrCore.registerSearcher [collection1] Registered new searcher Searcher@350d4df5 main{StandardDirectoryReader(segments_2:2)}
[junit4:junit4]   2> 1104 T268 oasc.CachingDirectoryFactory.close Releasing directory:/mnt/ssd/jenkins/workspace/Lucene-Solr-4.x-Linux/solr/build/solr-core/test/J1/./org.apache.solr.TestDistributedGrouping-1355882546117/control/data/index
[junit4:junit4]   2> 1104 T266 C15 UPDATE [collection1] webapp=/ldtfh/i path=/update params={version=2&softCommit=false&commit=true&waitSearcher=true&wt=javabin} {commit=} 0 4
[junit4:junit4]   2> 1107 T275 C16 oasu.DirectUpdateHandler2.commit start commit{flags=0,_version_=0,optimize=false,openSearcher=true,waitSearcher=true,expungeDeletes=false,softCommit=false}
[junit4:junit4]   2> 1108 T275 C16 oasc.SolrDeletionPolicy.onCommit SolrDeletionPolicy.onCommit: commits:num=2
[junit4:junit4]   2> 		commit{dir=RateLimitedDirectoryWrapper(MockDirWrapper(org.apache.lucene.store.RAMDirectory@9620413 lockFactory=org.apache.lucene.store.NativeFSLockFactory@23501896)),segFN=segments_1,generation=1,filenames=[segments_1]
[junit4:junit4]   2> 		commit{dir=RateLimitedDirectoryWrapper(MockDirWrapper(org.apache.lucene.store.RAMDirectory@9620413 lockFactory=org.apache.lucene.store.NativeFSLockFactory@23501896)),segFN=segments_2,generation=2,filenames=[segments_2]
[junit4:junit4]   2> 1108 T275 C16 oasc.SolrDeletionPolicy.updateCommits newest commit = 2[segments_2]
[junit4:junit4]   2> 1109 T275 C16 oasc.CachingDirectoryFactory.close Releasing directory:/mnt/ssd/jenkins/workspace/Lucene-Solr-4.x-Linux/solr/build/solr-core/test/J1/./org.apache.solr.TestDistributedGrouping-1355882546117/shard0/data
[junit4:junit4]   2> 1109 T275 C16 oass.SolrIndexSearcher.<init> Opening Searcher@70a0f215 main
[junit4:junit4]   2> 1110 T275 C16 oasu.DirectUpdateHandler2.commit end_commit_flush
[junit4:junit4]   2> 1110 T279 oasc.SolrCore.registerSearcher [collection1] Registered new searcher Searcher@70a0f215 main{StandardDirectoryReader(segments_2:2)}
[junit4:junit4]   2> 1111 T279 oasc.CachingDirectoryFactory.close Releasing directory:/mnt/ssd/jenkins/workspace/Lucene-Solr-4.x-Linux/solr/build/solr-core/test/J1/./org.apache.solr.TestDistributedGrouping-1355882546117/shard0/data/index
[junit4:junit4]   2> 1111 T275 C16 UPDATE [collection1] webapp=/ldtfh/i path=/update params={version=2&softCommit=false&commit=true&waitSearcher=true&wt=javabin} {commit=} 0 4
[junit4:junit4]   2> 1144 T263 C15 REQ [collection1] webapp=/ldtfh/i path=/select params={sort=a_si+asc,+id+asc&group.field=a_si&group.limit=10&q=*:*&rows=100&fl=id,a_si&group=true&version=2&distrib=false&wt=javabin} hits=0 status=0 QTime=30 
[junit4:junit4]   2> 1169 T276 C16 REQ [collection1] webapp=/ldtfh/i path=/select params={sort=a_si+asc,+id+asc&group.field=a_si&group.limit=10&group.distributed.first=true&NOW=1355882547257&wt=javabin&start=0&q=*:*&rows=100&group=true&fl=id&version=2&distrib=false&shard.url=[ff01::213]:33332/ldtfh/i|127.0.0.1:33418/ldtfh/i&isShard=true} status=0 QTime=15 
[junit4:junit4]   2> 1182 T274 C16 REQ [collection1] webapp=/ldtfh/i path=/select params={sort=a_si+asc,+id+asc&group.field=a_si&group.limit=10&shards=[ff01::213]:33332/ldtfh/i|127.0.0.1:33418/ldtfh/i&q=*:*&rows=100&fl=id,a_si&group=true&version=2&wt=javabin} status=0 QTime=33 
[junit4:junit4]   2> 1200 T264 C15 REQ [collection1] webapp=/ldtfh/i path=/select params={sort=a_si+asc,+id+asc&hl.fl=a_t&group.field=a_si&group.limit=10&hl=true&wt=javabin&q=*:*&rows=100&fl=id,a_si&group=true&version=2&distrib=false} hits=0 status=0 QTime=15 
[junit4:junit4]   2> 1206 T275 C16 REQ [collection1] webapp=/ldtfh/i path=/select params={sort=a_si+asc,+id+asc&hl.fl=a_t&group.field=a_si&group.limit=10&hl=false&group.distributed.first=true&NOW=1355882547311&wt=javabin&q=*:*&start=0&rows=100&fl=id&group=true&version=2&distrib=false&isShard=true&shard.url=[ff01::114]:33332/ldtfh/i|[ff01::213]:33332/ldtfh/i|[ff01::083]:33332/ldtfh/i|127.0.0.1:33418/ldtfh/i} status=0 QTime=0 
[junit4:junit4]   2> 1207 T277 C16 REQ [collection1] webapp=/ldtfh/i path=/select params={sort=a_si+asc,+id+asc&hl.fl=a_t&group.field=a_si&group.limit=10&hl=true&wt=javabin&shards=[ff01::114]:33332/ldtfh/i|[ff01::213]:33332/ldtfh/i|[ff01::083]:33332/ldtfh/i|127.0.0.1:33418/ldtfh/i&q=*:*&rows=100&fl=id,a_si&group=true&version=2} status=0 QTime=4 
[junit4:junit4]   2> 1210 T265 C15 oasr.UnInvertedField.<init> UnInverted multi-valued field {field=a_t,memSize=4288,tindexSize=0,time=0,phase1=0,nTerms=0,bigTerms=0,termInstances=0,uses=0}
[junit4:junit4]   2> 1211 T265 C15 REQ [collection1] webapp=/ldtfh/i path=/select params={sort=a_si+asc,+id+asc&group.field=a_si&group.limit=10&facet=true&wt=javabin&facet.field=a_t&q=*:*&rows=100&fl=id,a_si&group=true&version=2&distrib=false} hits=0 status=0 QTime=1 
[junit4:junit4]   2> 1222 T274 C16 REQ [collection1] webapp=/ldtfh/i path=/select params={sort=a_si+asc,+id+asc&group.field=a_si&group.limit=10&group.distributed.first=true&facet=false&NOW=1355882547323&wt=javabin&facet.field=a_t&q=*:*&start=0&rows=100&fl=id&group=true&version=2&distrib=false&isShard=true&shard.url=[ff01::213]:33332/ldtfh/i|127.0.0.1:33418/ldtfh/i|[ff01::114]:33332/ldtfh/i} status=0 QTime=0 
[junit4:junit4]   2> 1233 T275 C16 oasr.UnInvertedField.<init> UnInverted multi-valued field {field=a_t,memSize=4288,tindexSize=0,time=0,phase1=0,nTerms=0,bigTerms=0,termInstances=0,uses=0}
[junit4:junit4]   2> 1234 T275 C16 REQ [collection1] webapp=/ldtfh/i path=/select params={sort=a_si+asc,+id+asc&group.field=a_si&group.limit=10&f.a_t.facet.limit=160&facet=true&NOW=1355882547323&wt=javabin&facet.field=a_t&q=*:*&start=0&rows=100&fl=id&group=true&version=2&distrib=false&isShard=true&shard.url=[ff01::213]:33332/ldtfh/i|127.0.0.1:33418/ldtfh/i|[ff01::114]:33332/ldtfh/i&group.distributed.second=true} status=0 QTime=5 
[junit4:junit4]   2> 1239 T276 C16 REQ [collection1] webapp=/ldtfh/i path=/select params={sort=a_si+asc,+id+asc&group.field=a_si&group.limit=10&facet=true&wt=javabin&facet.field=a_t&shards=[ff01::213]:33332/ldtfh/i|127.0.0.1:33418/ldtfh/i|[ff01::114]:33332/ldtfh/i&q=*:*&rows=100&fl=id,a_si&group=true&version=2} status=0 QTime=24 
[junit4:junit4]   2> 1242 T266 C15 REQ [collection1] webapp=/ldtfh/i path=/select params={sort=a_si+asc,+id+asc&group.field=a_si&group.limit=10&wt=javabin&stats.field=a_si&q=*:*&rows=100&fl=id,a_si&group=true&version=2&distrib=false&stats=true} hits=0 status=0 QTime=1 
[junit4:junit4]   2> 1256 T274 C16 REQ [collection1] webapp=/ldtfh/i path=/select params={sort=a_si+asc,+id+asc&group.field=a_si&group.limit=10&group.distributed.first=true&NOW=1355882547352&wt=javabin&stats.field=a_si&q=*:*&start=0&rows=100&fl=id&group=true&version=2&distrib=false&isShard=true&shard.url=127.0.0.1:33418/ldtfh/i|[ff01::213]:33332/ldtfh/i|[ff01::114]:33332/ldtfh/i|[ff01::083]:33332/ldtfh/i&stats=false} status=0 QTime=1 
[junit4:junit4]   2> 1261 T275 C16 REQ [collection1] webapp=/ldtfh/i path=/select params={sort=a_si+asc,+id+asc&group.field=a_si&group.limit=10&NOW=1355882547352&wt=javabin&stats.field=a_si&q=*:*&start=0&rows=100&fl=id&group=true&version=2&distrib=false&isShard=true&shard.url=127.0.0.1:33418/ldtfh/i|[ff01::213]:33332/ldtfh/i|[ff01::114]:33332/ldtfh/i|[ff01::083]:33332/ldtfh/i&stats=true&group.distributed.second=true} status=0 QTime=1 
[junit4:junit4]   2> 1263 T277 C16 REQ [collection1] webapp=/ldtfh/i path=/select params={sort=a_si+asc,+id+asc&group.field=a_si&group.limit=10&wt=javabin&stats.field=a_si&shards=127.0.0.1:33418/ldtfh/i|[ff01::213]:33332/ldtfh/i|[ff01::114]:33332/ldtfh/i|[ff01::083]:33332/ldtfh/i&q=*:*&rows=100&fl=id,a_si&group=true&version=2&stats=true} status=0 QTime=19 
[junit4:junit4]   2> 1290 T264 C15 REQ [collection1] webapp=/ldtfh/i path=/select params={sort=a_si+asc,+id+asc&spellcheck.build=true&group.field=a_si&group.limit=10&qt=spellCheckCompRH&wt=javabin&spellcheck=true&q=kings&rows=100&group=true&fl=id,a_si&version=2&distrib=false} hits=0 status=0 QTime=24 
[junit4:junit4]   2> 1321 T274 C16 REQ [collection1] webapp=/ldtfh/i path=/select params={sort=a_si+asc,+id+asc&spellcheck.build=true&group.field=a_si&spellcheck.onlyMorePopular=false&group.limit=10&group.distributed.first=true&NOW=1355882547403&wt=javabin&spellcheck=false&spellcheck.extendedResults=false&spellcheck.count=1&q=kings&start=0&rows=100&group=true&fl=id&version=2&distrib=false&isShard=true&shard.url=127.0.0.1:33418/ldtfh/i|[ff01::083]:33332/ldtfh/i} status=0 QTime=1 
[junit4:junit4]   2> 1323 T276 C16 oashc.SpellCheckComponent.finishStage 127.0.0.1:33418/ldtfh/i|[ff01::083]:33332/ldtfh/i null
[junit4:junit4]   2> 1324 T276 C16 REQ [collection1] webapp=/ldtfh/i path=/select params={sort=a_si+asc,+id+asc&spellcheck.build=true&group.field=a_si&group.limit=10&qt=spellCheckCompRH&wt=javabin&spellcheck=true&shards=127.0.0.1:33418/ldtfh/i|[ff01::083]:33332/ldtfh/i&q=kings&rows=100&group=true&fl=id,a_si&version=2} status=0 QTime=29 
[junit4:junit4]   2> 1332 T265 C15 REQ [collection1] webapp=/ldtfh/i path=/select params={sort=a_si+asc,+id+asc&group.field=a_si&group.limit=10&facet=true&fq=a_s:a&wt=javabin&facet.field=a_t&q=*:*&rows=100&fl=id,a_si&group=true&version=2&distrib=false&group.truncate=true} hits=0 status=0 QTime=5 
[junit4:junit4]   2> 1339 T277 C16 REQ [collection1] webapp=/ldtfh/i path=/select params={sort=a_si+asc,+id+asc&group.field=a_si&group.limit=10&group.distributed.first=true&facet=false&NOW=1355882547443&fq=a_s:a&wt=javabin&facet.field=a_t&q=*:*&start=0&rows=100&fl=id&group=true&version=2&distrib=false&isShard=true&shard.url=127.0.0.1:33418/ldtfh/i&group.truncate=true} status=0 QTime=1 
[junit4:junit4]   2> 1353 T274 C16 REQ [collection1] webapp=/ldtfh/i path=/select params={sort=a_si+asc,+id+asc&group.field=a_si&group.limit=10&f.a_t.facet.limit=160&facet=true&NOW=1355882547443&fq=a_s:a&wt=javabin&facet.field=a_t&q=*:*&start=0&rows=100&fl=id&group=true&version=2&distrib=false&isShard=true&shard.url=127.0.0.1:33418/ldtfh/i&group.truncate=true&group.distributed.second=true} status=0 QTime=11 
[junit4:junit4]   2> 1354 T275 C16 REQ [collection1] webapp=/ldtfh/i path=/select params={sort=a_si+asc,+id+asc&group.field=a_si&group.limit=10&facet=true&fq=a_s:a&wt=javabin&facet.field=a_t&shards=127.0.0.1:33418/ldtfh/i&q=*:*&rows=100&fl=id,a_si&group=true&version=2&group.truncate=true} status=0 QTime=19 
[junit4:junit4]   2> 1360 T263 C15 UPDATE [collection1] webapp=/ldtfh/i path=/update params={version=2&wt=javabin} {add=[1]} 0 2
[junit4:junit4]   2> 1365 T277 C16 UPDATE [collection1] webapp=/ldtfh/i path=/update params={version=2&wt=javabin} {add=[1]} 0 2
[junit4:junit4]   2> 1371 T266 C15 UPDATE [collection1] webapp=/ldtfh/i path=/update params={version=2&wt=javabin} {add=[2]} 0 2
[junit4:junit4]   2> 1375 T274 C16 UPDATE [collection1] webapp=/ldtfh/i path=/update params={version=2&wt=javabin} {add=[2]} 0 2
[junit4:junit4]   2> 1380 T264 C15 UPDATE [collection1] webapp=/ldtfh/i path=/update params={version=2&wt=javabin} {add=[3]} 0 2
[junit4:junit4]   2> 1385 T276 C16 UPDATE [collection1] webapp=/ldtfh/i path=/update params={version=2&wt=javabin} {add=[3]} 0 1
[junit4:junit4]   2> 1390 T265 C15 UPDATE [collection1] webapp=/ldtfh/i path=/update params={version=2&wt=javabin} {add=[4]} 0 1
[junit4:junit4]   2> 1395 T275 C16 UPDATE [collection1] webapp=/ldtfh/i path=/update params={version=2&wt=javabin} {add=[4]} 0 1
[junit4:junit4]   2> 1400 T263 C15 UPDATE [collection1] webapp=/ldtfh/i path=/update params={version=2&wt=javabin} {add=[5]} 0 2
[junit4:junit4]   2> 1405 T277 C16 UPDATE [collection1] webapp=/ldtfh/i path=/update params={version=2&wt=javabin} {add=[5]} 0 2
[junit4:junit4]   2> 1410 T264 C15 UPDATE [collection1] webapp=/ldtfh/i path=/update params={version=2&wt=javabin} {add=[6]} 0 2
[junit4:junit4]   2> 1415 T274 C16 UPDATE [collection1] webapp=/ldtfh/i path=/update params={version=2&wt=javabin} {add=[6]} 0 2
[junit4:junit4]   2> 1419 T265 C15 UPDATE [collection1] webapp=/ldtfh/i path=/update params={version=2&wt=javabin} {add=[7]} 0 1
[junit4:junit4]   2> 1423 T276 C16 UPDATE [collection1] webapp=/ldtfh/i path=/update params={version=2&wt=javabin} {add=[7]} 0 1
[junit4:junit4]   2> 1428 T263 C15 UPDATE [collection1] webapp=/ldtfh/i path=/update params={version=2&wt=javabin} {add=[8]} 0 2
[junit4:junit4]   2> 1433 T275 C16 UPDATE [collection1] webapp=/ldtfh/i path=/update params={version=2&wt=javabin} {add=[8]} 0 2
[junit4:junit4]   2> 1437 T266 C15 UPDATE [collection1] webapp=/ldtfh/i path=/update params={version=2&wt=javabin} {add=[9]} 0 2
[junit4:junit4]   2> 1440 T277 C16 UPDATE [collection1] webapp=/ldtfh/i path=/update params={version=2&wt=javabin} {add=[9]} 0 1
[junit4:junit4]   2> 1456 T264 C15 UPDATE [collection1] webapp=/ldtfh/i path=/update params={version=2&wt=javabin} {add=[10]} 0 13
[junit4:junit4]   2> 1471 T274 C16 UPDATE [collection1] webapp=/ldtfh/i path=/update params={version=2&wt=javabin} {add=[10]} 0 13
[junit4:junit4]   2> 1477 T265 C15 UPDATE [collection1] webapp=/ldtfh/i path=/update params={version=2&wt=javabin} {add=[11]} 0 3
[junit4:junit4]   2> 1482 T275 C16 UPDATE [collection1] webapp=/ldtfh/i path=/update params={version=2&wt=javabin} {add=[11]} 0 2
[junit4:junit4]   2> 1486 T263 C15 UPDATE [collection1] webapp=/ldtfh/i path=/update params={version=2&wt=javabin} {add=[12]} 0 1
[junit4:junit4]   2> 1491 T277 C16 UPDATE [collection1] webapp=/ldtfh/i path=/update params={version=2&wt=javabin} {add=[12]} 0 1
[junit4:junit4]   2> 1495 T266 C15 UPDATE [collection1] webapp=/ldtfh/i path=/update params={version=2&wt=javabin} {add=[14]} 0 1
[junit4:junit4]   2> 1500 T276 C16 UPDATE [collection1] webapp=/ldtfh/i path=/update params={version=2&wt=javabin} {add=[14]} 0 2
[junit4:junit4]   2> 1505 T264 C15 UPDATE [collection1] webapp=/ldtfh/i path=/update params={version=2&wt=javabin} {add=[15]} 0 2
[junit4:junit4]   2> 1509 T275 C16 UPDATE [collection1] webapp=/ldtfh/i path=/update params={version=2&wt=javabin} {add=[15]} 0 1
[junit4:junit4]   2> 1513 T265 C15 UPDATE [collection1] webapp=/ldtfh/i path=/update params={version=2&wt=javabin} {add=[16]} 0 1
[junit4:junit4]   2> 1517 T274 C16 UPDATE [collection1] webapp=/ldtfh/i path=/update params={version=2&wt=javabin} {add=[16]} 0 1
[junit4:junit4]   2> 1523 T263 C15 UPDATE [collection1] webapp=/ldtfh/i path=/update params={version=2&wt=javabin} {add=[17]} 0 3
[junit4:junit4]   2> 1528 T277 C16 UPDATE [collection1] webapp=/ldtfh/i path=/update params={version=2&wt=javabin} {add=[17]} 0 2
[junit4:junit4]   2> 1532 T264 C15 UPDATE [collection1] webapp=/ldtfh/i path=/update params={version=2&wt=javabin} {add=[18]} 0 1
[junit4:junit4]   2> 1537 T275 C16 UPDATE [collection1] webapp=/ldtfh/i path=/update params={version=2&wt=javabin} {add=[18]} 0 1
[junit4:junit4]   2> 1542 T265 C15 UPDATE [collection1] webapp=/ldtfh/i path=/update params={version=2&wt=javabin} {add=[19]} 0 1
[junit4:junit4]   2> 1546 T274 C16 UPDATE [collection1] webapp=/ldtfh/i path=/update params={version=2&wt=javabin} {add=[19]} 0 1
[junit4:junit4]   2> 1551 T263 C15 UPDATE [collection1] webapp=/ldtfh/i path=/update params={version=2&wt=javabin} {add=[20]} 0 2
[junit4:junit4]   2> 1554 T277 C16 UPDATE [collection1] webapp=/ldtfh/i path=/update params={version=2&wt=javabin} {add=[20]} 0 0
[junit4:junit4]   2> 1567 T264 C15 UPDATE [collection1] webapp=/ldtfh/i path=/update params={version=2&wt=javabin} {add=[21]} 0 9
[junit4:junit4]   2> 1579 T275 C16 UPDATE [collection1] webapp=/ldtfh/i path=/update params={version=2&wt=javabin} {add=[21]} 0 8
[junit4:junit4]   2> 1585 T265 C15 UPDATE [collection1] webapp=/ldtfh/i path=/update params={version=2&wt=javabin} {add=[22]} 0 2
[junit4:junit4]   2> 1590 T274 C16 UPDATE [collection1] webapp=/ldtfh/i path=/update params={version=2&wt=javabin} {add=[22]} 0 2
[junit4:junit4]   2> 1594 T263 C15 UPDATE [collection1] webapp=/ldtfh/i path=/update params={version=2&wt=javabin} {add=[23]} 0 1
[junit4:junit4]   2> 1598 T277 C16 UPDATE [collection1] webapp=/ldtfh/i path=/update params={version=2&wt=javabin} {add=[23]} 0 1
[junit4:junit4]   2> 1602 T266 C15 UPDATE [collection1] webapp=/ldtfh/i path=/update params={version=2&wt=javabin} {add=[100]} 0 1
[junit4:junit4]   2> 1606 T276 C16 UPDATE [collection1] webapp=/ldtfh/i path=/update params={version=2&wt=javabin} {add=[100]} 0 1
[junit4:junit4]   2> 1611 T264 C15 UPDATE [collection1] webapp=/ldtfh/i path=/update params={version=2&wt=javabin} {add=[101]} 0 1
[junit4:junit4]   2> 1615 T275 C16 UPDATE [collection1] webapp=/ldtfh/i path=/update params={version=2&wt=javabin} {add=[101]} 0 1
[junit4:junit4]   2> 1620 T263 C15 UPDATE [collection1] webapp=/ldtfh/i path=/update params={version=2&wt=javabin} {add=[102]} 0 1
[junit4:junit4]   2> 1624 T274 C16 UPDATE [collection1] webapp=/ldtfh/i path=/update params={version=2&wt=javabin} {add=[102]} 0 1
[junit4:junit4]   2> 1629 T266 C15 UPDATE [collection1] webapp=/ldtfh/i path=/update params={version=2&wt=javabin} {add=[103]} 0 1
[junit4:junit4]   2> 1633 T277 C16 UPDATE [collection1] webapp=/ldtfh/i path=/update params={version=2&wt=javabin} {add=[103]} 0 2
[junit4:junit4]   2> 1637 T264 C15 UPDATE [collection1] webapp=/ldtfh/i path=/update params={version=2&wt=javabin} {add=[104]} 0 1
[junit4:junit4]   2> 1641 T276 C16 UPDATE [collection1] webapp=/ldtfh/i path=/update params={version=2&wt=javabin} {add=[104]} 0 1
[junit4:junit4]   2> 1645 T265 C15 UPDATE [collection1] webapp=/ldtfh/i path=/update params={version=2&wt=javabin} {add=[105]} 0 1
[junit4:junit4]   2> 1650 T275 C16 UPDATE [collection1] webapp=/ldtfh/i path=/update params={version=2&wt=javabin} {add=[105]} 0 2
[junit4:junit4]   2> 1654 T266 C15 UPDATE [collection1] webapp=/ldtfh/i path=/update params={version=2&wt=javabin} {add=[106]} 0 1
[junit4:junit4]   2> 1658 T274 C16 UPDATE [collection1] webapp=/ldtfh/i path=/update params={version=2&wt=javabin} {add=[106]} 0 1
[junit4:junit4]   2> 1668 T264 C15 UPDATE [collection1] webapp=/ldtfh/i path=/update params={version=2&wt=javabin} {add=[107]} 0 7
[junit4:junit4]   2> 1678 T277 C16 UPDATE [collection1] webapp=/ldtfh/i path=/update params={version=2&wt=javabin} {add=[107]} 0 7
[junit4:junit4]   2> 1682 T263 C15 UPDATE [collection1] webapp=/ldtfh/i path=/update params={version=2&wt=javabin} {add=[108]} 0 1
[junit4:junit4]   2> 1688 T276 C16 UPDATE [collection1] webapp=/ldtfh/i path=/update params={version=2&wt=javabin} {add=[108]} 0 1
[junit4:junit4]   2> 1692 T265 C15 UPDATE [collection1] webapp=/ldtfh/i path=/update params={version=2&wt=javabin} {add=[109]} 0 1
[junit4:junit4]   2> 1696 T275 C16 UPDATE [collection1] webapp=/ldtfh/i path=/update params={version=2&wt=javabin} {add=[109]} 0 1
[junit4:junit4]   2> 1700 T266 C15 UPDATE [collection1] webapp=/ldtfh/i path=/update params={version=2&wt=javabin} {add=[110]} 0 1
[junit4:junit4]   2> 1704 T274 C16 UPDATE [collection1] webapp=/ldtfh/i path=/update params={version=2&wt=javabin} {add=[110]} 0 1
[junit4:junit4]   2> 1708 T264 C15 UPDATE [collection1] webapp=/ldtfh/i path=/update params={version=2&wt=javabin} {add=[111]} 0 1
[junit4:junit4]   2> 1711 T277 C16 UPDATE [collection1] webapp=/ldtfh/i path=/update params={version=2&wt=javabin} {add=[111]} 0 1
[junit4:junit4]   2> 1715 T263 C15 UPDATE [collection1] webapp=/ldtfh/i path=/update params={version=2&wt=javabin} {add=[112]} 0 1
[junit4:junit4]   2> 1719 T276 C16 UPDATE [collection1] webapp=/ldtfh/i path=/update params={version=2&wt=javabin} {add=[112]} 0 1
[junit4:junit4]   2> 1731 T265 C15 UPDATE [collection1] webapp=/ldtfh/i path=/update params={version=2&wt=javabin} {add=[113]} 0 1
[junit4:junit4]   2> 1735 T275 C16 UPDATE [collection1] webapp=/ldtfh/i path=/update params={version=2&wt=javabin} {add=[113]} 0 1
[junit4:junit4]   2> 1742 T266 C15 UPDATE [collection1] webapp=/ldtfh/i path=/update params={version=2&wt=javabin} {add=[114]} 0 1
[junit4:junit4]   2> 1747 T274 C16 UPDATE [collection1] webapp=/ldtfh/i path=/update params={version=2&wt=javabin} {add=[114]} 0 1
[junit4:junit4]   2> 1751 T264 C15 UPDATE [collection1] webapp=/ldtfh/i path=/update params={version=2&wt=javabin} {add=[115]} 0 1
[junit4:junit4]   2> 1755 T277 C16 UPDATE [collection1] webapp=/ldtfh/i path=/update params={version=2&wt=javabin} {add=[115]} 0 1
[junit4:junit4]   2> 1758 T263 C15 UPDATE [collection1] webapp=/ldtfh/i path=/update params={version=2&wt=javabin} {add=[116]} 0 0
[junit4:junit4]   2> 1762 T276 C16 UPDATE [collection1] webapp=/ldtfh/i path=/update params={version=2&wt=javabin} {add=[116]} 0 1
[junit4:junit4]   2> 1773 T265 C15 UPDATE [collection1] webapp=/ldtfh/i path=/update params={version=2&wt=javabin} {add=[117]} 0 6
[junit4:junit4]   2> 1789 T275 C16 UPDATE [collection1] webapp=/ldtfh/i path=/update params={version=2&wt=javabin} {add=[117]} 0 13
[junit4:junit4]   2> 1794 T266 C15 UPDATE [collection1] webapp=/ldtfh/i path=/update params={version=2&wt=javabin} {add=[118]} 0 2
[junit4:junit4]   2> 1798 T274 C16 UPDATE [collection1] webapp=/ldtfh/i path=/update params={version=2&wt=javabin} {add=[118]} 0 1
[junit4:junit4]   2> 1802 T264 C15 UPDATE [collection1] webapp=/ldtfh/i path=/update params={version=2&wt=javabin} {add=[119]} 0 1
[junit4:junit4]   2> 1806 T277 C16 UPDATE [collection1] webapp=/ldtfh/i path=/update params={version=2&wt=javabin} {add=[119]} 0 1
[junit4:junit4]   2> 1810 T263 C15 UPDATE [collection1] webapp=/ldtfh/i path=/update params={version=2&wt=javabin} {add=[120]} 0 1
[junit4:junit4]   2> 1814 T276 C16 UPDATE [collection1] webapp=/ldtfh/i path=/update params={version=2&wt=javabin} {add=[120]} 0 1
[junit4:junit4]   2> 1818 T265 C15 UPDATE [collection1] webapp=/ldtfh/i path=/update params={version=2&wt=javabin} {add=[121]} 0 1
[junit4:junit4]   2> 1822 T275 C16 UPDATE [collection1] webapp=/ldtfh/i path=/update params={version=2&wt=javabin} {add=[121]} 0 1
[junit4:junit4]   2> 1826 T266 C15 UPDATE [collection1] webapp=/ldtfh/i path=/update params={version=2&wt=javabin} {add=[122]} 0 1
[junit4:junit4]   2> 1830 T274 C16 UPDATE [collection1] webapp=/ldtfh/i path=/update params={version=2&wt=javabin} {add=[122]} 0 1
[junit4:junit4]   2> 1834 T264 C15 UPDATE [collection1] webapp=/ldtfh/i path=/update params={version=2&wt=javabin} {add=[123]} 0 1
[junit4:junit4]   2> 1841 T277 C16 UPDATE [collection1] webapp=/ldtfh/i path=/update params={version=2&wt=javabin} {add=[123]} 0 1
[junit4:junit4]   2> 1846 T263 C15 UPDATE [collection1] webapp=/ldtfh/i path=/update params={version=2&wt=javabin} {add=[124]} 0 1
[junit4:junit4]   2> 1850 T276 C16 UPDATE [collection1] webapp=/ldtfh/i path=/update params={version=2&wt=javabin} {add=[124]} 0 1
[junit4:junit4]   2> 1854 T265 C15 UPDATE [collection1] webapp=/ldtfh/i path=/update params={version=2&wt=javabin} {add=[125]} 0 1
[junit4:junit4]   2> 1857 T275 C16 UPDATE [collection1] webapp=/ldtfh/i path=/update params={version=2&wt=javabin} {add=[125]} 0 0
[junit4:junit4]   2> 1861 T266 C15 UPDATE [collection1] webapp=/ldtfh/i path=/update params={version=2&wt=javabin} {add=[126]} 0 1
[junit4:junit4]   2> 1865 T274 C16 UPDATE [collection1] webapp=/ldtfh/i path=/update params={version=2&wt=javabin} {add=[126]} 0 1
[junit4:junit4]   2> 1873 T264 C15 UPDATE [collection1] webapp=/ldtfh/i path=/update params={version=2&wt=javabin} {add=[127]} 0 6
[junit4:junit4]   2> 1882 T277 C16 UPDATE [collection1] webapp=/ldtfh/i path=/update params={version=2&wt=javabin} {add=[127]} 0 6
[junit4:junit4]   2> 1886 T263 C15 UPDATE [collection1] webapp=/ldtfh/i path=/update params={version=2&wt=javabin} {add=[128]} 0 1
[junit4:junit4]   2> 1890 T276 C16 UPDATE [collection1] webapp=/ldtfh/i path=/update params={version=2&wt=javabin} {add=[128]} 0 2
[junit4:junit4]   2> 1893 T265 C15 UPDATE [collection1] webapp=/ldtfh/i path=/update params={version=2&wt=javabin} {add=[129]} 0 0
[junit4:junit4]   2> 1898 T274 C16 UPDATE [collection1] webapp=/ldtfh/i path=/update params={version=2&wt=javabin} {add=[129]} 0 1
[junit4:junit4]   2> 1904 T266 C15 UPDATE [collection1] webapp=/ldtfh/i path=/update params={version=2&wt=javabin} {add=[130]} 0 1
[junit4:junit4]   2> 1909 T277 C16 UPDATE [collection1] webapp=/ldtfh/i path=/update params={version=2&wt=javabin} {add=[130]} 0 1
[junit4:junit4]   2> 1913 T264 C15 UPDATE [collection1] webapp=/ldtfh/i path=/update params={version=2&wt=javabin} {add=[131]} 0 1
[junit4:junit4]   2> 1917 T276 C16 UPDATE [collection1] webapp=/ldtfh/i path=/update params={version=2&wt=javabin} {add=[131]} 0 1
[junit4:junit4]   2> 1921 T263 C15 UPDATE [collection1] webapp=/ldtfh/i path=/update params={version=2&wt=javabin} {add=[132]} 0 1
[junit4:junit4]   2> 1925 T275 C16 UPDATE [collection1] webapp=/ldtfh/i path=/update params={version=2&wt=javabin} {add=[132]} 0 1
[junit4:junit4]   2> 1929 T265 C15 UPDATE [collection1] webapp=/ldtfh/i path=/update params={version=2&wt=javabin} {add=[133]} 0 1
[junit4:junit4]   2> 1932 T274 C16 UPDATE [collection1] webapp=/ldtfh/i path=/update params={version=2&wt=javabin} {add=[133]} 0 0
[junit4:junit4]   2> 1936 T266 C15 UPDATE [collection1] webapp=/ldtfh/i path=/update params={version=2&wt=javabin} {add=[134]} 0 1
[junit4:junit4]   2> 1940 T277 C16 UPDATE [collection1] webapp=/ldtfh/i path=/update params={version=2&wt=javabin} {add=[134]} 0 1
[junit4:junit4]   2> 1944 T264 C15 UPDATE [collection1] webapp=/ldtfh/i path=/update params={version=2&wt=javabin} {add=[135]} 0 1
[junit4:junit4]   2> 1948 T276 C16 UPDATE [collection1] webapp=/ldtfh/i path=/update params={version=2&wt=javabin} {add=[135]} 0 1
[junit4:junit4]   2> 1952 T263 C15 UPDATE [collection1] webapp=/ldtfh/i path=/update params={version=2&wt=javabin} {add=[136]} 0 1
[junit4:junit4]   2> 1955 T275 C16 UPDATE [collection1] webapp=/ldtfh/i path=/update params={version=2&wt=javabin} {add=[136]} 0 0
[junit4:junit4]   2> 1964 T265 C15 UPDATE [collection1] webapp=/ldtfh/i path=/update params={version=2&wt=javabin} {add=[137]} 0 5
[junit4:junit4]   2> 1973 T274 C16 UPDATE [collection1] webapp=/ldtfh/i path=/update params={version=2&wt=javabin} {add=[137]} 0 6
[junit4:junit4]   2> 1977 T266 C15 UPDATE [collection1] webapp=/ldtfh/i path=/update params={version=2&wt=javabin} {add=[138]} 0 1
[junit4:junit4]   2> 1981 T277 C16 UPDATE [collection1] webapp=/ldtfh/i path=/update params={version=2&wt=javabin} {add=[138]} 0 1
[junit4:junit4]   2> 1985 T264 C15 UPDATE [collection1] webapp=/ldtfh/i path=/update params={version=2&wt=javabin} {add=[139]} 0 1
[junit4:junit4]   2> 1989 T276 C16 UPDATE [collection1] webapp=/ldtfh/i path=/update params={version=2&wt=javabin} {add=[139]} 0 1
[junit4:junit4]   2> 1992 T263 C15 UPDATE [collection1] webapp=/ldtfh/i path=/update params={version=2&wt=javabin} {add=[140]} 0 0
[junit4:junit4]   2> 1996 T275 C16 UPDATE [collection1] webapp=/ldtfh/i path=/update params={version=2&wt=javabin} {add=[140]} 0 1
[junit4:junit4]   2> 2001 T265 C15 UPDATE [collection1] webapp=/ldtfh/i path=/update params={version=2&wt=javabin} {add=[141]} 0 1
[junit4:junit4]   2> 2004 T274 C16 UPDATE [collection1] webapp=/ldtfh/i path=/update params={version=2&wt=javabin} {add=[141]} 0 1
[junit4:junit4]   2> 2009 T266 C15 UPDATE [collection1] webapp=/ldtfh/i path=/update params={version=2&wt=javabin} {add=[142]} 0 1
[junit4:junit4]   2> 2012 T277 C16 UPDATE [collection1] webapp=/ldtfh/i path=/update params={version=2&wt=javabin} {add=[142]} 0 1
[junit4:junit4]   2> 2016 T263 C15 UPDATE [collection1] webapp=/ldtfh/i path=/update params={version=2&wt=javabin} {add=[143]} 0 1
[junit4:junit4]   2> 2019 T276 C16 UPDATE [collection1] webapp=/ldtfh/i path=/update params={version=2&wt=javabin} {add=[143]} 0 0
[junit4:junit4]   2> 2023 T265 C15 UPDATE [collection1] webapp=/ldtfh/i path=/update params={version=2&wt=javabin} {add=[144]} 0 1
[junit4:junit4]   2> 2027 T275 C16 UPDATE [collection1] webapp=/ldtfh/i path=/update params={version=2&wt=javabin} {add=[144]} 0 1
[junit4:junit4]   2> 2031 T266 C15 UPDATE [collection1] webapp=/ldtfh/i path=/update params={version=2&wt=javabin} {add=[145]} 0 0
[junit4:junit4]   2> 2035 T274 C16 UPDATE [collection1] webapp=/ldtfh/i path=/update params={version=2&wt=javabin} {add=[145]} 0 1
[junit4:junit4]   2> 2039 T264 C15 UPDATE [collection1] webapp=/ldtfh/i path=/update params={version=2&wt=javabin} {add=[146]} 0 1
[junit4:junit4]   2> 2042 T277 C16 UPDATE [collection1] webapp=/ldtfh/i path=/update params={version=2&wt=javabin} {add=[146]} 0 1
[junit4:junit4]   2> 2052 T263 C15 UPDATE [collection1] webapp=/ldtfh/i path=/update params={version=2&wt=javabin} {add=[147]} 0 6
[junit4:junit4]   2> 2060 T276 C16 UPDATE [collection1] webapp=/ldtfh/i path=/update params={version=2&wt=javabin} {add=[147]} 0 5
[junit4:junit4]   2> 2064 T266 C15 UPDATE [collection1] webapp=/ldtfh/i path=/update params={version=2&wt=javabin} {add=[148]} 0 1
[junit4:junit4]   2> 2068 T275 C16 UPDATE [collection1] webapp=/ldtfh/i path=/update params={version=2&wt=javabin} {add=[148]} 0 1
[junit4:junit4]   2> 2071 T264 C15 UPDATE [collection1] webapp=/ldtfh/i path=/update params={version=2&wt=javabin} {add=[149]} 0 0
[junit4:junit4]   2> 2075 T274 C16 UPDATE [collection1] webapp=/ldtfh/i path=/update params={version=2&wt=javabin} {add=[149]} 0 1
[junit4:junit4]   2> 2078 T265 C15 UPDATE [collection1] webapp=/ldtfh/i path=/update params={version=2&wt=javabin} {add=[500]} 0 0
[junit4:junit4]   2> 2081 T277 C16 UPDATE [collection1] webapp=/ldtfh/i path=/update params={version=2&wt=javabin} {add=[500]} 0 0
[junit4:junit4]   2> 2084 T263 C15 UPDATE [collection1] webapp=/ldtfh/i path=/update params={version=2&wt=javabin} {add=[501]} 0 0
[junit4:junit4]   2> 2087 T276 C16 UPDATE [collection1] webapp=/ldtfh/i path=/update params={version=2&wt=javabin} {add=[501]} 0 0
[junit4:junit4]   2> 2091 T266 C15 UPDATE [collection1] webapp=/ldtfh/i path=/update params={version=2&wt=javabin} {add=[502]} 0 0
[junit4:junit4]   2> 2095 T275 C16 UPDATE [collection1] webapp=/ldtfh/i path=/update params={version=2&wt=javabin} {add=[502]} 0 1
[junit4:junit4]   2> 2099 T264 C15 UPDATE [collection1] webapp=/ldtfh/i path=/update params={version=2&wt=javabin} {add=[503]} 0 1
[junit4:junit4]   2> 2102 T274 C16 UPDATE [collection1] webapp=/ldtfh/i path=/update params={version=2&wt=javabin} {add=[503]} 0 0
[junit4:junit4]   2> 2106 T265 C15 UPDATE [collection1] webapp=/ldtfh/i path=/update params={version=2&wt=javabin} {add=[504]} 0 1
[junit4:junit4]   2> 2110 T277 C16 UPDATE [collection1] webapp=/ldtfh/i path=/update params={version=2&wt=javabin} {add=[504]} 0 1
[junit4:junit4]   2> 2113 T263 C15 UPDATE [collection1] webapp=/ldtfh/i path=/update params={version=2&wt=javabin} {add=[505]} 0 0
[junit4:junit4]   2> 2117 T276 C16 UPDATE [collection1] webapp=/ldtfh/i path=/update params={version=2&wt=javabin} {add=[505]} 0 1
[junit4:junit4]   2> 2120 T266 C15 UPDATE [collection1] webapp=/ldtfh/i path=/update params={version=2&wt=javabin} {add=[506]} 0 0
[junit4:junit4]   2> 2124 T275 C16 UPDATE [collection1] webapp=/ldtfh/i path=/update params={version=2&wt=javabin} {add=[506]} 0 1
[junit4:junit4]   2> 2136 T264 C15 UPDATE [collection1] webapp=/ldtfh/i path=/update params={version=2&wt=javabin} {add=[507]} 0 10
[junit4:junit4]   2> 2144 T274 C16 UPDATE [collection1] webapp=/ldtfh/i path=/update params={version=2&wt=javabin} {add=[507]} 0 5
[junit4:junit4]   2> 2149 T265 C15 UPDATE [collection1] webapp=/ldtfh/i path=/update params={version=2&wt=javabin} {add=[508]} 0 2
[junit4:junit4]   2> 2153 T277 C16 UPDATE [collection1] webapp=/ldtfh/i path=/update params={version=2&wt=javabin} {add=[508]} 0 1
[junit4:junit4]   2> 2156 T263 C15 UPDATE [collection1] webapp=/ldtfh/i path=/update params={version=2&wt=javabin} {add=[509]} 0 0
[junit4:junit4]   2> 2160 T275 C16 UPDATE [collection1] webapp=/ldtfh/i path=/update params={version=2&wt=javabin} {add=[509]} 0 1
[junit4:junit4]   2> 2163 T266 C15 UPDATE [collection1] webapp=/ldtfh/i path=/update params={version=2&wt=javabin} {add=[510]} 0 0
[junit4:junit4]   2> 2166 T274 C16 UPDATE [collection1] webapp=/ldtfh/i path=/update params={version=2&wt=javabin} {add=[510]} 0 0
[junit4:junit4]   2> 2170 T264 C15 UPDATE [collection1] webapp=/ldtfh/i path=/update params={version=2&wt=javabin} {add=[511]} 0 1
[junit4:junit4]   2> 2173 T277 C16 UPDATE [collection1] webapp=/ldtfh/i path=/update params={version=2&wt=javabin} {add=[511]} 0 0
[junit4:junit4]   2> 2177 T265 C15 UPDATE [collection1] webapp=/ldtfh/i path=/update params={version=2&wt=javabin} {add=[512]} 0 0
[junit4:junit4]   2> 2192 T276 C16 UPDATE [collection1] webapp=/ldtfh/i path=/update params={version=2&wt=javabin} {add=[512]} 0 11
[junit4:junit4]   2> 2197 T263 C15 UPDATE [collection1] webapp=/ldtfh/i path=/update params={version=2&wt=javabin} {add=[513]} 0 0
[junit4:junit4]   2> 2212 T275 C16 UPDATE [collection1] webapp=/ldtfh/i path=/update params={version=2&wt=javabin} {add=[513]} 0 1
[junit4:junit4]   2> 2216 T266 C15 UPDATE [collection1] webapp=/ldtfh/i path=/update params={version=2&wt=javabin} {add=[514]} 0 0
[junit4:junit4]   2> 2220 T274 C16 UPDATE [collection1] webapp=/ldtfh/i path=/update params={version=2&wt=javabin} {add=[514]} 0 1
[junit4:junit4]   2> 2223 T264 C15 UPDATE [collection1] webapp=/ldtfh/i path=/update params={version=2&wt=javabin} {add=[515]} 0 0
[junit4:junit4]   2> 2227 T277 C16 UPDATE [collection1] webapp=/ldtfh/i path=/update params={version=2&wt=javabin} {add=[515]} 0 1
[junit4:junit4]   2> 2230 T265 C15 UPDATE [collection1] webapp=/ldtfh/i path=/update params={version=2&wt=javabin} {add=[516]} 0 1
[junit4:junit4]   2> 2233 T276 C16 UPDATE [collection1] webapp=/ldtfh/i path=/update params={version=2&wt=javabin} {add=[516]} 0 0
[junit4:junit4]   2> 2240 T263 C15 UPDATE [collection1] webapp=/ldtfh/i path=/update params={version=2&wt=javabin} {add=[517]} 0 4
[junit4:junit4]   2> 2246 T275 C16 UPDATE [collection1] webapp=/ldtfh/i path=/update params={version=2&wt=javabin} {add=[517]} 0 3
[junit4:junit4]   2> 2251 T266 C15 UPDATE [collection1] webapp=/ldtfh/i path=/update params={version=2&wt=javabin} {add=[518]} 0 1
[junit4:junit4]   2> 2280 T274 C16 UPDATE [collection1] webapp=/ldtfh/i path=/update params={version=2&wt=javabin} {add=[518]} 0 26
[junit4:junit4]   2> 2283 T264 C15 UPDATE [collection1] webapp=/ldtfh/i path=/update params={version=2&wt=javabin} {add=[519]} 0 0
[junit4:junit4]   2> 2287 T277 C16 UPDATE [collection1] webapp=/ldtfh/i path=/update params={version=2&wt=javabin} {add=[519]} 0 1
[junit4:junit4]   2> 2291 T265 C15 UPDATE [collection1] webapp=/ldtfh/i path=/update params={version=2&wt=javabin} {add=[520]} 0 1
[junit4:junit4]   2> 2297 T276 C16 UPDATE [collection1] webapp=/ldtfh/i path=/update params={version=2&wt=javabin} {add=[520]} 0 1
[junit4:junit4]   2> 2312 T263 C15 UPDATE [collection1] webapp=/ldtfh/i path=/update params={version=2&wt=javabin} {add=[521]} 0 0
[junit4:junit4]   2> 2316 T274 C16 UPDATE [collection1] webapp=/ldtfh/i path=/update params={version=2&wt=javabin} {add=[521]} 0 1
[junit4:junit4]   2> 2319 T266 C15 UPDATE [collection1] webapp=/ldtfh/i path=/update params={version=2&wt=javabin} {add=[522]} 0 1
[junit4:junit4]   2> 2326 T277 C16 UPDATE [collection1] webapp=/ldtfh/i path=/update params={version=2&wt=javabin} {add=[522]} 0 1
[junit4:junit4]   2> 2329 T264 C15 UPDATE [collection1] webapp=/ldtfh/i path=/update params={version=2&wt=javabin} {add=[523]} 0 0
[junit4:junit4]   2> 2332 T276 C16 UPDATE [collection1] webapp=/ldtfh/i path=/update params={version=2&wt=javabin} {add=[523]} 0 0
[junit4:junit4]   2> 2335 T265 C15 UPDATE [collection1] webapp=/ldtfh/i path=/update params={version=2&wt=javabin} {add=[524]} 0 1
[junit4:junit4]   2> 2337 T275 C16 UPDATE [collection1] webapp=/ldtfh/i path=/update params={version=2&wt=javabin} {add=[524]} 0 0
[junit4:junit4]   2> 2340 T263 C15 UPDATE [collection1] webapp=/ldtfh/i path=/update params={version=2&wt=javabin} {add=[525]} 0 0
[junit4:junit4]   2> 2343 T274 C16 UPDATE [collection1] webapp=/ldtfh/i path=/update params={version=2&wt=javabin} {add=[525]} 0 0
[junit4:junit4]   2> 2346 T266 C15 UPDATE [collection1] webapp=/ldtfh/i path=/update params={version=2&wt=javabin} {add=[526]} 0 0
[junit4:junit4]   2> 2350 T277 C16 UPDATE [collection1] webapp=/ldtfh/i path=/update params={version=2&wt=javabin} {add=[526]} 0 0
[junit4:junit4]   2> 2379 T264 C15 UPDATE [collection1] webapp=/ldtfh/i path=/update params={version=2&wt=javabin} {add=[527]} 0 27
[junit4:junit4]   2> 2386 T276 C16 UPDATE [collection1] webapp=/ldtfh/i path=/update params={version=2&wt=javabin} {add=[527]} 0 4
[junit4:junit4]   2> 2390 T265 C15 UPDATE [collection1] webapp=/ldtfh/i path=/update params={version=2&wt=javabin} {add=[528]} 0 1
[junit4:junit4]   2> 2394 T275 C16 UPDATE [collection1] webapp=/ldtfh/i path=/update params={version=2&wt=javabin} {add=[528]} 0 1
[junit4:junit4]   2> 2397 T263 C15 UPDATE [collection1] webapp=/ldtfh/i path=/update params={version=2&wt=javabin} {add=[529]} 0 0
[junit4:junit4]   2> 2400 T274 C16 UPDATE [collection1] webapp=/ldtfh/i path=/update params={version=2&wt=javabin} {add=[529]} 0 0
[junit4:junit4]   2> 2404 T266 C15 UPDATE [collection1] webapp=/ldtfh/i path=/update params={version=2&wt=javabin} {add=[530]} 0 1
[junit4:junit4]   2> 2407 T277 C16 UPDATE [collection1] webapp=/ldtfh/i path=/update params={version=2&wt=javabin} {add=[530]} 0 1
[junit4:junit4]   2> 2410 T264 C15 UPDATE [collection1] webapp=/ldtfh/i path=/update params={version=2&wt=javabin} {add=[531]} 0 1
[junit4:junit4]   2> 2413 T276 C16 UPDATE [collection1] webapp=/ldtfh/i path=/update params={version=2&wt=javabin} {add=[531]} 0 0
[junit4:junit4]   2> 2419 T265 C15 UPDATE [collection1] webapp=/ldtfh/i path=/update params={version=2&wt=javabin} {add=[532]} 0 1
[junit4:junit4]   2> 2422 T275 C16 UPDATE [collection1] webapp=/ldtfh/i path=/update params={version=2&wt=javabin} {add=[532]} 0 0
[junit4:junit4]   2> 2426 T263 C15 UPDATE [collection1] webapp=/ldtfh/i path=/update params={version=2&wt=javabin} {add=[533]} 0 1
[junit4:junit4]   2> 2429 T274 C16 UPDATE [collection1] webapp=/ldtfh/i path=/update params={version=2&wt=javabin} {add=[533]} 0 0
[junit4:junit4]   2> 2432 T266 C15 UPDATE [collection1] webapp=/ldtfh/i path=/update params={version=2&wt=javabin} {add=[534]} 0 0
[junit4:junit4]   2> 2435 T277 C16 UPDATE [collection1] webapp=/ldtfh/i path=/update params={version=2&wt=javabin} {add=[534]} 0 0
[junit4:junit4]   2> 2439 T264 C15 UPDATE [collection1] webapp=/ldtfh/i path=/update params={version=2&wt=javabin} {add=[535]} 0 1
[junit4:junit4]   2> 2442 T276 C16 UPDATE [collection1] webapp=/ldtfh/i path=/update params={version=2&wt=javabin} {add=[535]} 0 0
[junit4:junit4]   2> 2445 T265 C15 UPDATE [collection1] webapp=/ldtfh/i path=/update params={version=2&wt=javabin} {add=[536]} 0 0
[junit4:junit4]   2> 2448 T275 C16 UPDATE [collection1] webapp=/ldtfh/i path=/update params={version=2&wt=javabin} {add=[536]} 0 0
[junit4:junit4]   2> 2454 T263 C15 UPDATE [collection1] webapp=/ldtfh/i path=/update params={version=2&wt=javabin} {add=[537]} 0 3
[junit4:junit4]   2> 2460 T274 C16 UPDATE [collection1] webapp=/ldtfh/i path=/update params={version=2&wt=javabin} {add=[537]} 0 3
[junit4:junit4]   2> 2464 T264 C15 UPDATE [collection1] webapp=/ldtfh/i path=/update params={version=2&wt=javabin} {add=[538]} 0 1
[junit4:junit4]   2> 2467 T277 C16 UPDATE [collection1] webapp=/ldtfh/i path=/update params={version=2&wt=javabin} {add=[538]} 0 1
[junit4:junit4]   2> 2470 T265 C15 UPDATE [collection1] webapp=/ldtfh/i path=/update params={version=2&wt=javabin} {add=[539]} 0 0
[junit4:junit4]   2> 2473 T276 C16 UPDATE [collection1] webapp=/ldtfh/i path=/update params={version=2&wt=javabin} {add=[539]} 0 0
[junit4:junit4]   2> 2476 T266 C15 UPDATE [collection1] webapp=/ldtfh/i path=/update params={version=2&wt=javabin} {add=[540]} 0 0
[junit4:junit4]   2> 2479 T275 C16 UPDATE [collection1] webapp=/ldtfh/i path=/update params={version=2&wt=javabin} {add=[540]} 0 0
[junit4:junit4]   2> 2483 T263 C15 UPDATE [collection1] webapp=/ldtfh/i path=/update params={version=2&wt=javabin} {add=[541]} 0 1
[junit4:junit4]   2> 2486 T274 C16 UPDATE [collection1] webapp=/ldtfh/i path=/update params={version=2&wt=javabin} {add=[541]} 0 1
[junit4:junit4]   2> 2490 T264 C15 UPDATE [collection1] webapp=/ldtfh/i path=/update params={version=2&wt=javabin} {add=[542]} 0 1
[junit4:junit4]   2> 2493 T277 C16 UPDATE [collection1] webapp=/ldtfh/i path=/update params={version=2&wt=javabin} {add=[542]} 0 0
[junit4:junit4]   2> 2497 T265 C15 UPDATE [collection1] webapp=/ldtfh/i path=/update params={version=2&wt=javabin} {add=[543]} 0 1
[junit4:junit4]   2> 2500 T276 C16 UPDATE [collection1] webapp=/ldtfh/i path=/update params={version=2&wt=javabin} {add=[543]} 0 1
[junit4:junit4]   2> 2502 T266 C15 UPDATE [collection1] webapp=/ldtfh/i path=/update params={version=2&wt=javabin} {add=[544]} 0 0
[junit4:junit4]   2> 2505 T275 C16 UPDATE [collection1] webapp=/ldtfh/i path=/update params={version=2&wt=javabin} {add=[544]} 0 1
[junit4:junit4]   2> 2508 T263 C15 UPDATE [collection1] webapp=/ldtfh/i path=/update params={version=2&wt=javabin} {add=[545]} 0 1
[junit4:junit4]   2> 2511 T274 C16 UPDATE [collection1] webapp=/ldtfh/i path=/update params={version=2&wt=javabin} {add=[545]} 0 1
[junit4:junit4]   2> 2514 T264 C15 UPDATE [collection1] webapp=/ldtfh/i path=/update params={version=2&wt=javabin} {add=[546]} 0 1
[junit4:junit4]   2> 2517 T277 C16 UPDATE [collection1] webapp=/ldtfh/i path=/update params={version=2&wt=javabin} {add=[546]} 0 1
[junit4:junit4]   2> 2523 T265 C15 UPDATE [collection1] webapp=/ldtfh/i path=/update params={version=2&wt=javabin} {add=[547]} 0 4
[junit4:junit4]   2> 2529 T276 C16 UPDATE [collection1] webapp=/ldtfh/i path=/update params={version=2&wt=javabin} {add=[547]} 0 3
[junit4:junit4]   2> 2533 T266 C15 UPDATE [collection1] webapp=/ldtfh/i path=/update params={version=2&wt=javabin} {add=[548]} 0 1
[junit4:junit4]   2> 2537 T275 C16 UPDATE [collection1] webapp=/ldtfh/i path=/update params={version=2&wt=javabin} {add=[548]} 0 1
[junit4:junit4]   2> 2540 T263 C15 UPDATE [collection1] webapp=/ldtfh/i path=/update params={version=2&wt=javabin} {add=[549]} 0 0
[junit4:junit4]   2> 2544 T274 C16 UPDATE [collection1] webapp=/ldtfh/i path=/update params={version=2&wt=javabin} {add=[549]} 0 1
[junit4:junit4]   2> 2547 T264 C15 UPDATE [collection1] webapp=/ldtfh/i path=/update params={version=2&wt=javabin} {add=[550]} 0 0
[junit4:junit4]   2> 2550 T277 C16 UPDATE [collection1] webapp=/ldtfh/i path=/update params={version=2&wt=javabin} {add=[550]} 0 0
[junit4:junit4]   2> 2553 T265 C15 UPDATE [collection1] webapp=/ldtfh/i path=/update params={version=2&wt=javabin} {add=[551]} 0 0
[junit4:junit4]   2> 2557 T276 C16 UPDATE [collection1] webapp=/ldtfh/i path=/update params={version=2&wt=javabin} {add=[551]} 0 1
[junit4:junit4]   2> 2560 T266 C15 UPDATE [collection1] webapp=/ldtfh/i path=/update params={version=2&wt=javabin} {add=[552]} 0 1
[junit4:junit4]   2> 2563 T275 C16 UPDATE [collection1] webapp=/ldtfh/i path=/update params={version=2&wt=javabin} {add=[552]} 0 0
[junit4:junit4]   2> 2567 T263 C15 UPDATE [collection1] webapp=/ldtfh/i path=/update params={version=2&wt=javabin} {add=[553]} 0 1
[junit4:junit4]   2> 2570 T274 C16 UPDATE [collection1] webapp=/ldtfh/i path=/update params={version=2&wt=javabin} {add=[553]} 0 0
[junit4:junit4]   2> 2573 T264 C15 UPDATE [collection1] webapp=/ldtfh/i path=/update params={version=2&wt=javabin} {add=[554]} 0 0
[junit4:junit4]   2> 2577 T277 C16 UPDATE [collection1] webapp=/ldtfh/i path=/update params={version=2&wt=javabin} {add=[554]} 0 1
[junit4:junit4]   2> 2580 T265 C15 UPDATE [collection1] webapp=/ldtfh/i path=/update params={version=2&wt=javabin} {add=[555]} 0 0
[junit4:junit4]   2> 2584 T276 C16 UPDATE [collection1] webapp=/ldtfh/i path=/update params={version=2&wt=javabin} {add=[555]} 0 1
[junit4:junit4]   2> 2587 T266 C15 UPDATE [collection1] webapp=/ldtfh/i path=/update params={version=2&wt=javabin} {add=[556]} 0 0
[junit4:junit4]   2> 2590 T275 C16 UPDATE [collection1] webapp=/ldtfh/i path=/update params={version=2&wt=javabin} {add=[556]} 0 1
[junit4:junit4]   2> 2595 T263 C15 UPDATE [collection1] webapp=/ldtfh/i path=/update params={version=2&wt=javabin} {add=[557]} 0 3
[junit4:junit4]   2> 2601 T274 C16 UPDATE [collection1] webapp=/ldtfh/i path=/update params={version=2&wt=javabin} {add=[557]} 0 3
[junit4:junit4]   2> 2606 T264 C15 UPDATE [collection1] webapp=/ldtfh/i path=/update params={version=2&wt=javabin} {add=[558]} 0 2
[junit4:junit4]   2> 2609 T277 C16 UPDATE [collection1] webapp=/ldtfh/i path=/update params={version=2&wt=javabin} {add=[558]} 0 1
[junit4:junit4]   2> 2613 T265 C15 UPDATE [collection1] webapp=/ldtfh/i path=/update params={version=2&wt=javabin} {add=[559]} 0 1
[junit4:junit4]   2> 2616 T276 C16 UPDATE [collection1] webapp=/ldtfh/i path=/update params={version=2&wt=javabin} {add=[559]} 0 1
[junit4:junit4]   2> 2619 T266 C15 UPDATE [collection1] webapp=/ldtfh/i path=/update params={version=2&wt=javabin} {add=[560]} 0 1
[junit4:junit4]   2> 2621 T275 C16 UPDATE [collection1] webapp=/ldtfh/i path=/update params={version=2&wt=javabin} {add=[560]} 0 0
[junit4:junit4]   2> 2624 T263 C15 UPDATE [collection1] webapp=/ldtfh/i path=/update params={version=2&wt=javabin} {add=[561]} 0 0
[junit4:junit4]   2> 2627 T274 C16 UPDATE [collection1] webapp=/ldtfh/i path=/update params={version=2&wt=javabin} {add=[561]} 0 1
[junit4:junit4]   2> 2630 T264 C15 UPDATE [collection1] webapp=/ldtfh/i path=/update params={version=2&wt=javabin} {add=[562]} 0 1
[junit4:junit4]   2> 2632 T277 C16 UPDATE [collection1] webapp=/ldtfh/i path=/update params={version=2&wt=javabin} {add=[562]} 0 0
[junit4:junit4]   2> 2635 T265 C15 UPDATE [collection1] webapp=/ldtfh/i path=/update params={version=2&wt=javabin} {add=[563]} 0 0
[junit4:junit4]   2> 2638 T276 C16 UPDATE [collection1] webapp=/ldtfh/i path=/update params={version=2&wt=javabin} {add=[563]} 0 0
[junit4:junit4]   2> 2641 T266 C15 UPDATE [collection1] webapp=/ldtfh/i path=/update params={version=2&wt=javabin} {add=[564]} 0 0
[junit4:junit4]   2> 2643 T275 C16 UPDATE [collection1] webapp=/ldtfh/i path=/update params={version=2&wt=javabin} {add=[564]} 0 0
[junit4:junit4]   2> 2646 T263 C15 UPDATE [collection1] webapp=/ldtfh/i path=/update params={version=2&wt=javabin} {add=[565]} 0 0
[junit4:junit4]   2> 2649 T274 C16 UPDATE [collection1] webapp=/ldtfh/i path=/update params={version=2&wt=javabin} {add=[565]} 0 1
[junit4:junit4]   2> 2652 T264 C15 UPDATE [collection1] webapp=/ldtfh/i path=/update params={version=2&wt=javabin} {add=[566]} 0 1
[junit4:junit4]   2> 2655 T277 C16 UPDATE [collection1] webapp=/ldtfh/i path=/update params={version=2&wt=javabin} {add=[566]} 0 1
[junit4:junit4]   2> 2660 T265 C15 UPDATE [collection1] webapp=/ldtfh/i path=/update params={version=2&wt=javabin} {add=[567]} 0 3
[junit4:junit4]   2> 2666 T276 C16 UPDATE [collection1] webapp=/ldtfh/i path=/update params={version=2&wt=javabin} {add=[567]} 0 3
[junit4:junit4]   2> 2670 T266 C15 UPDATE [collection1] webapp=/ldtfh/i path=/update params={version=2&wt=javabin} {add=[568]} 0 1
[junit4:junit4]   2> 2673 T275 C16 UPDATE [collection1] webapp=/ldtfh/i path=/update params={version=2&wt=javabin} {add=[568]} 0 1
[junit4:junit4]   2> 2676 T263 C15 UPDATE [collection1] webapp=/ldtfh/i path=/update params={version=2&wt=javabin} {add=[569]} 0 1
[junit4:junit4]   2> 2679 T274 C16 UPDATE [collection1] webapp=/ldtfh/i path=/update params={version=2&wt=javabin} {add=[569]} 0 1
[junit4:junit4]   2> 2682 T264 C15 UPDATE [collection1] webapp=/ldtfh/i path=/update params={version=2&wt=javabin} {add=[570]} 0 1
[junit4:junit4]   2> 2685 T277 C16 UPDATE [collection1] webapp=/ldtfh/i path=/update params={version=2&wt=javabin} {add=[570]} 0 1
[junit4:junit4]   2> 2688 T265 C15 UPDATE [collection1] webapp=/ldtfh/i path=/update params={version=2&wt=javabin} {add=[571]} 0 1
[junit4:junit4]   2> 2691 T276 C16 UPDATE [collection1] webapp=/ldtfh/i path=/update params={version=2&wt=javabin} {add=[571]} 0 1
[junit4:junit4]   2> 2694 T266 C15 UPDATE [collection1] webapp=/ldtfh/i path=/update params={version=2&wt=javabin} {add=[572]} 0 1
[junit4:junit4]   2> 2696 T275 C16 UPDATE [collection1] webapp=/ldtfh/i path=/update params={version=2&wt=javabin} {add=[572]} 0 0
[junit4:junit4]   2> 2699 T263 C15 UPDATE [collection1] webapp=/ldtfh/i path=/update params={version=2&wt=javabin} {add=[573]} 0 1
[junit4:junit4]   2> 2701 T277 C16 UPDATE [collection1] webapp=/ldtfh/i path=/update params={version=2&wt=javabin} {add=[573]} 0 0
[junit4:junit4]   2> 2703 T264 C15 UPDATE [collection1] webapp=/ldtfh/i path=/update params={version=2&wt=javabin} {add=[574]} 0 0
[junit4:junit4]   2> 2706 T276 C16 UPDATE [collection1] webapp=/ldtfh/i path=/update params={version=2&wt=javabin} {add=[574]} 0 0
[junit4:junit4]   2> 2708 T265 C15 UPDATE [collection1] webapp=/ldtfh/i path=/update params={version=2&wt=javabin} {add=[575]} 0 0
[junit4:junit4]   2> 2711 T275 C16 UPDATE [collection1] webapp=/ldtfh/i path=/update params={version=2&wt=javabin} {add=[575]} 0 1
[junit4:junit4]   2> 2713 T266 C15 UPDATE [collection1] webapp=/ldtfh/i path=/update params={version=2&wt=javabin} {add=[576]} 0 0
[junit4:junit4]   2> 2716 T274 C16 UPDATE [collection1] webapp=/ldtfh/i path=/update params={version=2&wt=javabin} {add=[576]} 0 1
[junit4:junit4]   2> 2721 T263 C15 UPDATE [collection1] webapp=/ldtfh/i path=/update params={version=2&wt=javabin} {add=[577]} 0 3
[junit4:junit4]   2> 2727 T277 C16 UPDATE [collection1] webapp=/ldtfh/i path=/update params={version=2&wt=javabin} {add=[577]} 0 3
[junit4:junit4]   2> 2731 T264 C15 UPDATE [collection1] webapp=/ldtfh/i path=/update params={version=2&wt=javabin} {add=[578]} 0 1
[junit4:junit4]   2> 2734 T276 C16 UPDATE [collection1] webapp=/ldtfh/i path=/update params={version=2&wt=javabin} {add=[578]} 0 0
[junit4:junit4]   2> 2737 T265 C15 UPDATE [collection1] webapp=/ldtfh/i path=/update params={version=2&wt=javabin} {add=[579]} 0 0
[junit4:junit4]   2> 2740 T275 C16 UPDATE [collection1] webapp=/ldtfh/i path=/update params={version=2&wt=javabin} {add=[579]} 0 0
[junit4:junit4]   2> 2743 T266 C15 UPDATE [collection1] webapp=/ldtfh/i path=/update params={version=2&wt=javabin} {add=[580]} 0 0
[junit4:junit4]   2> 2746 T274 C16 UPDATE [collection1] webapp=/ldtfh/i path=/update params={version=2&wt=javabin} {add=[580]} 0 0
[junit4:junit4]   2> 2749 T263 C15 UPDATE [collection1] webapp=/ldtfh/i path=/update params={version=2&wt=javabin} {add=[581]} 0 0
[junit4:junit4]   2> 2752 T277 C16 UPDATE [collection1] webapp=/ldtfh/i path=/update params={version=2&wt=javabin} {add=[581]} 0 0
[junit4:junit4]   2> 2755 T264 C15 UPDATE [collection1] webapp=/ldtfh/i path=/update params={version=2&wt=javabin} {add=[582]} 0 0
[junit4:junit4]   2> 2758 T276 C16 UPDATE [collection1] webapp=/ldtfh/i path=/update params={version=2&wt=javabin} {add=[582]} 0 0
[junit4:junit4]   2> 2781 T265 C15 UPDATE [collection1] webapp=/ldtfh/i path=/update params={version=2&wt=javabin} {add=[583]} 0 1
[junit4:junit4]   2> 2784 T275 C16 UPDATE [collection1] webapp=/ldtfh/i path=/update params={version=2&wt=javabin} {add=[583]} 0 1
[junit4:junit4]   2> 2787 T266 C15 UPDATE [collection1] webapp=/ldtfh/i path=/update params={version=2&wt=javabin} {add=[584]} 0 1
[junit4:junit4]   2> 2791 T274 C16 UPDATE [collection1] webapp=/ldtfh/i path=/update params={version=2&wt=javabin} {add=[584]} 0 0
[junit4:junit4]   2> 2794 T263 C15 UPDATE [collection1] webapp=/ldtfh/i path=/update params={version=2&wt=javabin} {add=[585]} 0 0
[junit4:junit4]   2> 2797 T277 C16 UPDATE [collection1] webapp=/ldtfh/i path=/update params={version=2&wt=javabin} {add=[585]} 0 0
[junit4:junit4]   2> 2800 T264 C15 UPDATE [collection1] webapp=/ldtfh/i path=/update params={version=2&wt=javabin} {add=[586]} 0 0
[junit4:junit4]   2> 2804 T276 C16 UPDATE [collection1] webapp=/ldtfh/i path=/update params={version=2&wt=javabin} {add=[586]} 0 1
[junit4:junit4]   2> 2809 T265 C15 UPDATE [collection1] webapp=/ldtfh/i path=/update params={version=2&wt=javabin} {add=[587]} 0 3
[junit4:junit4]   2> 2815 T275 C16 UPDATE [collection1] webapp=/ldtfh/i path=/update params={version=2&wt=javabin} {add=[587]} 0 3
[junit4:junit4]   2> 2819 T263 C15 UPDATE [collection1] webapp=/ldtfh/i path=/update params={version=2&wt=javabin} {add=[588]} 0 1
[junit4:junit4]   2> 2822 T274 C16 UPDATE [collection1] webapp=/ldtfh/i path=/update params={version=2&wt=javabin} {add=[588]} 0 1
[junit4:junit4]   2> 2825 T264 C15 UPDATE [collection1] webapp=/ldtfh/i path=/update params={version=2&wt=javabin} {add=[589]} 0 0
[junit4:junit4]   2> 2828 T277 C16 UPDATE [collection1] webapp=/ldtfh/i path=/update params={version=2&wt=javabin} {add=[589]} 0 0
[junit4:junit4]   2> 2832 T265 C15 UPDATE [collection1] webapp=/ldtfh/i path=/update params={version=2&wt=javabin} {add=[590]} 0 1
[junit4:junit4]   2> 2835 T276 C16 UPDATE [collection1] webapp=/ldtfh/i path=/update params={version=2&wt=javabin} {add=[590]} 0 1
[junit4:junit4]   2> 2838 T266 C15 UPDATE [collection1] webapp=/ldtfh/i path=/update params={version=2&wt=javabin} {add=[591]} 0 1
[junit4:junit4]   2> 2843 T275 C16 UPDATE [collection1] webapp=/ldtfh/i path=/update params={version=2&wt=javabin} {add=[591]} 0 1
[junit4:junit4]   2> 2846 T263 C15 UPDATE [collection1] webapp=/ldtfh/i path=/update params={version=2&wt=javabin} {add=[592]} 0 1
[junit4:junit4]   2> 2851 T274 C16 UPDATE [collection1] webapp=/ldtfh/i path=/update params={version=2&wt=javabin} {add=[592]} 0 0
[junit4:junit4]   2> 2855 T264 C15 UPDATE [collection1] webapp=/ldtfh/i path=/update params={version=2&wt=javabin} {add=[593]} 0 1
[junit4:junit4]   2> 2858 T277 C16 UPDATE [collection1] webapp=/ldtfh/i path=/update params={version=2&wt=javabin} {add=[593]} 0 1
[junit4:junit4]   2> 2861 T266 C15 UPDATE [collection1] webapp=/ldtfh/i path=/update params={version=2&wt=javabin} {add=[594]} 0 0
[junit4:junit4]   2> 2865 T276 C16 UPDATE [collection1] webapp=/ldtfh/i path=/update params={version=2&wt=javabin} {add=[594]} 0 1
[junit4:junit4]   2> 2868 T263 C15 UPDATE [collection1] webapp=/ldtfh/i path=/update params={version=2&wt=javabin} {add=[595]} 0 1
[junit4:junit4]   2> 2871 T275 C16 UPDATE [collection1] webapp=/ldtfh/i path=/update params={version=2&wt=javabin} {add=[595]} 0 1
[junit4:junit4]   2> 2874 T264 C15 UPDATE [collection1] webapp=/ldtfh/i path=/update params={version=2&wt=javabin} {add=[596]} 0 1
[junit4:junit4]   2> 2877 T274 C16 UPDATE [collection1] webapp=/ldtfh/i path=/update params={version=2&wt=javabin} {add=[596]} 0 1
[junit4:junit4]   2> 2882 T265 C15 UPDATE [collection1] webapp=/ldtfh/i path=/update params={version=2&wt=javabin} {add=[597]} 0 3
[junit4:junit4]   2> 2888 T277 C16 UPDATE [collection1] webapp=/ldtfh/i path=/update params={version=2&wt=javabin} {add=[597]} 0 3
[junit4:junit4]   2> 2891 T266 C15 UPDATE [collection1] webapp=/ldtfh/i path=/update params={version=2&wt=javabin} {add=[598]} 0 0
[junit4:junit4]   2> 2895 T276 C16 UPDATE [collection1] webapp=/ldtfh/i path=/update params={version=2&wt=javabin} {add=[598]} 0 1
[junit4:junit4]   2> 2898 T263 C15 UPDATE [collection1] webapp=/ldtfh/i path=/update params={version=2&wt=javabin} {add=[599]} 0 0
[junit4:junit4]   2> 2901 T275 C16 UPDATE [collection1] webapp=/ldtfh/i path=/update params={version=2&wt=javabin} {add=[599]} 0 1
[junit4:junit4]   2> 2904 T264 C15 oasu.DirectUpdateHandler2.commit start commit{flags=0,_version_=0,optimize=false,openSearcher=true,waitSearcher=true,expungeDeletes=false,softCommit=false}
[junit4:junit4]   2> 2914 T264 C15 oasc.SolrDeletionPolicy.onCommit SolrDeletionPolicy.onCommit: commits:num=2
[junit4:junit4]   2> 		commit{dir=RateLimitedDirectoryWrapper(MockDirWrapper(org.apache.lucene.store.RAMDirectory@e59a459 lockFactory=org.apache.lucene.store.NativeFSLockFactory@45e91ace)),segFN=segments_2,generation=2,filenames=[segments_2]
[junit4:junit4]   2> 		commit{dir=RateLimitedDirectoryWrapper(MockDirWrapper(org.apache.lucene.store.RAMDirectory@e59a459 lockFactory=org.apache.lucene.store.NativeFSLockFactory@45e91ace)),segFN=segments_3,generation=3,filenames=[_i_TestBloomFilteredLucene41Postings_0.blm, _h_Direct_0.doc, _j_Pulsing41_0.tim, _j_Direct_0.tip, _g_TestBloomFilteredLucene41Postings_0.tim, _j_Asserting_0.pos, _i_Direct_0.doc, _i.fnm, _j_TestBloomFilteredLucene41Postings_0.tim, _i_Pulsing41_0.tim, _g_TestBloomFilteredLucene41Postings_0.pos, _j_nrm.cfe, _g_Pulsing41_0.tip, _j_TestBloomFilteredLucene41Postings_0.tip, segments_3, _g_Pulsing41_0.pos, _i_Pulsing41_0.tip, _i_Direct_0.tim, _i_nrm.cfe, _g_Asserting_0.tip, _g_nrm.cfs, _i_TestBloomFilteredLucene41Postings_0.doc, _h_TestBloomFilteredLucene41Postings_0.pos, _j_Asserting_0.tip, _h_Asserting_0.pos, _g_Direct_0.tim, _j_nrm.cfs, _g_TestBloomFilteredLucene41Postings_0.doc, _j_Direct_0.doc, _i_nrm.cfs, _h_TestBloomFilteredLucene41Postings_0.doc, _h_Pulsing41_0.tip, _g.fdx, _h_Pulsing41_0.doc, _g_Direct_0.doc, _h.fdx, _g_TestBloomFilteredLucene41Postings_0.blm, _h.si, _j_Direct_0.tim, _i_TestBloomFilteredLucene41Postings_0.pos, _j.fdt, _h_Pulsing41_0.tim, _g_Direct_0.pos, _i.si, _i_Asserting_0.tim, _i.fdx, _j_TestBloomFilteredLucene41Postings_0.doc, _j.fdx, _h_Pulsing41_0.pos, _i_Asserting_0.pos, _j_Direct_0.pos, _g_Asserting_0.tim, _h_Direct_0.tim, _i_Asserting_0.doc, _h_nrm.cfs, _i_Pulsing41_0.doc, _g_Direct_0.tip, _j_Pulsing41_0.tip, _h_TestBloomFilteredLucene41Postings_0.blm, _j_Asserting_0.doc, _h_nrm.cfe, _g.fnm, _j_Pulsing41_0.doc, _h_TestBloomFilteredLucene41Postings_0.tim, _g_Asserting_0.pos, _j_TestBloomFilteredLucene41Postings_0.pos, _h_Direct_0.tip, _j_TestBloomFilteredLucene41Postings_0.blm, _i_Asserting_0.tip, _g_nrm.cfe, _h.fdt, _i_Pulsing41_0.pos, _i_TestBloomFilteredLucene41Postings_0.tim, _h.fnm, _j_Pulsing41_0.pos, _h_TestBloomFilteredLucene41Postings_0.tip, _g_Pulsing41_0.doc, _i_Direct_0.pos, _h_Asserting_0.tip, _g_Pulsing41_0.tim, _i_Direct_0.tip, _g.si, _g_Asserting_0.doc, _h_Direct_0.pos, _i.fdt, _j_Asserting_0.tim, _g.fdt, _g_TestBloomFilteredLucene41Postings_0.tip, _j.fnm, _h_Asserting_0.doc, _h_Asserting_0.tim, _i_TestBloomFilteredLucene41Postings_0.tip, _j.si]
[junit4:junit4]   2> 2915 T264 C15 oasc.SolrDeletionPolicy.updateCommits newest commit = 3[_i_TestBloomFilteredLucene41Postings_0.blm, _h_Direct_0.doc, _j_Pulsing41_0.tim, _j_Direct_0.tip, _g_TestBloomFilteredLucene41Postings_0.tim, _j_Asserting_0.pos, _i_Direct_0.doc, _i.fnm, _j_TestBloomFilteredLucene41Postings_0.tim, _i_Pulsing41_0.tim, _g_TestBloomFilteredLucene41Postings_0.pos, _j_nrm.cfe, _g_Pulsing41_0.tip, _j_TestBloomFilteredLucene41Postings_0.tip, segments_3, _g_Pulsing41_0.pos, _i_Pulsing41_0.tip, _i_Direct_0.tim, _i_nrm.cfe, _g_Asserting_0.tip, _g_nrm.cfs, _i_TestBloomFilteredLucene41Postings_0.doc, _h_TestBloomFilteredLucene41Postings_0.pos, _j_Asserting_0.tip, _h_Asserting_0.pos, _g_Direct_0.tim, _j_nrm.cfs, _g_TestBloomFilteredLucene41Postings_0.doc, _j_Direct_0.doc, _i_nrm.cfs, _h_TestBloomFilteredLucene41Postings_0.doc, _h_Pulsing41_0.tip, _g.fdx, _h_Pulsing41_0.doc, _g_Direct_0.doc, _h.fdx, _g_TestBloomFilteredLucene41Postings_0.blm, _h.si, _j_Direct_0.tim, _i_TestBloomFilteredLucene41Postings_0.pos, _j.fdt, _h_Pulsing41_0.tim, _g_Direct_0.pos, _i.si, _i_Asserting_0.tim, _i.fdx, _j_TestBloomFilteredLucene41Postings_0.doc, _j.fdx, _h_Pulsing41_0.pos, _i_Asserting_0.pos, _j_Direct_0.pos, _g_Asserting_0.tim, _h_Direct_0.tim, _i_Asserting_0.doc, _h_nrm.cfs, _i_Pulsing41_0.doc, _g_Direct_0.tip, _j_Pulsing41_0.tip, _h_TestBloomFilteredLucene41Postings_0.blm, _j_Asserting_0.doc, _h_nrm.cfe, _g.fnm, _j_Pulsing41_0.doc, _h_TestBloomFilteredLucene41Postings_0.tim, _g_Asserting_0.pos, _j_TestBloomFilteredLucene41Postings_0.pos, _h_Direct_0.tip, _j_TestBloomFilteredLucene41Postings_0.blm, _i_Asserting_0.tip, _g_nrm.cfe, _h.fdt, _i_Pulsing41_0.pos, _i_TestBloomFilteredLucene41Postings_0.tim, _h.fnm, _j_Pulsing41_0.pos, _h_TestBloomFilteredLucene41Postings_0.tip, _g_Pulsing41_0.doc, _i_Direct_0.pos, _h_Asserting_0.tip, _g_Pulsing41_0.tim, _i_Direct_0.tip, _g.si, _g_Asserting_0.doc, _h_Direct_0.pos, _i.fdt, _j_Asserting_0.tim, _g.fdt, _g_TestBloomFilteredLucene41Postings_0.tip, _j.fnm, _h_Asserting_0.doc, _h_Asserting_0.tim, _i_TestBloomFilteredLucene41Postings_0.tip, _j.si]
[junit4:junit4]   2> 2916 T264 C15 oasc.CachingDirectoryFactory.close Releasing directory:/mnt/ssd/jenkins/workspace/Lucene-Solr-4.x-Linux/solr/build/solr-core/test/J1/./org.apache.solr.TestDistributedGrouping-1355882546117/control/data
[junit4:junit4]   2> 2924 T264 C15 oass.SolrIndexSearcher.<init> Opening Searcher@1ddc10a0 main
[junit4:junit4]   2> 2925 T264 C15 oasu.DirectUpdateHandler2.commit end_commit_flush
[junit4:junit4]   2> 2926 T268 oasc.SolrCore.registerSearcher [collection1] Registered new searcher Searcher@1ddc10a0 main{StandardDirectoryReader(segments_3:42 _h(4.1):C150 _g(4.1):C10 _i(4.1):C10 _j(4.1):C2)}
[junit4:junit4]   2> 2927 T268 oasc.CachingDirectoryFactory.close Releasing directory:/mnt/ssd/jenkins/workspace/Lucene-Solr-4.x-Linux/solr/build/solr-core/test/J1/./org.apache.solr.TestDistributedGrouping-1355882546117/control/data/index
[junit4:junit4]   2> 2927 T264 C15 UPDATE [collection1] webapp=/ldtfh/i path=/update params={version=2&commit=true&softCommit=false&waitSearcher=true&wt=javabin} {commit=} 0 24
[junit4:junit4]   2> 2930 T274 C16 oasu.DirectUpdateHandler2.commit start commit{flags=0,_version_=0,optimize=false,openSearcher=true,waitSearcher=true,expungeDeletes=false,softCommit=false}
[junit4:junit4]   2> 2941 T274 C16 oasc.SolrDeletionPolicy.onCommit SolrDeletionPolicy.onCommit: commits:num=2
[junit4:junit4]   2> 		commit{dir=RateLimitedDirectoryWrapper(MockDirWrapper(org.apache.lucene.store.RAMDirectory@9620413 lockFactory=org.apache.lucene.store.NativeFSLockFactory@23501896)),segFN=segments_2,generation=2,filenames=[segments_2]
[junit4:junit4]   2> 		commit{dir=RateLimitedDirectoryWrapper(MockDirWrapper(org.apache.lucene.store.RAMDirectory@9620413 lockFactory=org.apache.lucene.store.NativeFSLockFactory@23501896)),segFN=segments_3,generation=3,filenames=[_i_TestBloomFilteredLucene41Postings_0.blm, _h_Direct_0.doc, _j_Pulsing41_0.tim, _j_Direct_0.tip, _g_TestBloomFilteredLucene41Postings_0.tim, _j_Asserting_0.pos, _i_Direct_0.doc, _i.fnm, _j_TestBloomFilteredLucene41Postings_0.tim, _i_Pulsing41_0.tim, _g_TestBloomFilteredLucene41Postings_0.pos, _j_nrm.cfe, _g_Pulsing41_0.tip, _j_TestBloomFilteredLucene41Postings_0.tip, segments_3, _g_Pulsing41_0.pos, _i_Pulsing41_0.tip, _i_Direct_0.tim, _i_nrm.cfe, _g_Asserting_0.tip, _g_nrm.cfs, _i_TestBloomFilteredLucene41Postings_0.doc, _h_TestBloomFilteredLucene41Postings_0.pos, _j_Asserting_0.tip, _h_Asserting_0.pos, _g_Direct_0.tim, _j_nrm.cfs, _g_TestBloomFilteredLucene41Postings_0.doc, _j_Direct_0.doc, _i_nrm.cfs, _h_TestBloomFilteredLucene41Postings_0.doc, _h_Pulsing41_0.tip, _g.fdx, _h_Pulsing41_0.doc, _g_Direct_0.doc, _h.fdx, _g_TestBloomFilteredLucene41Postings_0.blm, _h.si, _j_Direct_0.tim, _i_TestBloomFilteredLucene41Postings_0.pos, _j.fdt, _h_Pulsing41_0.tim, _g_Direct_0.pos, _i.si, _i_Asserting_0.tim, _i.fdx, _j_TestBloomFilteredLucene41Postings_0.doc, _j.fdx, _h_Pulsing41_0.pos, _i_Asserting_0.pos, _j_Direct_0.pos, _g_Asserting_0.tim, _h_Direct_0.tim, _i_Asserting_0.doc, _h_nrm.cfs, _i_Pulsing41_0.doc, _g_Direct_0.tip, _j_Pulsing41_0.tip, _h_TestBloomFilteredLucene41Postings_0.blm, _j_Asserting_0.doc, _h_nrm.cfe, _g.fnm, _j_Pulsing41_0.doc, _h_TestBloomFilteredLucene41Postings_0.tim, _g_Asserting_0.pos, _j_TestBloomFilteredLucene41Postings_0.pos, _h_Direct_0.tip, _j_TestBloomFilteredLucene41Postings_0.blm, _i_Asserting_0.tip, _g_nrm.cfe, _h.fdt, _i_Pulsing41_0.pos, _i_TestBloomFilteredLucene41Postings_0.tim, _h.fnm, _j_Pulsing41_0.pos, _h_TestBloomFilteredLucene41Postings_0.tip, _g_Pulsing41_0.doc, _i_Direct_0.pos, _h_Asserting_0.tip, _g_Pulsing41_0.tim, _i_Direct_0.tip, _g.si, _g_Asserting_0.doc, _h_Direct_0.pos, _i.fdt, _j_Asserting_0.tim, _g.fdt, _g_TestBloomFilteredLucene41Postings_0.tip, _j.fnm, _h_Asserting_0.doc, _h_Asserting_0.tim, _i_TestBloomFilteredLucene41Postings_0.tip, _j.si]
[junit4:junit4]   2> 2942 T274 C16 oasc.SolrDeletionPolicy.updateCommits newest commit = 3[_i_TestBloomFilteredLucene41Postings_0.blm, _h_Direct_0.doc, _j_Pulsing41_0.tim, _j_Direct_0.tip, _g_TestBloomFilteredLucene41Postings_0.tim, _j_Asserting_0.pos, _i_Direct_0.doc, _i.fnm, _j_TestBloomFilteredLucene41Postings_0.tim, _i_Pulsing41_0.tim, _g_TestBloomFilteredLucene41Postings_0.pos, _j_nrm.cfe, _g_Pulsing41_0.tip, _j_TestBloomFilteredLucene41Postings_0.tip, segments_3, _g_Pulsing41_0.pos, _i_Pulsing41_0.tip, _i_Direct_0.tim, _i_nrm.cfe, _g_Asserting_0.tip, _g_nrm.cfs, _i_TestBloomFilteredLucene41Postings_0.doc, _h_TestBloomFilteredLucene41Postings_0.pos, _j_Asserting_0.tip, _h_Asserting_0.pos, _g_Direct_0.tim, _j_nrm.cfs, _g_TestBloomFilteredLucene41Postings_0.doc, _j_Direct_0.doc, _i_nrm.cfs, _h_TestBloomFilteredLucene41Postings_0.doc, _h_Pulsing41_0.tip, _g.fdx, _h_Pulsing41_0.doc, _g_Direct_0.doc, _h.fdx, _g_TestBloomFilteredLucene41Postings_0.blm, _h.si, _j_Direct_0.tim, _i_TestBloomFilteredLucene41Postings_0.pos, _j.fdt, _h_Pulsing41_0.tim, _g_Direct_0.pos, _i.si, _i_Asserting_0.tim, _i.fdx, _j_TestBloomFilteredLucene41Postings_0.doc, _j.fdx, _h_Pulsing41_0.pos, _i_Asserting_0.pos, _j_Direct_0.pos, _g_Asserting_0.tim, _h_Direct_0.tim, _i_Asserting_0.doc, _h_nrm.cfs, _i_Pulsing41_0.doc, _g_Direct_0.tip, _j_Pulsing41_0.tip, _h_TestBloomFilteredLucene41Postings_0.blm, _j_Asserting_0.doc, _h_nrm.cfe, _g.fnm, _j_Pulsing41_0.doc, _h_TestBloomFilteredLucene41Postings_0.tim, _g_Asserting_0.pos, _j_TestBloomFilteredLucene41Postings_0.pos, _h_Direct_0.tip, _j_TestBloomFilteredLucene41Postings_0.blm, _i_Asserting_0.tip, _g_nrm.cfe, _h.fdt, _i_Pulsing41_0.pos, _i_TestBloomFilteredLucene41Postings_0.tim, _h.fnm, _j_Pulsing41_0.pos, _h_TestBloomFilteredLucene41Postings_0.tip, _g_Pulsing41_0.doc, _i_Direct_0.pos, _h_Asserting_0.tip, _g_Pulsing41_0.tim, _i_Direct_0.tip, _g.si, _g_Asserting_0.doc, _h_Direct_0.pos, _i.fdt, _j_Asserting_0.tim, _g.fdt, _g_TestBloomFilteredLucene41Postings_0.tip, _j.fnm, _h_Asserting_0.doc, _h_Asserting_0.tim, _i_TestBloomFilteredLucene41Postings_0.tip, _j.si]
[junit4:junit4]   2> 2943 T274 C16 oasc.CachingDirectoryFactory.close Releasing directory:/mnt/ssd/jenkins/workspace/Lucene-Solr-4.x-Linux/solr/build/solr-core/test/J1/./org.apache.solr.TestDistributedGrouping-1355882546117/shard0/data
[junit4:junit4]   2> 2954 T274 C16 oass.SolrIndexSearcher.<init> Opening Searcher@7457eab6 main
[junit4:junit4]   2> 2955 T274 C16 oasu.DirectUpdateHandler2.commit end_commit_flush
[junit4:junit4]   2> 2956 T279 oasc.SolrCore.registerSearcher [collection1] Registered new searcher Searcher@7457eab6 main{StandardDirectoryReader(segments_3:42 _h(4.1):C150 _g(4.1):C10 _i(4.1):C10 _j(4.1):C2)}
[junit4:junit4]   2> 2957 T279 oasc.CachingDirectoryFactory.close Releasing directory:/mnt/ssd/jenkins/workspace/Lucene-Solr-4.x-Linux/solr/build/solr-core/test/J1/./org.apache.solr.TestDistributedGrouping-1355882546117/shard0/data/index
[junit4:junit4]   2> 2957 T274 C16 UPDATE [collection1] webapp=/ldtfh/i path=/update params={version=2&commit=true&softCommit=false&waitSearcher=true&wt=javabin} {commit=} 0 27
[junit4:junit4]   2> 3000 T265 C15 REQ [collection1] webapp=/ldtfh/i path=/select params={sort=a_si+asc,+id+asc&group.field=a_si&group.limit=10&q=*:*&rows=100&fl=id,a_si&group=true&version=2&distrib=false&wt=javabin} hits=172 status=0 QTime=39 
[junit4:junit4]   2> 3025 T275 C16 REQ [collection1] webapp=/ldtfh/i path=/select params={sort=a_si+asc,+id+asc&group.field=a_si&group.limit=10&group.distributed.first=true&NOW=1355882549128&wt=javabin&q=*:*&start=0&rows=100&fl=id&group=true&version=2&distrib=false&isShard=true&shard.url=127.0.0.1:33418/ldtfh/i} status=0 QTime=2 
[junit4:junit4]   2> 3044 T277 C16 REQ [collection1] webapp=/ldtfh/i path=/select params={sort=a_si+asc,+id+asc&group.field=a_si&group.limit=10&NOW=1355882549128&wt=javabin&group.topgroups.a_si=-987&group.topgroups.a_si=-600&group.topgroups.a_si=-100&group.topgroups.a_si=2&group.topgroups.a_si=7&group.topgroups.a_si=50&group.topgroups.a_si=100&group.topgroups.a_si=123&group.topgroups.a_si=232&group.topgroups.a_si=233&group.topgroups.a_si=379&group.topgroups.a_si=500&group.topgroups.a_si=876&group.topgroups.a_si=4321&group.topgroups.a_si=9999&group.topgroups.a_si=%01&q=*:*&start=0&rows=100&fl=id&group=true&version=2&distrib=false&isShard=true&shard.url=127.0.0.1:33418/ldtfh/i&group.distributed.second=true} status=0 QTime=11 
[junit4:junit4]   2> 3055 T274 C16 REQ [collection1] webapp=/ldtfh/i path=/select params={group.field=a_si&group.limit=10&ids=22,23,500,501,502,503,504,505,506,507,508,509,9,8,1,10,3,2,5,4,7,6,15,16,17,18,11,12,14,19,104,103,105,100,102,101,21,20&NOW=1355882549128&wt=javabin&q=*:*&rows=100&fl=id,a_si,id&version=2&distrib=false&isShard=true&shard.url=127.0.0.1:33418/ldtfh/i} status=0 QTime=3 
[junit4:junit4]   2> 3067 T276 C16 REQ [collection1] webapp=/ldtfh/i path=/select params={sort=a_si+asc,+id+asc&group.field=a_si&group.limit=10&shards=127.0.0.1:33418/ldtfh/i&q=*:*&rows=100&fl=id,a_si&group=true&version=2&wt=javabin} status=0 QTime=47 
[junit4:junit4]   2> 3075 T266 C15 REQ [collection1] webapp=/ldtfh/i path=/select params={sort=id+asc,+_docid_+asc&group.field=a_si&group.limit=10&q=*:*&rows=100&fl=id,a_si&group=true&version=2&distrib=false&wt=javabin} hits=172 status=0 QTime=2 
[junit4:junit4]   2> 3082 T277 C16 REQ [collection1] webapp=/ldtfh/i path=/select params={sort=id+asc,+_docid_+asc&group.field=a_si&group.limit=10&group.distributed.first=true&NOW=1355882549187&wt=javabin&q=*:*&start=0&rows=100&fl=id&group=true&version=2&distrib=false&isShard=true&shard.url=127.0.0.1:33418/ldtfh/i} status=0 QTime=1 
[junit4:junit4]   2> 3090 T274 C16 REQ [collection1] webapp=/ldtfh/i path=/select params={sort=id+asc,+_docid_+asc&group.field=a_si&group.limit=10&NOW=1355882549187&wt=javabin&group.topgroups.a_si=100&group.topgroups.a_si=50&group.topgroups.a_si=2&group.topgroups.a_si=-100&group.topgroups.a_si=500&group.topgroups.a_si=-600&group.topgroups.a_si=123&group.topgroups.a_si=876&group.topgroups.a_si=7&group.topgroups.a_si=4321&group.topgroups.a_si=-987&group.topgroups.a_si=379&group.topgroups.a_si=%01&group.topgroups.a_si=232&group.topgroups.a_si=233&group.topgroups.a_si=9999&q=*:*&start=0&rows=100&fl=id&group=true&version=2&distrib=false&isShard=true&shard.url=127.0.0.1:33418/ldtfh/i&group.distributed.second=true} status=0 QTime=5 
[junit4:junit4]   2> 3096 T276 C16 REQ [collection1] webapp=/ldtfh/i path=/select params={group.field=a_si&group.limit=10&ids=9,8,10,1,3,2,5,4,7,6,22,23,500,501,502,503,504,505,506,507,508,509,104,103,105,100,102,101,21,20,15,16,17,18,11,12,14,19&NOW=1355882549187&wt=javabin&q=*:*&rows=100&fl=id,a_si,id&version=2&distrib=false&isShard=true&shard.url=127.0.0.1:33418/ldtfh/i} status=0 QTime=3 
[junit4:junit4]   2> 3098 T275 C16 REQ [collection1] webapp=/ldtfh/i path=/select params={sort=id+asc,+_docid_+asc&group.field=a_si&group.limit=10&shards=127.0.0.1:33418/ldtfh/i&q=*:*&rows=100&fl=id,a_si&group=true&version=2&wt=javabin} status=0 QTime=19 
[junit4:junit4]   2> 3108 T263 C15 REQ [collection1] webapp=/ldtfh/i path=/select params={sort={!func}add(a_si,5)+asc,+id+asc&group.field=a_si&group.limit=10&q=*:*&rows=100&fl=id,a_si&group=true&version=2&distrib=false&wt=javabin} hits=172 status=0 QTime=6 
[junit4:junit4]   2> 3116 T276 C16 REQ [collection1] webapp=/ldtfh/i path=/select params={sort={!func}add(a_si,5)+asc,+id+asc&group.field=a_si&group.limit=10&group.distributed.first=true&NOW=1355882549220&wt=javabin&q=*:*&start=0&rows=100&fl=id&group=true&version=2&distrib=false&isShard=true&shard.url=[ff01::114]:33332/ldtfh/i|[ff01::083]:33332/ldtfh/i|127.0.0.1:33418/ldtfh/i} status=0 QTime=2 
[junit4:junit4]   2> 3125 T275 C16 REQ [collection1] webapp=/ldtfh/i path=/select params={sort={!func}add(a_si,5)+asc,+id+asc&group.field=a_si&group.limit=10&NOW=1355882549220&wt=javabin&group.topgroups.a_si=-987&group.topgroups.a_si=-600&group.topgroups.a_si=-100&group.topgroups.a_si=%01&group.topgroups.a_si=2&group.topgroups.a_si=7&group.topgroups.a_si=50&group.topgroups.a_si=100&group.topgroups.a_si=123&group.topgroups.a_si=232&group.topgroups.a_si=233&group.topgroups.a_si=379&group.topgroups.a_si=500&group.topgroups.a_si=876&group.topgroups.a_si=4321&group.topgroups.a_si=9999&q=*:*&start=0&rows=100&fl=id&group=true&version=2&distrib=false&isShard=true&shard.url=[ff01::114]:33332/ldtfh/i|[ff01::083]:33332/ldtfh/i|127.0.0.1:33418/ldtfh/i&group.distributed.second=true} status=0 QTime=6 
[junit4:junit4]   2> 3133 T277 C16 REQ [collection1] webapp=/ldtfh/i path=/select params={group.field=a_si&group.limit=10&ids=503,504,505,506,507,508,509,22,23,500,501,502,10,1,3,2,5,4,7,6,9,8,19,15,16,17,18,11,12,14,21,20,104,103,105,100,102,101&NOW=1355882549220&wt=javabin&q=*:*&rows=100&fl=id,a_si,id&version=2&distrib=false&isShard=true&shard.url=[ff01::114]:33332/ldtfh/i|[ff01::083]:33332/ldtfh/i|127.0.0.1:33418/ldtfh/i} status=0 QTime=4 
[junit4:junit4]   2> 3135 T274 C16 REQ [collection1] webapp=/ldtfh/i path=/select params={sort={!func}add(a_si,5)+asc,+id+asc&group.field=a_si&group.limit=10&shards=[ff01::114]:33332/ldtfh/i|[ff01::083]:33332/ldtfh/i|127.0.0.1:33418/ldtfh/i&q=*:*&rows=100&fl=id,a_si&group=true&version=2&wt=javabin} status=0 QTime=23 
[junit4:junit4]   2> 3147 T264 C15 oasr.UnInvertedField.<init> UnInverted multi-valued field {field=a_t,memSize=5158,tindexSize=41,time=6,phase1=6,nTerms=55,bigTerms=1,termInstances=77,uses=0}
[junit4:junit4]   2> 3148 T264 C15 REQ [collection1] webapp=/ldtfh/i path=/select params={sort=a_si+asc,+id+asc&group.field=a_si&group.limit=10&facet=true&wt=javabin&facet.field=a_t&q=*:*&rows=100&fl=id,a_si&group=true&version=2&distrib=false} hits=172 status=0 QTime=9 
[junit4:junit4]   2> 3156 T275 C16 REQ [collection1] webapp=/ldtfh/i path=/select params={sort=a_si+asc,+id+asc&group.field=a_si&group.limit=10&group.distributed.first=true&facet=false&NOW=1355882549261&wt=javabin&facet.field=a_t&q=*:*&start=0&rows=100&fl=id&group=true&version=2&distrib=false&isShard=true&shard.url=127.0.0.1:33418/ldtfh/i} status=0 QTime=0 
[junit4:junit4]   2> 3167 T277 C16 oasr.UnInvertedField.<init> UnInverted multi-valued field {field=a_t,memSize=5158,tindexSize=41,time=0,phase1=0,nTerms=55,bigTerms=1,termInstances=77,uses=0}
[junit4:junit4]   2> 3168 T277 C16 REQ [collection1] webapp=/ldtfh/i path=/select params={sort=a_si+asc,+id+asc&group.field=a_si&group.limit=10&f.a_t.facet.limit=160&facet=true&NOW=1355882549261&wt=javabin&facet.field=a_t&group.topgroups.a_si=-987&group.topgroups.a_si=-600&group.topgroups.a_si=-100&group.topgroups.a_si=2&group.topgroups.a_si=7&group.topgroups.a_si=50&group.topgroups.a_si=100&group.topgroups.a_si=123&group.topgroups.a_si=232&group.topgroups.a_si=233&group.topgroups.a_si=379&group.topgroups.a_si=500&group.topgroups.a_si=876&group.topgroups.a_si=4321&group.topgroups.a_si=9999&group.topgroups.a_si=%01&q=*:*&start=0&rows=100&fl=id&group=true&version=2&distrib=false&isShard=true&shard.url=127.0.0.1:33418/ldtfh/i&group.distributed.second=true} status=0 QTime=8 
[junit4:junit4]   2> 3175 T274 C16 REQ [collection1] webapp=/ldtfh/i path=/select params={group.field=a_si&group.limit=10&ids=504,503,506,505,508,507,509,23,22,500,502,501,1,10,2,3,4,5,6,7,8,9,19,16,15,18,17,12,11,14,20,21,103,104,105,100,101,102&facet=false&NOW=1355882549261&wt=javabin&facet.field=a_t&q=*:*&rows=100&fl=id,a_si,id&version=2&distrib=false&isShard=true&shard.url=127.0.0.1:33418/ldtfh/i} status=0 QTime=3 
[junit4:junit4]   2> 3177 T276 C16 REQ [collection1] webapp=/ldtfh/i path=/select params={sort=a_si+asc,+id+asc&group.field=a_si&group.limit=10&facet=true&wt=javabin&facet.field=a_t&shards=127.0.0.1:33418/ldtfh/i&q=*:*&rows=100&fl=id,a_si&group=true&version=2} status=0 QTime=24 
[junit4:junit4]   2> 3183 T265 C15 oasr.UnInvertedField.<init> UnInverted multi-valued field {field=other_tl1,memSize=5027,tindexSize=51,time=0,phase1=0,nTerms=18,bigTerms=0,termInstances=18,uses=0}
[junit4:junit4]   2> 3184 T265 C15 REQ [collection1] webapp=/ldtfh/i path=/select params={sort=a_si+asc,+id+asc&group.field=a_si&group.limit=10&wt=javabin&stats.field=other_tl1&q=*:*&rows=100&fl=id,a_si&group=true&version=2&distrib=false&stats=true} hits=172 status=0 QTime=3 
[junit4:junit4]   2> 3193 T277 C16 REQ [collection1] webapp=/ldtfh/i path=/select params={sort=a_si+asc,+id+asc&group.field=a_si&group.limit=10&group.distributed.first=true&NOW=1355882549297&wt=javabin&stats.field=other_tl1&q=*:*&start=0&rows=100&fl=id&group=true&version=2&distrib=false&isShard=true&shard.url=127.0.0.1:33418/ldtfh/i&stats=false} status=0 QTime=1 
[junit4:junit4]   2> 3240 T276 C16 oasr.UnInvertedField.<init> UnInverted multi-valued field {field=other_tl1,memSize=5027,tindexSize=51,time=0,phase1=0,nTerms=18,bigTerms=0,termInstances=18,uses=0}
[junit4:junit4]   2> 3241 T276 C16 REQ [collection1] webapp=/ldtfh/i path=/select params={sort=a_si+asc,+id+asc&group.field=a_si&group.limit=10&NOW=1355882549297&wt=javabin&stats.field=other_tl1&group.topgroups.a_si=-987&group.topgroups.a_si=-600&group.topgroups.a_si=-100&group.topgroups.a_si=2&group.topgroups.a_si=7&group.topgroups.a_si=50&group.topgroups.a_si=100&group.topgroups.a_si=123&group.topgroups.a_si=232&group.topgroups.a_si=233&group.topgroups.a_si=379&group.topgroups.a_si=500&group.topgroups.a_si=876&group.topgroups.a_si=4321&group.topgroups.a_si=9999&group.topgroups.a_si=%01&q=*:*&start=0&rows=100&fl=id&group=true&version=2&distrib=false&isShard=true&shard.url=127.0.0.1:33418/ldtfh/i&stats=true&group.distributed.second=true} status=0 QTime=45 
[junit4:junit4]   2> 3246 T274 C16 REQ [collection1] webapp=/ldtfh/i path=/select params={group.field=a_si&group.limit=10&ids=20,21,105,103,104,101,102,100,19,18,17,16,15,14,12,11,2,3,1,10,6,7,4,5,8,9,506,505,504,503,509,508,507,23,22,502,501,500&NOW=1355882549297&wt=javabin&stats.field=other_tl1&q=*:*&rows=100&fl=id,a_si,id&version=2&distrib=false&isShard=true&shard.url=127.0.0.1:33418/ldtfh/i&stats=false} status=0 QTime=2 
[junit4:junit4]   2> 3255 T275 C16 REQ [collection1] webapp=/ldtfh/i path=/select params={sort=a_si+asc,+id+asc&group.field=a_si&group.limit=10&wt=javabin&stats.field=other_tl1&shards=127.0.0.1:33418/ldtfh/i&q=*:*&rows=100&fl=id,a_si&group=true&version=2&stats=true} status=0 QTime=66 
[junit4:junit4]   2> 3280 T263 C15 REQ [collection1] webapp=/ldtfh/i path=/select params={sort=a_si+asc,+id+asc&spellcheck.build=true&group.field=a_si&group.limit=10&qt=spellCheckCompRH&wt=javabin&spellcheck=true&q=kings&rows=100&fl=id,a_si&group=true&version=2&distrib=false} hits=1 status=0 QTime=22 
[junit4:junit4]   2> 3309 T276 C16 REQ [collection1] webapp=/ldtfh/i path=/select params={sort=a_si+asc,+id+asc&spellcheck.build=true&group.field=a_si&spellcheck.onlyMorePopular=false&group.limit=10&group.distributed.first=true&NOW=1355882549392&wt=javabin&spellcheck=false&spellcheck.extendedResults=false&spellcheck.count=1&q=kings&start=0&rows=100&fl=id&group=true&version=2&distrib=false&isShard=true&shard.url=127.0.0.1:33418/ldtfh/i} status=0 QTime=0 
[junit4:junit4]   2> 3313 T274 C16 REQ [collection1] webapp=/ldtfh/i path=/select params={sort=a_si+asc,+id+asc&spellcheck.build=true&group.field=a_si&spellcheck.onlyMorePopular=false&group.limit=10&NOW=1355882549392&wt=javabin&spellcheck=true&spellcheck.extendedResults=false&group.topgroups.a_si=876&spellcheck.count=5&q=kings&start=0&rows=100&fl=id&group=true&version=2&distrib=false&isShard=true&shard.url=127.0.0.1:33418/ldtfh/i&group.distributed.second=true} status=0 QTime=1 
[junit4:junit4]   2> 3317 T275 C16 REQ [collection1] webapp=/ldtfh/i path=/select params={spellcheck.build=true&group.field=a_si&spellcheck.onlyMorePopular=false&group.limit=10&ids=8&NOW=1355882549392&wt=javabin&spellcheck=false&spellcheck.extendedResults=false&spellcheck.count=1&q=kings&rows=100&fl=id,a_si,id&version=2&distrib=false&isShard=true&shard.url=127.0.0.1:33418/ldtfh/i} status=0 QTime=1 
[junit4:junit4]   2> 3318 T277 C16 oashc.SpellCheckComponent.finishStage 127.0.0.1:33418/ldtfh/i null
[junit4:junit4]   2> 3318 T277 C16 oashc.SpellCheckComponent.finishStage 127.0.0.1:33418/ldtfh/i null
[junit4:junit4]   2> 3318 T277 C16 oashc.SpellCheckComponent.finishStage 127.0.0.1:33418/ldtfh/i null
[junit4:junit4]   2> 3318 T277 C16 REQ [collection1] webapp=/ldtfh/i path=/select params={sort=a_si+asc,+id+asc&spellcheck.build=true&group.field=a_si&group.limit=10&qt=spellCheckCompRH&wt=javabin&spellcheck=true&shards=127.0.0.1:33418/ldtfh/i&q=kings&rows=100&fl=id,a_si&group=true&version=2} status=0 QTime=34 
[junit4:junit4]   2> 3347 T265 C15 REQ [collection1] webapp=/ldtfh/i path=/select params={sort=a_si+asc,+id+asc&hl.fl=a_t&group.field=a_si&group.limit=10&hl=true&facet=true&wt=javabin&q=*:*&rows=100&fl=id,a_si&group=true&version=2&distrib=false} hits=172 status=0 QTime=27 
[junit4:junit4]   2> 3354 T274 C16 REQ [collection1] webapp=/ldtfh/i path=/select params={sort=a_si+asc,+id+asc&hl.fl=a_t&group.field=a_si&group.limit=10&hl=false&group.distributed.first=true&facet=false&NOW=1355882549459&wt=javabin&q=*:*&start=0&rows=100&fl=id&group=true&version=2&distrib=false&isShard=true&shard.url=[ff01::114]:33332/ldtfh/i|[ff01::083]:33332/ldtfh/i|127.0.0.1:33418/ldtfh/i} status=0 QTime=0 
[junit4:junit4]   2> 3362 T275 C16 REQ [collection1] webapp=/ldtfh/i path=/select params={sort=a_si+asc,+id+asc&hl.fl=a_t&group.field=a_si&group.limit=10&hl=false&facet=true&NOW=1355882549459&wt=javabin&group.topgroups.a_si=-987&group.topgroups.a_si=-600&group.topgroups.a_si=-100&group.topgroups.a_si=2&group.topgroups.a_si=7&group.topgroups.a_si=50&group.topgroups.a_si=100&group.topgroups.a_si=123&group.topgroups.a_si=232&group.topgroups.a_si=233&group.topgroups.a_si=379&group.topgroups.a_si=500&group.topgroups.a_si=876&group.topgroups.a_si=4321&group.topgroups.a_si=9999&group.topgroups.a_si=%01&q=*:*&start=0&rows=100&fl=id&group=true&version=2&distrib=false&isShard=true&shard.url=[ff01::114]:33332/ldtfh/i|[ff01::083]:33332/ldtfh/i|127.0.0.1:33418/ldtfh/i&group.distributed.second=true} status=0 QTime=4 
[junit4:junit4]   2> 3377 T274 C16 REQ [collection1] webapp=/ldtfh/i path=/select params={hl.fl=a_t&group.field=a_si&group.limit=10&hl=true&ids=101,102,100,105,103,104,20,21,14,12,11,18,17,16,15,19,8,9,6,7,4,5,2,3,1,10,502,501,500,23,22,509,508,507,506,505,504,503&facet=false&NOW=1355882549459&wt=javabin&q=*:*&rows=100&fl=id,a_si,id&version=2&distrib=false&isShard=true&shard.url=[ff01::114]:33332/ldtfh/i|[ff01::083]:33332/ldtfh/i|127.0.0.1:33418/ldtfh/i} status=0 QTime=11 
[junit4:junit4]   2> 3378 T276 C16 REQ [collection1] webapp=/ldtfh/i path=/select params={sort=a_si+asc,+id+asc&hl.fl=a_t&group.field=a_si&group.limit=10&hl=true&facet=true&wt=javabin&shards=[ff01::114]:33332/ldtfh/i|[ff01::083]:33332/ldtfh/i|127.0.0.1:33418/ldtfh/i&q=*:*&rows=100&fl=id,a_si&group=true&version=2} status=0 QTime=27 
[junit4:junit4]   2> 3384 T266 C15 REQ [collection1] webapp=/ldtfh/i path=/select params={sort=a_si+asc,+id+asc&group.field=a_si&group.limit=10&q=*:*&rows=100&group.sort=id+desc&fl=id,a_si&group=true&version=2&distrib=false&wt=javabin} hits=172 status=0 QTime=2 
[junit4:junit4]   2> 3392 T275 C16 REQ [collection1] webapp=/ldtfh/i path=/select params={sort=a_si+asc,+id+asc&group.field=a_si&group.limit=10&group.distributed.first=true&NOW=1355882549497&wt=javabin&q=*:*&start=0&rows=100&group.sort=id+desc&fl=id&group=true&version=2&distrib=false&isShard=true&shard.url=127.0.0.1:33418/ldtfh/i} status=0 QTime=1 
[junit4:junit4]   2> 3399 T274 C16 REQ [collection1] webapp=/ldtfh/i path=/select params={sort=a_si+asc,+id+asc&group.field=a_si&group.limit=10&NOW=1355882549497&wt=javabin&group.topgroups.a_si=-987&group.topgroups.a_si=-600&group.topgroups.a_si=-100&group.topgroups.a_si=2&group.topgroups.a_si=7&group.topgroups.a_si=50&group.topgroups.a_si=100&group.topgroups.a_si=123&group.topgroups.a_si=232&group.topgroups.a_si=233&group.topgroups.a_si=379&group.topgroups.a_si=500&group.topgroups.a_si=876&group.topgroups.a_si=4321&group.topgroups.a_si=9999&group.topgroups.a_si=%01&q=*:*&start=0&rows=100&group.sort=id+desc&fl=id&group=true&version=2&distrib=false&isShard=true&shard.url=127.0.0.1:33418/ldtfh/i&group.distributed.second=true} status=0 QTime=3 
[junit4:junit4]   2> 3413 T276 C16 REQ [collection1] webapp=/ldtfh/i path=/select params={group.field=a_si&group.limit=10&ids=7,6,5,4,3,2,1,10,140,590,591,142,592,141,593,9,8,147,599,148,598,149,143,595,144,594,145,597,146,596,22,23,21,20,19,11,12,18&NOW=1355882549497&wt=javabin&q=*:*&rows=100&group.sort=id+desc&fl=id,a_si,id&version=2&distrib=false&isShard=true&shard.url=127.0.0.1:33418/ldtfh/i} status=0 QTime=2 
[junit4:junit4]   2> 3416 T277 C16 REQ [collection1] webapp=/ldtfh/i path=/select params={sort=a_si+asc,+id+asc&group.field=a_si&group.limit=10&shards=127.0.0.1:33418/ldtfh/i&q=*:*&rows=100&group.sort=id+desc&fl=id,a_si&group=true&version=2&wt=javabin} status=0 QTime=27 
[junit4:junit4]   2> 3421 T264 C15 REQ [collection1] webapp=/ldtfh/i path=/select params={sort=a_si+asc,+id+asc&group.offset=5&group.field=a_si&group.limit=5&q=*:*&rows=100&fl=id,a_si&group=true&version=2&distrib=false&wt=javabin} hits=172 status=0 QTime=1 
[junit4:junit4]   2> 3427 T274 C16 REQ [collection1] webapp=/ldtfh/i path=/select params={sort=a_si+asc,+id+asc&group.field=a_si&group.limit=5&group.distributed.first=true&NOW=1355882549532&wt=javabin&group.offset=5&q=*:*&start=0&rows=100&fl=id&group=true&version=2&distrib=false&isShard=true&shard.url=[ff01::083]:33332/ldtfh/i|127.0.0.1:33418/ldtfh/i|[ff01::213]:33332/ldtfh/i} status=0 QTime=0 
[junit4:junit4]   2> 3435 T276 C16 REQ [collection1] webapp=/ldtfh/i path=/select params={sort=a_si+asc,+id+asc&group.field=a_si&group.limit=5&NOW=1355882549532&wt=javabin&group.offset=5&group.topgroups.a_si=-987&group.topgroups.a_si=-600&group.topgroups.a_si=-100&group.topgroups.a_si=2&group.topgroups.a_si=7&group.topgroups.a_si=50&group.topgroups.a_si=100&group.topgroups.a_si=123&group.topgroups.a_si=232&group.topgroups.a_si=233&group.topgroups.a_si=379&group.topgroups.a_si=500&group.topgroups.a_si=876&group.topgroups.a_si=4321&group.topgroups.a_si=9999&group.topgroups.a_si=%01&q=*:*&start=0&rows=100&fl=id&group=true&version=2&distrib=false&isShard=true&shard.url=[ff01::083]:33332/ldtfh/i|127.0.0.1:33418/ldtfh/i|[ff01::213]:33332/ldtfh/i&group.distributed.second=true} status=0 QTime=5 
[junit4:junit4]   2> 3440 T277 C16 REQ [collection1] webapp=/ldtfh/i path=/select params={group.field=a_si&group.limit=5&ids=102,101,105,104,103,509,507,508,505,506&NOW=1355882549532&wt=javabin&group.offset=5&q=*:*&rows=100&fl=id,a_si,id&version=2&distrib=false&isShard=true&shard.url=[ff01::083]:33332/ldtfh/i|127.0.0.1:33418/ldtfh/i|[ff01::213]:33332/ldtfh/i} status=0 QTime=1 
[junit4:junit4]   2> 3441 T275 C16 REQ [collection1] webapp=/ldtfh/i path=/select params={sort=a_si+asc,+id+asc&group.offset=5&group.field=a_si&group.limit=5&shards=[ff01::083]:33332/ldtfh/i|127.0.0.1:33418/ldtfh/i|[ff01::213]:33332/ldtfh/i&q=*:*&rows=100&fl=id,a_si&group=true&version=2&wt=javabin} status=0 QTime=17 
[junit4:junit4]   2> 3446 T263 C15 REQ [collection1] webapp=/ldtfh/i path=/select params={sort=a_si+asc,+id+asc&offset=5&group.field=a_si&group.limit=5&wt=javabin&group.offset=5&q=*:*&rows=100&rows=5&fl=id,a_si&group=true&version=2&distrib=false} hits=172 status=0 QTime=1 
[junit4:junit4]   2> 3452 T276 C16 REQ [collection1] webapp=/ldtfh/i path=/select params={sort=a_si+asc,+id+asc&offset=5&group.field=a_si&group.limit=5&group.distributed.first=true&NOW=1355882549557&wt=javabin&group.offset=5&q=*:*&start=0&rows=100&fl=id&group=true&version=2&distrib=false&isShard=true&shard.url=[ff01::083]:33332/ldtfh/i|127.0.0.1:33418/ldtfh/i|[ff01::213]:33332/ldtfh/i} status=0 QTime=1 
[junit4:junit4]   2> 3458 T277 C16 REQ [collection1] webapp=/ldtfh/i path=/select params={sort=a_si+asc,+id+asc&offset=5&group.field=a_si&group.limit=5&NOW=1355882549557&wt=javabin&group.offset=5&group.topgroups.a_si=-987&group.topgroups.a_si=-600&group.topgroups.a_si=-100&group.topgroups.a_si=2&group.topgroups.a_si=7&group.topgroups.a_si=50&group.topgroups.a_si=100&group.topgroups.a_si=123&group.topgroups.a_si=232&group.topgroups.a_si=233&group.topgroups.a_si=379&group.topgroups.a_si=500&group.topgroups.a_si=876&group.topgroups.a_si=4321&group.topgroups.a_si=9999&group.topgroups.a_si=%01&q=*:*&start=0&rows=100&fl=id&group=true&version=2&distrib=false&isShard=true&shard.url=[ff01::083]:33332/ldtfh/i|127.0.0.1:33418/ldtfh/i|[ff01::213]:33332/ldtfh/i&group.distributed.second=true} status=0 QTime=3 
[junit4:junit4]   2> 3462 T275 C16 REQ [collection1] webapp=/ldtfh/i path=/select params={offset=5&group.field=a_si&group.limit=5&ids=505,506,509,507,508,105,104,103,102,101&NOW=1355882549557&wt=javabin&group.offset=5&q=*:*&rows=100&rows=5&fl=id,a_si,id&version=2&distrib=false&isShard=true&shard.url=[ff01::083]:33332/ldtfh/i|127.0.0.1:33418/ldtfh/i|[ff01::213]:33332/ldtfh/i} status=0 QTime=1 
[junit4:junit4]   2> 3463 T274 C16 REQ [collection1] webapp=/ldtfh/i path=/select params={sort=a_si+asc,+id+asc&offset=5&group.field=a_si&group.limit=5&wt=javabin&group.offset=5&shards=[ff01::083]:33332/ldtfh/i|127.0.0.1:33418/ldtfh/i|[ff01::213]:33332/ldtfh/i&q=*:*&rows=100&rows=5&fl=id,a_si&group=true&version=2} status=0 QTime=14 
[junit4:junit4]   2> 3474 T265 C15 REQ [collection1] webapp=/ldtfh/i path=/select params={sort=a_si+asc,+id+asc&offset=5&group.field=a_si&q=*:*&rows=100&rows=5&fl=id,a_si&group=true&version=2&distrib=false&group.format=simple&wt=javabin} hits=172 status=0 QTime=8 
[junit4:junit4]   2> 3480 T277 C16 REQ [collection1] webapp=/ldtfh/i path=/select params={sort=a_si+asc,+id+asc&offset=5&group.field=a_si&group.distributed.first=true&NOW=1355882549585&wt=javabin&q=*:*&start=0&rows=100&fl=id&group=true&version=2&distrib=false&group.format=simple&isShard=true&shard.url=[ff01::083]:33332/ldtfh/i|127.0.0.1:33418/ldtfh/i|[ff01::213]:33332/ldtfh/i|[ff01::114]:33332/ldtfh/i} status=0 QTime=0 
[junit4:junit4]   2> 3484 T275 C16 REQ [collection1] webapp=/ldtfh/i path=/select params={sort=a_si+asc,+id+asc&offset=5&group.field=a_si&NOW=1355882549585&wt=javabin&group.topgroups.a_si=-987&group.topgroups.a_si=-600&group.topgroups.a_si=-100&group.topgroups.a_si=2&group.topgroups.a_si=7&group.topgroups.a_si=50&group.topgroups.a_si=100&group.topgroups.a_si=123&group.topgroups.a_si=232&group.topgroups.a_si=233&group.topgroups.a_si=379&group.topgroups.a_si=500&group.topgroups.a_si=876&group.topgroups.a_si=4321&group.topgroups.a_si=9999&group.topgroups.a_si=%01&q=*:*&start=0&rows=100&fl=id&group=true&version=2&distrib=false&group.format=simple&isShard=true&shard.url=[ff01::083]:33332/ldtfh/i|127.0.0.1:33418/ldtfh/i|[ff01::213]:33332/ldtfh/i|[ff01::114]:33332/ldtfh/i&group.distributed.second=true} status=0 QTime=1 
[junit4:junit4]   2> 3489 T274 C16 REQ [collection1] webapp=/ldtfh/i path=/select params={offset=5&group.field=a_si&ids=18,23,14,500,12,11,8,9,2,3,10,1,6,7,4,5&NOW=1355882549585&wt=javabin&q=*:*&rows=100&rows=5&fl=id,a_si,id&version=2&distrib=false&group.format=simple&isShard=true&shard.url=[ff01::083]:33332/ldtfh/i|127.0.0.1:33418/ldtfh/i|[ff01::213]:33332/ldtfh/i|[ff01::114]:33332/ldtfh/i} status=0 QTime=1 
[junit4:junit4]   2> 3490 T276 C16 REQ [collection1] webapp=/ldtfh/i path=/select params={sort=a_si+asc,+id+asc&offset=5&group.field=a_si&shards=[ff01::083]:33332/ldtfh/i|127.0.0.1:33418/ldtfh/i|[ff01::213]:33332/ldtfh/i|[ff01::114]:33332/ldtfh/i&q=*:*&rows=100&rows=5&fl=id,a_si&group=true&version=2&group.format=simple&wt=javabin} status=0 QTime=13 
[junit4:junit4]   2> 3495 T266 C15 REQ [collection1] webapp=/ldtfh/i path=/select params={sort=a_si+asc,+id+asc&offset=5&group.field=a_si&q=*:*&rows=100&rows=5&fl=id,a_si&group=true&version=2&distrib=false&group.main=true&wt=javabin} hits=172 status=0 QTime=2 
[junit4:junit4]   2> 3501 T275 C16 REQ [collection1] webapp=/ldtfh/i path=/select params={sort=a_si+asc,+id+asc&offset=5&group.field=a_si&group.distributed.first=true&NOW=1355882549606&wt=javabin&q=*:*&start=0&rows=100&fl=id&group=true&version=2&distrib=false&isShard=true&shard.url=[ff01::114]:33332/ldtfh/i|127.0.0.1:33418/ldtfh/i|[ff01::083]:33332/ldtfh/i|[ff01::213]:33332/ldtfh/i&group.main=true} status=0 QTime=1 
[junit4:junit4]   2> 3506 T274 C16 REQ [collection1] webapp=/ldtfh/i path=/select params={sort=a_si+asc,+id+asc&offset=5&group.field=a_si&NOW=1355882549606&wt=javabin&group.topgroups.a_si=-987&group.topgroups.a_si=-600&group.topgroups.a_si=-100&group.topgroups.a_si=2&group.topgroups.a_si=7&group.topgroups.a_si=50&group.topgroups.a_si=100&group.topgroups.a_si=123&group.topgroups.a_si=232&group.topgroups.a_si=233&group.topgroups.a_si=379&group.topgroups.a_si=500&group.topgroups.a_si=876&group.topgroups.a_si=4321&group.topgroups.a_si=9999&group.topgroups.a_si=%01&q=*:*&start=0&rows=100&fl=id&group=true&version=2&distrib=false&isShard=true&shard.url=[ff01::114]:33332/ldtfh/i|127.0.0.1:33418/ldtfh/i|[ff01::083]:33332/ldtfh/i|[ff01::213]:33332/ldtfh/i&group.main=true&group.distributed.second=true} status=0 QTime=1 
[junit4:junit4]   2> 3511 T276 C16 REQ [collection1] webapp=/ldtfh/i path=/select params={offset=5&group.field=a_si&ids=6,7,4,5,2,3,10,1,8,9,14,500,12,11,18,23&NOW=1355882549606&wt=javabin&q=*:*&rows=100&rows=5&fl=id,a_si,id&version=2&distrib=false&isShard=true&shard.url=[ff01::114]:33332/ldtfh/i|127.0.0.1:33418/ldtfh/i|[ff01::083]:33332/ldtfh/i|[ff01::213]:33332/ldtfh/i&group.main=true} status=0 QTime=1 
[junit4:junit4]   2> 3512 T277 C16 REQ [collection1] webapp=/ldtfh/i path=/select params={sort=a_si+asc,+id+asc&offset=5&group.field=a_si&shards=[ff01::114]:33332/ldtfh/i|127.0.0.1:33418/ldtfh/i|[ff01::083]:33332/ldtfh/i|[ff01::213]:33332/ldtfh/i&q=*:*&rows=100&rows=5&fl=id,a_si&group=true&version=2&group.main=true&wt=javabin} status=0 QTime=14 
[junit4:junit4]   2> 3515 T264 C15 REQ [collection1] webapp=/ldtfh/i path=/select params={sort=a_si+asc,+id+asc&offset=5&group.field=a_si&group.limit=5&wt=javabin&group.offset=5&q=*:*&rows=100&rows=5&fl=id,a_si&group=true&version=2&distrib=false&group.format=simple} hits=172 status=0 QTime=1 
[junit4:junit4]   2> 3521 T276 C16 REQ [collection1] webapp=/ldtfh/i path=/select params={sort=a_si+asc,+id+asc&offset=5&group.field=a_si&group.limit=5&group.distributed.first=true&NOW=1355882549626&wt=javabin&group.offset=5&q=*:*&start=0&rows=100&fl=id&group=true&version=2&distrib=false&group.format=simple&isShard=true&shard.url=[ff01::114]:33332/ldtfh/i|127.0.0.1:33418/ldtfh/i|[ff01::083]:33332/ldtfh/i} status=0 QTime=0 
[junit4:junit4]   2> 3527 T277 C16 REQ [collection1] webapp=/ldtfh/i path=/select params={sort=a_si+asc,+id+asc&offset=5&group.field=a_si&group.limit=5&NOW=1355882549626&wt=javabin&group.topgroups.a_si=-987&group.topgroups.a_si=-600&group.topgroups.a_si=-100&group.topgroups.a_si=2&group.topgroups.a_si=7&group.topgroups.a_si=50&group.topgroups.a_si=100&group.topgroups.a_si=123&group.topgroups.a_si=232&group.topgroups.a_si=233&group.topgroups.a_si=379&group.topgroups.a_si=500&group.topgroups.a_si=876&group.topgroups.a_si=4321&group.topgroups.a_si=9999&group.topgroups.a_si=%01&q=*:*&start=0&rows=100&fl=id&group=true&version=2&distrib=false&group.format=simple&isShard=true&shard.url=[ff01::114]:33332/ldtfh/i|127.0.0.1:33418/ldtfh/i|[ff01::083]:33332/ldtfh/i&group.distributed.second=true} status=0 QTime=2 
[junit4:junit4]   2> 3539 T275 C16 REQ [collection1] webapp=/ldtfh/i path=/select params={offset=5&group.field=a_si&group.limit=5&ids=19,14,12,11,18,17,16,15,20,21,100,504,503,502,501,500,23,22,6,7,4,5,2,3,1,10,8,9&NOW=1355882549626&wt=javabin&group.offset=5&q=*:*&rows=100&rows=5&fl=id,a_si,id&version=2&distrib=false&group.format=simple&isShard=true&shard.url=[ff01::114]:33332/ldtfh/i|127.0.0.1:33418/ldtfh/i|[ff01::083]:33332/ldtfh/i} status=0 QTime=1 
[junit4:junit4]   2> 3541 T274 C16 REQ [collection1] webapp=/ldtfh/i path=/select params={sort=a_si+asc,+id+asc&offset=5&group.field=a_si&group.limit=5&wt=javabin&group.offset=5&shards=[ff01::114]:33332/ldtfh/i|127.0.0.1:33418/ldtfh/i|[ff01::083]:33332/ldtfh/i&q=*:*&rows=100&rows=5&fl=id,a_si&group=true&version=2&group.format=simple} status=0 QTime=23 
[junit4:junit4]   2> 3544 T263 C15 REQ [collection1] webapp=/ldtfh/i path=/select params={sort=a_si+asc,+id+asc&offset=5&group.field=a_si&group.limit=5&wt=javabin&group.offset=5&q=*:*&rows=100&rows=5&fl=id,a_si&group=true&version=2&distrib=false&group.main=true} hits=172 status=0 QTime=1 
[junit4:junit4]   2> 3550 T277 C16 REQ [collection1] webapp=/ldtfh/i path=/select params={sort=a_si+asc,+id+asc&offset=5&group.field=a_si&group.limit=5&group.distributed.first=true&NOW=1355882549655&wt=javabin&group.offset=5&q=*:*&start=0&rows=100&fl=id&group=true&version=2&distrib=false&isShard=true&shard.url=127.0.0.1:33418/ldtfh/i|[ff01::213]:33332/ldtfh/i&group.main=true} status=0 QTime=0 
[junit4:junit4]   2> 3556 T275 C16 REQ [collection1] webapp=/ldtfh/i path=/select params={sort=a_si+asc,+id+asc&offset=5&group.field=a_si&group.limit=5&NOW=1355882549655&wt=javabin&group.topgroups.a_si=-987&group.topgroups.a_si=-600&group.topgroups.a_si=-100&group.topgroups.a_si=2&group.topgroups.a_si=7&group.topgroups.a_si=50&group.topgroups.a_si=100&group.topgroups.a_si=123&group.topgroups.a_si=232&group.topgroups.a_si=233&group.topgroups.a_si=379&group.topgroups.a_si=500&group.topgroups.a_si=876&group.topgroups.a_si=4321&group.topgroups.a_si=9999&group.topgroups.a_si=%01&q=*:*&start=0&rows=100&fl=id&group=true&version=2&distrib=false&isShard=true&shard.url=127.0.0.1:33418/ldtfh/i|[ff01::213]:33332/ldtfh/i&group.main=true&group.distributed.second=true} status=0 QTime=2 
[junit4:junit4]   2> 3561 T274 C16 REQ [collection1] webapp=/ldtfh/i path=/select params={offset=5&group.field=a_si&group.limit=5&ids=23,22,502,501,500,504,503,8,9,2,3,1,10,6,7,4,5,18,17,16,15,14,12,11,19,100,20,21&NOW=1355882549655&wt=javabin&group.offset=5&q=*:*&rows=100&rows=5&fl=id,a_si,id&version=2&distrib=false&isShard=true&shard.url=127.0.0.1:33418/ldtfh/i|[ff01::213]:33332/ldtfh/i&group.main=true} status=0 QTime=2 
[junit4:junit4]   2> 3562 T276 C16 REQ [collection1] webapp=/ldtfh/i path=/select params={sort=a_si+asc,+id+asc&offset=5&group.field=a_si&group.limit=5&wt=javabin&group.offset=5&shards=127.0.0.1:33418/ldtfh/i|[ff01::213]:33332/ldtfh/i&q=*:*&rows=100&rows=5&fl=id,a_si&group=true&version=2&group.main=true} status=0 QTime=15 
[junit4:junit4]   2> 3569 T265 C15 REQ [collection1] webapp=/ldtfh/i path=/select params={sort=a_si+asc,+id+asc&group.limit=10&q=*:*&rows=100&fl=id,a_si&group=true&version=2&distrib=false&group.query=a_t:kings+OR+a_t:eggs&wt=javabin} hits=172 status=0 QTime=4 
[junit4:junit4]   2> 3581 T275 C16 REQ [collection1] webapp=/ldtfh/i path=/select params={sort=a_si+asc,+id+asc&group.limit=10&NOW=1355882549680&group.query=a_t:kings+OR+a_t:eggs&wt=javabin&q=*:*&start=0&rows=100&fl=id&group=true&version=2&distrib=false&isShard=true&shard.url=[ff01::114]:33332/ldtfh/i|[ff01::083]:33332/ldtfh/i|127.0.0.1:33418/ldtfh/i&group.distributed.second=true} status=0 QTime=7 
[junit4:junit4]   2> 3585 T274 C16 REQ [collection1] webapp=/ldtfh/i path=/select params={group.limit=10&ids=20,21,19,8,23,18,22&NOW=1355882549680&group.query=a_t:kings+OR+a_t:eggs&wt=javabin&q=*:*&rows=100&fl=id,a_si,id&version=2&distrib=false&isShard=true&shard.url=[ff01::114]:33332/ldtfh/i|[ff01::083]:33332/ldtfh/i|127.0.0.1:33418/ldtfh/i} status=0 QTime=1 
[junit4:junit4]   2> 3586 T277 C16 REQ [collection1] webapp=/ldtfh/i path=/select params={sort=a_si+asc,+id+asc&group.limit=10&shards=[ff01::114]:33332/ldtfh/i|[ff01::083]:33332/ldtfh/i|127.0.0.1:33418/ldtfh/i&q=*:*&rows=100&fl=id,a_si&group=true&version=2&group.query=a_t:kings+OR+a_t:eggs&wt=javabin} status=0 QTime=14 
[junit4:junit4]   2> 3591 T266 C15 REQ [collection1] webapp=/ldtfh/i path=/select params={sort=a_si+asc,+id+asc&group.field=a_si&group.limit=10&q=*:*&rows=100&fl=id,a_si&group=true&version=2&distrib=false&group.query=a_t:kings+OR+a_t:eggs&wt=javabin} hits=172 status=0 QTime=2 
[junit4:junit4]   2> 3597 T275 C16 REQ [collection1] webapp=/ldtfh/i path=/select params={sort=a_si+asc,+id+asc&group.field=a_si&group.limit=10&group.distributed.first=true&NOW=1355882549702&group.query=a_t:kings+OR+a_t:eggs&wt=javabin&q=*:*&start=0&rows=100&fl=id&group=true&version=2&distrib=false&isShard=true&shard.url=[ff01::083]:33332/ldtfh/i|127.0.0.1:33418/ldtfh/i|[ff01::213]:33332/ldtfh/i|[ff01::114]:33332/ldtfh/i} status=0 QTime=1 
[junit4:junit4]   2> 3604 T274 C16 REQ [collection1] webapp=/ldtfh/i path=/select params={sort=a_si+asc,+id+asc&group.field=a_si&group.limit=10&NOW=1355882549702&group.query=a_t:kings+OR+a_t:eggs&wt=javabin&group.topgroups.a_si=-987&group.topgroups.a_si=-600&group.topgroups.a_si=-100&group.topgroups.a_si=2&group.topgroups.a_si=7&group.topgroups.a_si=50&group.topgroups.a_si=100&group.topgroups.a_si=123&group.topgroups.a_si=232&group.topgroups.a_si=233&group.topgroups.a_si=379&group.topgroups.a_si=500&group.topgroups.a_si=876&group.topgroups.a_si=4321&group.topgroups.a_si=9999&group.topgroups.a_si=%01&q=*:*&start=0&rows=100&fl=id&group=true&version=2&distrib=false&isShard=true&shard.url=[ff01::083]:33332/ldtfh/i|127.0.0.1:33418/ldtfh/i|[ff01::213]:33332/ldtfh/i|[ff01::114]:33332/ldtfh/i&group.distributed.second=true} status=0 QTime=4 
[junit4:junit4]   2> 3610 T277 C16 REQ [collection1] webapp=/ldtfh/i path=/select params={group.field=a_si&group.limit=10&ids=8,9,2,3,1,10,6,7,4,5,23,22,502,501,500,506,505,504,503,509,508,507,105,103,104,101,102,100,20,21,18,17,16,15,14,12,11,19&NOW=1355882549702&group.query=a_t:kings+OR+a_t:eggs&wt=javabin&q=*:*&rows=100&fl=id,a_si,id&version=2&distrib=false&isShard=true&shard.url=[ff01::083]:33332/ldtfh/i|127.0.0.1:33418/ldtfh/i|[ff01::213]:33332/ldtfh/i|[ff01::114]:33332/ldtfh/i} status=0 QTime=2 
[junit4:junit4]   2> 3612 T276 C16 REQ [collection1] webapp=/ldtfh/i path=/select params={sort=a_si+asc,+id+asc&group.field=a_si&group.limit=10&shards=[ff01::083]:33332/ldtfh/i|127.0.0.1:33418/ldtfh/i|[ff01::213]:33332/ldtfh/i|[ff01::114]:33332/ldtfh/i&q=*:*&rows=100&fl=id,a_si&group=true&version=2&group.query=a_t:kings+OR+a_t:eggs&wt=javabin} status=0 QTime=18 
[junit4:junit4]   2> 3622 T264 C15 REQ [collection1] webapp=/ldtfh/i path=/select params={sort=a_si+asc,+id+asc&group.limit=10&q=*:*&rows=100&fl=id,a_si&group=true&version=2&distrib=false&group.query=a_t:kings+OR+a_t:eggs&group.query=id:5&wt=javabin} hits=172 status=0 QTime=1 
[junit4:junit4]   2> 3629 T274 C16 REQ [collection1] webapp=/ldtfh/i path=/select params={sort=a_si+asc,+id+asc&group.limit=10&NOW=1355882549733&group.query=a_t:kings+OR+a_t:eggs&group.query=id:5&wt=javabin&q=*:*&start=0&rows=100&fl=id&group=true&version=2&distrib=false&isShard=true&shard.url=127.0.0.1:33418/ldtfh/i&group.distributed.second=true} status=0 QTime=2 
[junit4:junit4]   2> 3632 T277 C16 REQ [collection1] webapp=/ldtfh/i path=/select params={group.limit=10&ids=19,5,21,20,22,23,18,8&NOW=1355882549733&group.query=a_t:kings+OR+a_t:eggs&group.query=id:5&wt=javabin&q=*:*&rows=100&fl=id,a_si,id&version=2&distrib=false&isShard=true&shard.url=127.0.0.1:33418/ldtfh/i} status=0 QTime=0 
[junit4:junit4]   2> 3634 T275 C16 REQ [collection1] webapp=/ldtfh/i path=/select params={sort=a_si+asc,+id+asc&group.limit=10&shards=127.0.0.1:33418/ldtfh/i&q=*:*&rows=100&fl=id,a_si&group=true&version=2&group.query=a_t:kings+OR+a_t:eggs&group.query=id:5&wt=javabin} status=0 QTime=9 
[junit4:junit4]   2> 3635 T257 oas.BaseDistributedSearchTestCase.compareResponses SEVERE Mismatched responses:
[junit4:junit4]   2> 	{responseHeader={status=0,QTime=9},grouped={id:5={matches=172,doclist={numFound=1,start=0,docs=[SolrDocument{id=5, a_si=500}]}},a_t:kings OR a_t:eggs={matches=172,doclist={numFound=7,start=0,docs=[SolrDocument{id=18, a_si=232}, SolrDocument{id=19, a_si=232}, SolrDocument{id=20, a_si=232}, SolrDocument{id=21, a_si=232}, SolrDocument{id=22, a_si=232}, SolrDocument{id=23, a_si=233}, SolrDocument{id=8, a_si=876}]}}}}
[junit4:junit4]   2> 	{responseHeader={status=0,QTime=1},grouped={a_t:kings OR a_t:eggs={matches=172,doclist={numFound=7,start=0,docs=[SolrDocument{id=18, a_si=232}, SolrDocument{id=19, a_si=232}, SolrDocument{id=20, a_si=232}, SolrDocument{id=21, a_si=232}, SolrDocument{id=22, a_si=232}, SolrDocument{id=23, a_si=233}, SolrDocument{id=8, a_si=876}]}},id:5={matches=172,doclist={numFound=1,start=0,docs=[SolrDocument{id=5, a_si=500}]}}}}
[junit4:junit4]   2> 3663 T257 oasc.CoreContainer.shutdown Shutting down CoreContainer instance=1867308719
[junit4:junit4]   2> 3664 T257 oasc.SolrCore.close [collection1]  CLOSING SolrCore org.apache.solr.core.SolrCore@6bf22341
[junit4:junit4]   2> 3670 T257 oasu.DirectUpdateHandler2.close closing DirectUpdateHandler2{commits=2,autocommits=0,soft autocommits=0,optimizes=0,rollbacks=0,expungeDeletes=0,docsPending=0,adds=0,deletesById=0,deletesByQuery=0,errors=0,cumulative_adds=172,cumulative_deletesById=0,cumulative_deletesByQuery=1,cumulative_errors=0}
[junit4:junit4]   2> 3671 T257 oasc.SolrCore.decrefSolrCoreState Closing SolrCoreState
[junit4:junit4]   2> 3671 T257 oasu.DefaultSolrCoreState.closeIndexWriter SolrCoreState ref count has reached 0 - closing IndexWriter
[junit4:junit4]   2> 3671 T257 oasu.DefaultSolrCoreState.closeIndexWriter closing IndexWriter with IndexWriterCloser
[junit4:junit4]   2> 3673 T257 C15 oasc.CachingDirectoryFactory.close Releasing directory:/mnt/ssd/jenkins/workspace/Lucene-Solr-4.x-Linux/solr/build/solr-core/test/J1/./org.apache.solr.TestDistributedGrouping-1355882546117/control/data/index
[junit4:junit4]   2> 3674 T257 oasc.SolrCore.closeSearcher [collection1] Closing main searcher on request.
[junit4:junit4]   2> 3675 T257 oasc.CachingDirectoryFactory.close Releasing directory:/mnt/ssd/jenkins/workspace/Lucene-Solr-4.x-Linux/solr/build/solr-core/test/J1/./org.apache.solr.TestDistributedGrouping-1355882546117/control/data/index
[junit4:junit4]   2> 3675 T257 oasc.CachingDirectoryFactory.close Closing directory when closing factory:/mnt/ssd/jenkins/workspace/Lucene-Solr-4.x-Linux/solr/build/solr-core/test/J1/./org.apache.solr.TestDistributedGrouping-1355882546117/control/data/index
[junit4:junit4]   2> 3676 T257 oasc.CachingDirectoryFactory.close Closing directory when closing factory:/mnt/ssd/jenkins/workspace/Lucene-Solr-4.x-Linux/solr/build/solr-core/test/J1/./org.apache.solr.TestDistributedGrouping-1355882546117/control/data
[junit4:junit4]   2> 3676 T257 oejsh.ContextHandler.doStop stopped o.e.j.s.ServletContextHandler{/ldtfh/i,null}
[junit4:junit4]   2> 3757 T257 oasc.CoreContainer.shutdown Shutting down CoreContainer instance=1442666266
[junit4:junit4]   2> 3758 T257 oasc.SolrCore.close [collection1]  CLOSING SolrCore org.apache.solr.core.SolrCore@48d17ce7
[junit4:junit4]   2> 3773 T257 oasu.DirectUpdateHandler2.close closing DirectUpdateHandler2{commits=2,autocommits=0,soft autocommits=0,optimizes=0,rollbacks=0,expungeDeletes=0,docsPending=0,adds=0,deletesById=0,deletesByQuery=0,errors=0,cumulative_adds=172,cumulative_deletesById=0,cumulative_deletesByQuery=1,cumulative_errors=0}
[junit4:junit4]   2> 3774 T257 oasc.SolrCore.decrefSolrCoreState Closing SolrCoreState
[junit4:junit4]   2> 3774 T257 oasu.DefaultSolrCoreState.closeIndexWriter SolrCoreState ref count has reached 0 - closing IndexWriter
[junit4:junit4]   2> 3775 T257 oasu.DefaultSolrCoreState.closeIndexWriter closing IndexWriter with IndexWriterCloser
[junit4:junit4]   2> 3776 T257 C16 oasc.CachingDirectoryFactory.close Releasing directory:/mnt/ssd/jenkins/workspace/Lucene-Solr-4.x-Linux/solr/build/solr-core/test/J1/./org.apache.solr.TestDistributedGrouping-1355882546117/shard0/data/index
[junit4:junit4]   2> 3777 T257 oasc.SolrCore.closeSearcher [collection1] Closing main searcher on request.
[junit4:junit4]   2> 3781 T257 oasc.CachingDirectoryFactory.close Releasing directory:/mnt/ssd/jenkins/workspace/Lucene-Solr-4.x-Linux/solr/build/solr-core/test/J1/./org.apache.solr.TestDistributedGrouping-1355882546117/shard0/data/index
[junit4:junit4]   2> 3782 T257 oasc.CachingDirectoryFactory.close Closing directory when closing factory:/mnt/ssd/jenkins/workspace/Lucene-Solr-4.x-Linux/solr/build/solr-core/test/J1/./org.apache.solr.TestDistributedGrouping-1355882546117/shard0/data/index
[junit4:junit4]   2> 3782 T257 oasc.CachingDirectoryFactory.close Closing directory when closing factory:/mnt/ssd/jenkins/workspace/Lucene-Solr-4.x-Linux/solr/build/solr-core/test/J1/./org.apache.solr.TestDistributedGrouping-1355882546117/shard0/data
[junit4:junit4]   2> 3785 T257 oejsh.ContextHandler.doStop stopped o.e.j.s.ServletContextHandler{/ldtfh/i,null}
[junit4:junit4]   2> 3845 T257 oas.SolrTestCaseJ4.tearDown ###Ending testDistribSearch
[junit4:junit4]   2> NOTE: reproduce with: ant test  -Dtestcase=TestDistributedGrouping -Dtests.method=testDistribSearch -Dtests.seed=1D4B7E576A9CA812 -Dtests.multiplier=3 -Dtests.slow=true -Dtests.locale=et_EE -Dtests.timezone=Asia/Qyzylorda -Dtests.file.encoding=UTF-8
[junit4:junit4] FAILURE 3.86s J1 | TestDistributedGrouping.testDistribSearch <<<
[junit4:junit4]    > Throwable #1: junit.framework.AssertionFailedError: .grouped.id:5!=a_t:kings OR a_t:eggs (unordered or missing)
[junit4:junit4]    > 	at __randomizedtesting.SeedInfo.seed([1D4B7E576A9CA812:9CADF04F1DC3C82E]:0)
[junit4:junit4]    > 	at junit.framework.Assert.fail(Assert.java:50)
[junit4:junit4]    > 	at org.apache.solr.BaseDistributedSearchTestCase.compareResponses(BaseDistributedSearchTestCase.java:785)
[junit4:junit4]    > 	at org.apache.solr.BaseDistributedSearchTestCase.query(BaseDistributedSearchTestCase.java:495)
[junit4:junit4]    > 	at org.apache.solr.BaseDistributedSearchTestCase.query(BaseDistributedSearchTestCase.java:475)
[junit4:junit4]    > 	at org.apache.solr.TestDistributedGrouping.doTest(TestDistributedGrouping.java:168)
[junit4:junit4]    > 	at org.apache.solr.BaseDistributedSearchTestCase.testDistribSearch(BaseDistributedSearchTestCase.java:800)
[junit4:junit4]    > 	at sun.reflect.NativeMethodAccessorImpl.invoke0(Native Method)
[junit4:junit4]    > 	at sun.reflect.NativeMethodAccessorImpl.invoke(NativeMethodAccessorImpl.java:57)
[junit4:junit4]    > 	at sun.reflect.DelegatingMethodAccessorImpl.invoke(DelegatingMethodAccessorImpl.java:43)
[junit4:junit4]    > 	at java.lang.reflect.Method.invoke(Method.java:474)
[junit4:junit4]    > 	at com.carrotsearch.randomizedtesting.RandomizedRunner.invoke(RandomizedRunner.java:1559)
[junit4:junit4]    > 	at com.carrotsearch.randomizedtesting.RandomizedRunner.access$600(RandomizedRunner.java:79)
[junit4:junit4]    > 	at com.carrotsearch.randomizedtesting.RandomizedRunner$6.evaluate(RandomizedRunner.java:737)
[junit4:junit4]    > 	at com.carrotsearch.randomizedtesting.RandomizedRunner$7.evaluate(RandomizedRunner.java:773)
[junit4:junit4]    > 	at com.carrotsearch.randomizedtesting.RandomizedRunner$8.evaluate(RandomizedRunner.java:787)
[junit4:junit4]    > 	at com.carrotsearch.randomizedtesting.rules.SystemPropertiesRestoreRule$1.evaluate(SystemPropertiesRestoreRule.java:53)
[junit4:junit4]    > 	at org.apache.lucene.util.TestRuleSetupTeardownChained$1.evaluate(TestRuleSetupTeardownChained.java:50)
[junit4:junit4]    > 	at org.apache.lucene.util.TestRuleFieldCacheSanity$1.evaluate(TestRuleFieldCacheSanity.java:51)
[junit4:junit4]    > 	at org.apache.lucene.util.AbstractBeforeAfterRule$1.evaluate(AbstractBeforeAfterRule.java:46)
[junit4:junit4]    > 	at com.carrotsearch.randomizedtesting.rules.SystemPropertiesInvariantRule$1.evaluate(SystemPropertiesInvariantRule.java:55)
[junit4:junit4]    > 	at org.apache.lucene.util.TestRuleThreadAndTestName$1.evaluate(TestRuleThreadAndTestName.java:49)
[junit4:junit4]    > 	at org.apache.lucene.util.TestRuleIgnoreAfterMaxFailures$1.evaluate(TestRuleIgnoreAfterMaxFailures.java:70)
[junit4:junit4]    > 	at org.apache.lucene.util.TestRuleMarkFailure$1.evaluate(TestRuleMarkFailure.java:48)
[junit4:junit4]    > 	at com.carrotsearch.randomizedtesting.rules.StatementAdapter.evaluate(StatementAdapter.java:36)
[junit4:junit4]    > 	at com.carrotsearch.randomizedtesting.ThreadLeakControl$StatementRunner.run(ThreadLeakControl.java:358)
[junit4:junit4]    > 	at com.carrotsearch.randomizedtesting.ThreadLeakControl.forkTimeoutingTask(ThreadLeakControl.java:782)
[junit4:junit4]    > 	at com.carrotsearch.randomizedtesting.ThreadLeakControl$3.evaluate(ThreadLeakControl.java:442)
[junit4:junit4]    > 	at com.carrotsearch.randomizedtesting.RandomizedRunner.runSingleTest(RandomizedRunner.java:746)
[junit4:junit4]    > 	at com.carrotsearch.randomizedtesting.RandomizedRunner$3.evaluate(RandomizedRunner.java:648)
[junit4:junit4]    > 	at com.carrotsearch.randomizedtesting.RandomizedRunner$4.evaluate(RandomizedRunner.java:682)
[junit4:junit4]    > 	at com.carrotsearch.randomizedtesting.RandomizedRunner$5.evaluate(RandomizedRunner.java:693)
[junit4:junit4]    > 	at com.carrotsearch.randomizedtesting.rules.StatementAdapter.evaluate(StatementAdapter.java:36)
[junit4:junit4]    > 	at com.carrotsearch.randomizedtesting.rules.SystemPropertiesRestoreRule$1.evaluate(SystemPropertiesRestoreRule.java:53)
[junit4:junit4]    > 	at org.apache.lucene.util.AbstractBeforeAfterRule$1.evaluate(AbstractBeforeAfterRule.java:46)
[junit4:junit4]    > 	at org.apache.lucene.util.TestRuleStoreClassName$1.evaluate(TestRuleStoreClassName.java:42)
[junit4:junit4]    > 	at com.carrotsearch.randomizedtesting.rules.SystemPropertiesInvariantRule$1.evaluate(SystemPropertiesInvariantRule.java:55)
[junit4:junit4]    > 	at com.carrotsearch.randomizedtesting.rules.NoShadowingOrOverridesOnMethodsRule$1.evaluate(NoShadowingOrOverridesOnMethodsRule.java:39)
[junit4:junit4]    > 	at com.carrotsearch.randomizedtesting.rules.NoShadowingOrOverridesOnMethodsRule$1.evaluate(NoShadowingOrOverridesOnMethodsRule.java:39)
[junit4:junit4]    > 	at com.carrotsearch.randomizedtesting.rules.StatementAdapter.evaluate(StatementAdapter.java:36)
[junit4:junit4]    > 	at org.apache.lucene.util.TestRuleAssertionsRequired$1.evaluate(TestRuleAssertionsRequired.java:43)
[junit4:junit4]    > 	at org.apache.lucene.util.TestRuleMarkFailure$1.evaluate(TestRuleMarkFailure.java:48)
[junit4:junit4]    > 	at org.apache.lucene.util.TestRuleIgnoreAfterMaxFailures$1.evaluate(TestRuleIgnoreAfterMaxFailures.java:70)
[junit4:junit4]    > 	at org.apache.lucene.util.TestRuleIgnoreTestSuites$1.evaluate(TestRuleIgnoreTestSuites.java:55)
[junit4:junit4]    > 	at com.carrotsearch.randomizedtesting.rules.StatementAdapter.evaluate(StatementAdapter.java:36)
[junit4:junit4]    > 	at com.carrotsearch.randomizedtesting.ThreadLeakControl$StatementRunner.run(ThreadLeakControl.java:358)
[junit4:junit4]    > 	at java.lang.Thread.run(Thread.java:722)
[junit4:junit4]   2> 3868 T257 oas.SolrTestCaseJ4.deleteCore ###deleteCore
[junit4:junit4]   2> NOTE: test params are: codec=Lucene41: {range_facet_sl=PostingsFormat(name=Asserting), intDefault=PostingsFormat(name=TestBloomFilteredLucene41Postings), SubjectTerms_mfacet=PostingsFormat(name=TestBloomFilteredLucene41Postings), foo_f=Pulsing41(freqCutoff=14 minBlockSize=61 maxBlockSize=122), n_l1=PostingsFormat(name=Direct), n_tdt1=PostingsFormat(name=TestBloomFilteredLucene41Postings), multiDefault=PostingsFormat(name=Direct), range_facet_l=PostingsFormat(name=Direct), foo_d=PostingsFormat(name=Asserting), a_n_tdt=Pulsing41(freqCutoff=14 minBlockSize=61 maxBlockSize=122), a_t=PostingsFormat(name=Direct), other_tl1=PostingsFormat(name=TestBloomFilteredLucene41Postings), rnd_b=PostingsFormat(name=Asserting), text=Pulsing41(freqCutoff=14 minBlockSize=61 maxBlockSize=122), id=PostingsFormat(name=Asserting), n_f1=PostingsFormat(name=TestBloomFilteredLucene41Postings), oddField_s=PostingsFormat(name=Asserting), n_dt1=PostingsFormat(name=TestBloomFilteredLucene41Postings), a_s=Pulsing41(freqCutoff=14 minBlockSize=61 maxBlockSize=122), foo_b=Pulsing41(freqCutoff=14 minBlockSize=61 maxBlockSize=122), b_n_tdt=PostingsFormat(name=TestBloomFilteredLucene41Postings), timestamp=PostingsFormat(name=Direct), n_tl1=PostingsFormat(name=TestBloomFilteredLucene41Postings), n_tf1=PostingsFormat(name=Direct), a_si=PostingsFormat(name=TestBloomFilteredLucene41Postings), range_facet_si=PostingsFormat(name=Direct), n_ti1=PostingsFormat(name=Asserting), n_td1=PostingsFormat(name=TestBloomFilteredLucene41Postings), n_d1=PostingsFormat(name=Direct)}, sim=DefaultSimilarity, locale=et_EE, timezone=Asia/Qyzylorda
[junit4:junit4]   2> NOTE: Linux 3.2.0-35-generic amd64/Oracle Corporation 1.8.0-ea (64-bit)/cpus=8,threads=1,free=73445512,total=157286400
[junit4:junit4]   2> NOTE: All tests run in this JVM: [SpellingQueryConverterTest, TestLazyCores, TestSolrXMLSerializer, TestJmxIntegration, TestSurroundQueryParser, PrimUtilsTest, SimplePostToolTest, TestRealTimeGet, FullSolrCloudDistribCmdsTest, DisMaxRequestHandlerTest, SolrIndexConfigTest, StatsComponentTest, TestSolr4Spatial, TestPropInjectDefaults, BasicZkTest, TestSolrIndexConfig, URLClassifyProcessorTest, TestDistributedGrouping]
[junit4:junit4] Completed on J1 in 3.89s, 1 test, 1 failure <<< FAILURES!

[...truncated 579 lines...]
BUILD FAILED
/mnt/ssd/jenkins/workspace/Lucene-Solr-4.x-Linux/build.xml:353: The following error occurred while executing this line:
/mnt/ssd/jenkins/workspace/Lucene-Solr-4.x-Linux/build.xml:39: The following error occurred while executing this line:
/mnt/ssd/jenkins/workspace/Lucene-Solr-4.x-Linux/solr/build.xml:178: The following error occurred while executing this line:
/mnt/ssd/jenkins/workspace/Lucene-Solr-4.x-Linux/solr/common-build.xml:438: The following error occurred while executing this line:
/mnt/ssd/jenkins/workspace/Lucene-Solr-4.x-Linux/lucene/common-build.xml:1175: The following error occurred while executing this line:
/mnt/ssd/jenkins/workspace/Lucene-Solr-4.x-Linux/lucene/common-build.xml:840: There were test failures: 243 suites, 1010 tests, 1 failure, 7 ignored (2 assumptions)

Total time: 27 minutes 25 seconds
Build step 'Invoke Ant' marked build as failure
Archiving artifacts
Recording test results
Description set: Java: 64bit/jdk1.8.0-ea-b65 -XX:+UseG1GC
Email was triggered for: Failure
Sending email for trigger: Failure