You are viewing a plain text version of this content. The canonical link for it is here.
Posted to yarn-dev@hadoop.apache.org by Apache Jenkins Server <je...@builds.apache.org> on 2015/09/08 15:31:03 UTC
Failed: YARN-4130 PreCommit Build #9036
Jira: https://issues.apache.org/jira/browse/YARN-4130
Build: https://builds.apache.org/job/PreCommit-YARN-Build/9036/
###################################################################################
########################## LAST 60 LINES OF THE CONSOLE ###########################
[...truncated 283 lines...]
| | | | whitespace.
| +1 | install | 1m 28s | mvn install still works.
| +1 | eclipse:eclipse | 0m 33s | The patch built with
| | | | eclipse:eclipse.
| +1 | findbugs | 1m 28s | The patch does not introduce any
| | | | new Findbugs (version 3.0.0)
| | | | warnings.
| -1 | yarn tests | 54m 31s | Tests failed in
| | | | hadoop-yarn-server-resourcemanager.
| | | 93m 23s |
Reason | Tests
Failed unit tests | hadoop.yarn.server.resourcemanager.TestRMHA
| hadoop.yarn.server.resourcemanager.scheduler.fair.TestAllocationFileLoaderService
|| Subsystem || Report/Notes ||
============================================================================
| Patch URL | http://issues.apache.org/jira/secure/attachment/12754621/YARN-4130.00.patch |
| Optional Tests | javadoc javac unit findbugs checkstyle |
| git revision | trunk / 435f935 |
| hadoop-yarn-server-resourcemanager test log | /home/jenkins/jenkins-slave/workspace/PreCommit-YARN-Build@2/patchprocess/testrun_hadoop-yarn-server-resourcemanager.txt |
| Test Results | https://builds.apache.org/job/PreCommit-YARN-Build/9036/testReport/ |
| Java | 1.7.0_55 |
| uname | Linux asf906.gq1.ygridcore.net 3.13.0-36-lowlatency #63-Ubuntu SMP PREEMPT Wed Sep 3 21:56:12 UTC 2014 x86_64 x86_64 x86_64 GNU/Linux |
============================================================================
============================================================================
Adding comment to JIRA
============================================================================
============================================================================
Comment added.
1519094321256232eec17593ed968da476784626 logged out
============================================================================
============================================================================
Finished build.
============================================================================
============================================================================
Build step 'Execute shell' marked build as failure
Archiving artifacts
Sending artifact delta relative to PreCommit-YARN-Build #9023
Archived 29 artifacts
Archive block size is 32768
Received 9 blocks and 13219533 bytes
Compression is 2.2%
Took 2.7 sec
[description-setter] Could not determine description.
Recording test results
Publish JUnit test result report is waiting for a checkpoint on PreCommit-YARN-Build #9035
Email was triggered for: Failure
Sending email for trigger: Failure
###################################################################################
############################## FAILED TESTS (if any) ##############################
2 tests failed.
REGRESSION: org.apache.hadoop.yarn.server.resourcemanager.TestRMHA.testFailoverWhenTransitionToActiveThrowException
Error Message:
test timed out after 30000 milliseconds
Stack Trace:
java.lang.Exception: test timed out after 30000 milliseconds
at java.net.SocketInputStream.socketRead0(Native Method)
at java.net.SocketInputStream.read(SocketInputStream.java:152)
at java.net.SocketInputStream.read(SocketInputStream.java:122)
at java.io.BufferedInputStream.fill(BufferedInputStream.java:235)
at java.io.BufferedInputStream.read1(BufferedInputStream.java:275)
at java.io.BufferedInputStream.read(BufferedInputStream.java:334)
at sun.net.www.http.HttpClient.parseHTTPHeader(HttpClient.java:687)
at sun.net.www.http.HttpClient.parseHTTP(HttpClient.java:633)
at sun.net.www.protocol.http.HttpURLConnection.getInputStream(HttpURLConnection.java:1323)
at java.net.HttpURLConnection.getResponseCode(HttpURLConnection.java:468)
at com.sun.jersey.client.urlconnection.URLConnectionClientHandler._invoke(URLConnectionClientHandler.java:240)
at com.sun.jersey.client.urlconnection.URLConnectionClientHandler.handle(URLConnectionClientHandler.java:147)
at com.sun.jersey.api.client.Client.handle(Client.java:648)
at com.sun.jersey.api.client.WebResource.handle(WebResource.java:670)
at com.sun.jersey.api.client.WebResource.access$200(WebResource.java:74)
at com.sun.jersey.api.client.WebResource$Builder.get(WebResource.java:503)
at org.apache.hadoop.yarn.server.resourcemanager.TestRMHA.checkActiveRMWebServices(TestRMHA.java:161)
at org.apache.hadoop.yarn.server.resourcemanager.TestRMHA.checkActiveRMFunctionality(TestRMHA.java:146)
at org.apache.hadoop.yarn.server.resourcemanager.TestRMHA.testFailoverWhenTransitionToActiveThrowException(TestRMHA.java:456)
REGRESSION: org.apache.hadoop.yarn.server.resourcemanager.scheduler.fair.TestAllocationFileLoaderService.testGetAllocationFileFromClasspath
Error Message:
null
Stack Trace:
java.lang.AssertionError: null
at org.junit.Assert.fail(Assert.java:86)
at org.junit.Assert.assertTrue(Assert.java:41)
at org.junit.Assert.assertTrue(Assert.java:52)
at org.apache.hadoop.yarn.server.resourcemanager.scheduler.fair.TestAllocationFileLoaderService.testGetAllocationFileFromClasspath(TestAllocationFileLoaderService.java:54)
Failed: YARN-3943 PreCommit Build #9037
Posted by Apache Jenkins Server <je...@builds.apache.org>.
Jira: https://issues.apache.org/jira/browse/YARN-3943
Build: https://builds.apache.org/job/PreCommit-YARN-Build/9037/
###################################################################################
########################## LAST 60 LINES OF THE CONSOLE ###########################
[...truncated 336 lines...]
| +1 | whitespace | 0m 2s | The patch has no lines that end in
| | | | whitespace.
| +1 | install | 1m 29s | mvn install still works.
| +1 | eclipse:eclipse | 0m 34s | The patch built with
| | | | eclipse:eclipse.
| +1 | findbugs | 4m 24s | The patch does not introduce any
| | | | new Findbugs (version 3.0.0)
| | | | warnings.
| +1 | yarn tests | 0m 23s | Tests passed in hadoop-yarn-api.
| +1 | yarn tests | 2m 0s | Tests passed in hadoop-yarn-common.
| +1 | yarn tests | 7m 39s | Tests passed in
| | | | hadoop-yarn-server-nodemanager.
| | | 56m 14s |
|| Subsystem || Report/Notes ||
============================================================================
| Patch URL | http://issues.apache.org/jira/secure/attachment/12754660/YARN-3943.000.patch |
| Optional Tests | javadoc javac unit findbugs checkstyle |
| git revision | trunk / 090d266 |
| checkstyle | /home/jenkins/jenkins-slave/workspace/PreCommit-YARN-Build/patchprocess/diffcheckstylehadoop-yarn-api.txt |
| hadoop-yarn-api test log | /home/jenkins/jenkins-slave/workspace/PreCommit-YARN-Build/patchprocess/testrun_hadoop-yarn-api.txt |
| hadoop-yarn-common test log | /home/jenkins/jenkins-slave/workspace/PreCommit-YARN-Build/patchprocess/testrun_hadoop-yarn-common.txt |
| hadoop-yarn-server-nodemanager test log | /home/jenkins/jenkins-slave/workspace/PreCommit-YARN-Build/patchprocess/testrun_hadoop-yarn-server-nodemanager.txt |
| Test Results | https://builds.apache.org/job/PreCommit-YARN-Build/9037/testReport/ |
| Java | 1.7.0_55 |
| uname | Linux asf905.gq1.ygridcore.net 3.13.0-36-lowlatency #63-Ubuntu SMP PREEMPT Wed Sep 3 21:56:12 UTC 2014 x86_64 x86_64 x86_64 GNU/Linux |
============================================================================
============================================================================
Adding comment to JIRA
============================================================================
============================================================================
Comment added.
70477c2f84c841f51e5a1654dd8405651cddf70b logged out
============================================================================
============================================================================
Finished build.
============================================================================
============================================================================
Build step 'Execute shell' marked build as failure
Archiving artifacts
Sending artifact delta relative to PreCommit-YARN-Build #9023
Archived 58 artifacts
Archive block size is 32768
Received 216 blocks and 25160884 bytes
Compression is 22.0%
Took 5.4 sec
[description-setter] Could not determine description.
Recording test results
Email was triggered for: Failure
Sending email for trigger: Failure
###################################################################################
############################## FAILED TESTS (if any) ##############################
All tests passed