You are viewing a plain text version of this content. The canonical link for it is here.
Posted to dev@calcite.apache.org by Apache Jenkins Server <je...@builds.apache.org> on 2025/07/16 10:19:52 UTC
Build failed in Jenkins: Calcite » Calcite-snapshots #1440
See <https://ci-builds.apache.org/job/Calcite/job/Calcite-snapshots/1440/display/redirect?page=changes>
Changes:
[czjourney] [CALCITE-7079] MongoDB Adapter unable to translate multiple NOT EQUALS expressions combined with AND
------------------------------------------
Started by GitHub push by xiedeyantu
Started by GitHub push by xiedeyantu
Running as SYSTEM
[EnvInject] - Loading node environment variables.
Building remotely on builds23 (ubuntu) in workspace <https://ci-builds.apache.org/job/Calcite/job/Calcite-snapshots/ws/>
[WS-CLEANUP] Deleting project workspace...
[WS-CLEANUP] Deferred wipeout is used...
[WS-CLEANUP] Done
The recommended git tool is: NONE
No credentials specified
Cloning the remote Git repository
Using shallow clone with depth 100
Avoid fetching tags
Honoring refspec on initial clone
Cloning repository https://github.com/apache/calcite.git
> git init <https://ci-builds.apache.org/job/Calcite/job/Calcite-snapshots/ws/> # timeout=10
Fetching upstream changes from https://github.com/apache/calcite.git
> git --version # timeout=10
> git --version # 'git version 2.34.1'
> git fetch --no-tags --force --progress --depth=100 -- https://github.com/apache/calcite.git +refs/heads/*:refs/remotes/origin/* # timeout=10
> git config remote.origin.url https://github.com/apache/calcite.git # timeout=10
> git config --add remote.origin.fetch +refs/heads/*:refs/remotes/origin/* # timeout=10
Avoid second fetch
> git rev-parse refs/remotes/origin/main^{commit} # timeout=10
Checking out Revision ed71c9a70539a2401b0578b786366918abbaeebe (refs/remotes/origin/main)
> git config core.sparsecheckout # timeout=10
> git checkout -f ed71c9a70539a2401b0578b786366918abbaeebe # timeout=10
Commit message: "[CALCITE-7079] MongoDB Adapter unable to translate multiple NOT EQUALS expressions combined with AND"
> git rev-list --no-walk dafb8d7a1fde884daf76d2a24aa6aea9c39ee5ca # timeout=10
[Gradle] - Launching build.
[Calcite-snapshots] $ <https://ci-builds.apache.org/job/Calcite/job/Calcite-snapshots/ws/gradlew> "-Dorg.gradle.jvmargs=-Xmx1024m -XX:MaxMetaspaceSize=512m" -Pasf=true -PCI=true --no-build-cache --profile --no-daemon build publish
To honour the JVM settings for this build a single-use Daemon process will be forked. For more on this, please refer to https://docs.gradle.org/8.7/userguide/gradle_daemon.html#sec:disabling_the_daemon in the Gradle documentation.
Daemon will be stopped at the end of the build
> Task :buildSrc:javacc:checkKotlinGradlePluginConfigurationErrors
> Task :buildSrc:fmpp:checkKotlinGradlePluginConfigurationErrors
> Task :buildSrc:buildext:checkKotlinGradlePluginConfigurationErrors
> Task :buildSrc:checkKotlinGradlePluginConfigurationErrors
> Task :buildSrc:compileKotlin NO-SOURCE
> Task :buildSrc:compileJava NO-SOURCE
> Task :buildSrc:compileGroovy NO-SOURCE
> Task :buildSrc:processResources NO-SOURCE
> Task :buildSrc:classes UP-TO-DATE
> Task :buildSrc:jar
> Task :buildSrc:javacc:pluginDescriptors
> Task :buildSrc:buildext:pluginDescriptors
> Task :buildSrc:fmpp:pluginDescriptors
> Task :buildSrc:buildext:processResources
> Task :buildSrc:javacc:processResources
> Task :buildSrc:fmpp:processResources
> Task :buildSrc:buildext:compileKotlin
> Task :buildSrc:fmpp:compileKotlin
> Task :buildSrc:javacc:compileKotlin
> Task :buildSrc:buildext:compileJava NO-SOURCE
> Task :buildSrc:buildext:classes
> Task :buildSrc:fmpp:compileJava NO-SOURCE
> Task :buildSrc:fmpp:classes
> Task :buildSrc:javacc:compileJava NO-SOURCE
> Task :buildSrc:javacc:classes
> Task :buildSrc:buildext:jar
> Task :buildSrc:javacc:jar
> Task :buildSrc:fmpp:jar
> Configure project :
Building Apache Calcite 1.41.0-SNAPSHOT
FAILURE: Build failed with an exception.
* What went wrong:
A problem occurred configuring project ':plus'.
> Could not read workspace metadata from /home/jenkins/.gradle/caches/8.7/kotlin-dsl/scripts/6637131df35ca0cd3a1a087b88cfadb6/metadata.bin
* Try:
> Run with --stacktrace option to get the stack trace.
> Run with --info or --debug option to get more log output.
> Get more help at https://help.gradle.org.
BUILD FAILED in 1m 9s
17 actionable tasks: 17 executed
See the profiling report at: file://<https://ci-builds.apache.org/job/Calcite/job/Calcite-snapshots/ws/buildSrc/build/reports/profile/profile-2025-07-16-10-18-58.html>
A fine-grained performance profile is available: use the --scan option.
Build step 'Invoke Gradle script' changed build result to FAILURE
Build step 'Invoke Gradle script' marked build as failure
Recording test results
ERROR: Step ‘Publish JUnit test result report’ failed: No test report files were found. Configuration error?
Build failed in Jenkins: Calcite » Calcite-snapshots #1444
Posted by Apache Jenkins Server <je...@builds.apache.org>.
See <https://ci-builds.apache.org/job/Calcite/job/Calcite-snapshots/1444/display/redirect?page=changes>
Changes:
[mbudiu] [CALCITE-7094] Using a type alias as a constructor function causes a validator assertion failure
------------------------------------------
Started by GitHub push by mihaibudiu
Started by GitHub push by mihaibudiu
Running as SYSTEM
[EnvInject] - Loading node environment variables.
Building remotely on builds23 (ubuntu) in workspace <https://ci-builds.apache.org/job/Calcite/job/Calcite-snapshots/ws/>
[WS-CLEANUP] Deleting project workspace...
[WS-CLEANUP] Deferred wipeout is used...
[WS-CLEANUP] Done
The recommended git tool is: NONE
No credentials specified
Cloning the remote Git repository
Using shallow clone with depth 100
Avoid fetching tags
Honoring refspec on initial clone
Cloning repository https://github.com/apache/calcite.git
> git init <https://ci-builds.apache.org/job/Calcite/job/Calcite-snapshots/ws/> # timeout=10
Fetching upstream changes from https://github.com/apache/calcite.git
> git --version # timeout=10
> git --version # 'git version 2.34.1'
> git fetch --no-tags --force --progress --depth=100 -- https://github.com/apache/calcite.git +refs/heads/*:refs/remotes/origin/* # timeout=10
> git config remote.origin.url https://github.com/apache/calcite.git # timeout=10
> git config --add remote.origin.fetch +refs/heads/*:refs/remotes/origin/* # timeout=10
Avoid second fetch
> git rev-parse refs/remotes/origin/main^{commit} # timeout=10
Checking out Revision c437a9bbe6fe858efab146581c24cc89671408ef (refs/remotes/origin/main)
> git config core.sparsecheckout # timeout=10
> git checkout -f c437a9bbe6fe858efab146581c24cc89671408ef # timeout=10
Commit message: "[CALCITE-7094] Using a type alias as a constructor function causes a validator assertion failure"
> git rev-list --no-walk cc3a4b7db3eb92f6ca3f952bd914a8ec0ed51818 # timeout=10
[Gradle] - Launching build.
[Calcite-snapshots] $ <https://ci-builds.apache.org/job/Calcite/job/Calcite-snapshots/ws/gradlew> "-Dorg.gradle.jvmargs=-Xmx1024m -XX:MaxMetaspaceSize=512m" -Pasf=true -PCI=true --no-build-cache --profile --no-daemon build publish
To honour the JVM settings for this build a single-use Daemon process will be forked. For more on this, please refer to https://docs.gradle.org/8.7/userguide/gradle_daemon.html#sec:disabling_the_daemon in the Gradle documentation.
Daemon will be stopped at the end of the build
> Task :buildSrc:javacc:checkKotlinGradlePluginConfigurationErrors
> Task :buildSrc:buildext:checkKotlinGradlePluginConfigurationErrors
> Task :buildSrc:fmpp:checkKotlinGradlePluginConfigurationErrors
> Task :buildSrc:checkKotlinGradlePluginConfigurationErrors
> Task :buildSrc:compileKotlin NO-SOURCE
> Task :buildSrc:compileJava NO-SOURCE
> Task :buildSrc:compileGroovy NO-SOURCE
> Task :buildSrc:processResources NO-SOURCE
> Task :buildSrc:classes UP-TO-DATE
> Task :buildSrc:jar
> Task :buildSrc:buildext:pluginDescriptors
> Task :buildSrc:javacc:pluginDescriptors
> Task :buildSrc:fmpp:pluginDescriptors
> Task :buildSrc:javacc:processResources
> Task :buildSrc:buildext:processResources
> Task :buildSrc:fmpp:processResources
> Task :buildSrc:javacc:compileKotlin
> Task :buildSrc:fmpp:compileKotlin
> Task :buildSrc:buildext:compileKotlin
> Task :buildSrc:javacc:compileJava NO-SOURCE
> Task :buildSrc:buildext:compileJava NO-SOURCE
> Task :buildSrc:fmpp:compileJava NO-SOURCE
> Task :buildSrc:javacc:classes
> Task :buildSrc:buildext:classes
> Task :buildSrc:fmpp:classes
> Task :buildSrc:buildext:jar
> Task :buildSrc:javacc:jar
> Task :buildSrc:fmpp:jar
> Configure project :
Building Apache Calcite 1.41.0-SNAPSHOT
FAILURE: Build failed with an exception.
* What went wrong:
A problem occurred configuring project ':plus'.
> Could not read workspace metadata from /home/jenkins/.gradle/caches/8.7/kotlin-dsl/scripts/6637131df35ca0cd3a1a087b88cfadb6/metadata.bin
* Try:
> Run with --stacktrace option to get the stack trace.
> Run with --info or --debug option to get more log output.
> Get more help at https://help.gradle.org.
BUILD FAILED in 56s
17 actionable tasks: 17 executed
See the profiling report at: file://<https://ci-builds.apache.org/job/Calcite/job/Calcite-snapshots/ws/buildSrc/build/reports/profile/profile-2025-07-18-22-48-06.html>
A fine-grained performance profile is available: use the --scan option.
Build step 'Invoke Gradle script' changed build result to FAILURE
Build step 'Invoke Gradle script' marked build as failure
Recording test results
ERROR: Step ‘Publish JUnit test result report’ failed: No test report files were found. Configuration error?
Build failed in Jenkins: Calcite » Calcite-snapshots #1443
Posted by Apache Jenkins Server <je...@builds.apache.org>.
See <https://ci-builds.apache.org/job/Calcite/job/Calcite-snapshots/1443/display/redirect?page=changes>
Changes:
[mbudiu] [CALCITE-7096] Invalid unparse for EXTRACT in StarRocks/Doris
------------------------------------------
Started by GitHub push by mihaibudiu
Started by GitHub push by mihaibudiu
Running as SYSTEM
[EnvInject] - Loading node environment variables.
Building remotely on builds23 (ubuntu) in workspace <https://ci-builds.apache.org/job/Calcite/job/Calcite-snapshots/ws/>
[WS-CLEANUP] Deleting project workspace...
[WS-CLEANUP] Deferred wipeout is used...
[WS-CLEANUP] Done
The recommended git tool is: NONE
No credentials specified
Cloning the remote Git repository
Using shallow clone with depth 100
Avoid fetching tags
Honoring refspec on initial clone
Cloning repository https://github.com/apache/calcite.git
> git init <https://ci-builds.apache.org/job/Calcite/job/Calcite-snapshots/ws/> # timeout=10
Fetching upstream changes from https://github.com/apache/calcite.git
> git --version # timeout=10
> git --version # 'git version 2.34.1'
> git fetch --no-tags --force --progress --depth=100 -- https://github.com/apache/calcite.git +refs/heads/*:refs/remotes/origin/* # timeout=10
> git config remote.origin.url https://github.com/apache/calcite.git # timeout=10
> git config --add remote.origin.fetch +refs/heads/*:refs/remotes/origin/* # timeout=10
Avoid second fetch
> git rev-parse refs/remotes/origin/main^{commit} # timeout=10
Checking out Revision cc3a4b7db3eb92f6ca3f952bd914a8ec0ed51818 (refs/remotes/origin/main)
> git config core.sparsecheckout # timeout=10
> git checkout -f cc3a4b7db3eb92f6ca3f952bd914a8ec0ed51818 # timeout=10
Commit message: "[CALCITE-7096] Invalid unparse for EXTRACT in StarRocks/Doris"
> git rev-list --no-walk b25fcd8016dbb25291cd79d0c0e2d71abb132ab6 # timeout=10
[Gradle] - Launching build.
[Calcite-snapshots] $ <https://ci-builds.apache.org/job/Calcite/job/Calcite-snapshots/ws/gradlew> "-Dorg.gradle.jvmargs=-Xmx1024m -XX:MaxMetaspaceSize=512m" -Pasf=true -PCI=true --no-build-cache --profile --no-daemon build publish
To honour the JVM settings for this build a single-use Daemon process will be forked. For more on this, please refer to https://docs.gradle.org/8.7/userguide/gradle_daemon.html#sec:disabling_the_daemon in the Gradle documentation.
Daemon will be stopped at the end of the build
> Task :buildSrc:checkKotlinGradlePluginConfigurationErrors
> Task :buildSrc:fmpp:checkKotlinGradlePluginConfigurationErrors
> Task :buildSrc:buildext:checkKotlinGradlePluginConfigurationErrors
> Task :buildSrc:javacc:checkKotlinGradlePluginConfigurationErrors
> Task :buildSrc:compileKotlin NO-SOURCE
> Task :buildSrc:compileJava NO-SOURCE
> Task :buildSrc:compileGroovy NO-SOURCE
> Task :buildSrc:processResources NO-SOURCE
> Task :buildSrc:classes UP-TO-DATE
> Task :buildSrc:jar
> Task :buildSrc:buildext:pluginDescriptors
> Task :buildSrc:fmpp:pluginDescriptors
> Task :buildSrc:javacc:pluginDescriptors
> Task :buildSrc:javacc:processResources
> Task :buildSrc:fmpp:processResources
> Task :buildSrc:buildext:processResources
> Task :buildSrc:fmpp:compileKotlin
> Task :buildSrc:fmpp:compileJava NO-SOURCE
> Task :buildSrc:fmpp:classes
> Task :buildSrc:buildext:compileKotlin
> Task :buildSrc:buildext:compileJava NO-SOURCE
> Task :buildSrc:buildext:classes
> Task :buildSrc:fmpp:jar
> Task :buildSrc:javacc:compileKotlin
> Task :buildSrc:javacc:compileJava NO-SOURCE
> Task :buildSrc:javacc:classes
> Task :buildSrc:buildext:jar
> Task :buildSrc:javacc:jar
> Configure project :
Building Apache Calcite 1.41.0-SNAPSHOT
FAILURE: Build failed with an exception.
* What went wrong:
A problem occurred configuring project ':plus'.
> Could not read workspace metadata from /home/jenkins/.gradle/caches/8.7/kotlin-dsl/scripts/6637131df35ca0cd3a1a087b88cfadb6/metadata.bin
* Try:
> Run with --stacktrace option to get the stack trace.
> Run with --info or --debug option to get more log output.
> Get more help at https://help.gradle.org.
BUILD FAILED in 34s
17 actionable tasks: 17 executed
See the profiling report at: file://<https://ci-builds.apache.org/job/Calcite/job/Calcite-snapshots/ws/buildSrc/build/reports/profile/profile-2025-07-16-16-30-08.html>
A fine-grained performance profile is available: use the --scan option.
Build step 'Invoke Gradle script' changed build result to FAILURE
Build step 'Invoke Gradle script' marked build as failure
Recording test results
ERROR: Step ‘Publish JUnit test result report’ failed: No test report files were found. Configuration error?
Build failed in Jenkins: Calcite » Calcite-snapshots #1442
Posted by Apache Jenkins Server <je...@builds.apache.org>.
See <https://ci-builds.apache.org/job/Calcite/job/Calcite-snapshots/1442/display/redirect?page=changes>
Changes:
[mbudiu] [CALCITE-7097] Update commons-lang to 3.18.0
------------------------------------------
Started by GitHub push by mihaibudiu
Started by GitHub push by mihaibudiu
Running as SYSTEM
[EnvInject] - Loading node environment variables.
Building remotely on builds23 (ubuntu) in workspace <https://ci-builds.apache.org/job/Calcite/job/Calcite-snapshots/ws/>
[WS-CLEANUP] Deleting project workspace...
[WS-CLEANUP] Deferred wipeout is used...
[WS-CLEANUP] Done
The recommended git tool is: NONE
No credentials specified
Cloning the remote Git repository
Using shallow clone with depth 100
Avoid fetching tags
Honoring refspec on initial clone
Cloning repository https://github.com/apache/calcite.git
> git init <https://ci-builds.apache.org/job/Calcite/job/Calcite-snapshots/ws/> # timeout=10
Fetching upstream changes from https://github.com/apache/calcite.git
> git --version # timeout=10
> git --version # 'git version 2.34.1'
> git fetch --no-tags --force --progress --depth=100 -- https://github.com/apache/calcite.git +refs/heads/*:refs/remotes/origin/* # timeout=10
> git config remote.origin.url https://github.com/apache/calcite.git # timeout=10
> git config --add remote.origin.fetch +refs/heads/*:refs/remotes/origin/* # timeout=10
Avoid second fetch
> git rev-parse refs/remotes/origin/main^{commit} # timeout=10
Checking out Revision b25fcd8016dbb25291cd79d0c0e2d71abb132ab6 (refs/remotes/origin/main)
> git config core.sparsecheckout # timeout=10
> git checkout -f b25fcd8016dbb25291cd79d0c0e2d71abb132ab6 # timeout=10
Commit message: "[CALCITE-7097] Update commons-lang to 3.18.0"
> git rev-list --no-walk e2183d4896325aa443f3ac43d0ea92823396e1ce # timeout=10
[Gradle] - Launching build.
[Calcite-snapshots] $ <https://ci-builds.apache.org/job/Calcite/job/Calcite-snapshots/ws/gradlew> "-Dorg.gradle.jvmargs=-Xmx1024m -XX:MaxMetaspaceSize=512m" -Pasf=true -PCI=true --no-build-cache --profile --no-daemon build publish
To honour the JVM settings for this build a single-use Daemon process will be forked. For more on this, please refer to https://docs.gradle.org/8.7/userguide/gradle_daemon.html#sec:disabling_the_daemon in the Gradle documentation.
Daemon will be stopped at the end of the build
> Task :buildSrc:fmpp:checkKotlinGradlePluginConfigurationErrors
> Task :buildSrc:buildext:checkKotlinGradlePluginConfigurationErrors
> Task :buildSrc:checkKotlinGradlePluginConfigurationErrors
> Task :buildSrc:javacc:checkKotlinGradlePluginConfigurationErrors
> Task :buildSrc:compileKotlin NO-SOURCE
> Task :buildSrc:compileJava NO-SOURCE
> Task :buildSrc:compileGroovy NO-SOURCE
> Task :buildSrc:processResources NO-SOURCE
> Task :buildSrc:classes UP-TO-DATE
> Task :buildSrc:jar
> Task :buildSrc:buildext:pluginDescriptors
> Task :buildSrc:fmpp:pluginDescriptors
> Task :buildSrc:javacc:pluginDescriptors
> Task :buildSrc:fmpp:processResources
> Task :buildSrc:javacc:processResources
> Task :buildSrc:buildext:processResources
> Task :buildSrc:fmpp:compileKotlin
> Task :buildSrc:buildext:compileKotlin
> Task :buildSrc:javacc:compileKotlin
> Task :buildSrc:javacc:compileJava NO-SOURCE
> Task :buildSrc:fmpp:compileJava NO-SOURCE
> Task :buildSrc:buildext:compileJava NO-SOURCE
> Task :buildSrc:fmpp:classes
> Task :buildSrc:javacc:classes
> Task :buildSrc:buildext:classes
> Task :buildSrc:buildext:jar
> Task :buildSrc:javacc:jar
> Task :buildSrc:fmpp:jar
> Configure project :
Building Apache Calcite 1.41.0-SNAPSHOT
FAILURE: Build failed with an exception.
* What went wrong:
A problem occurred configuring project ':plus'.
> Could not read workspace metadata from /home/jenkins/.gradle/caches/8.7/kotlin-dsl/scripts/6637131df35ca0cd3a1a087b88cfadb6/metadata.bin
* Try:
> Run with --stacktrace option to get the stack trace.
> Run with --info or --debug option to get more log output.
> Get more help at https://help.gradle.org.
BUILD FAILED in 54s
17 actionable tasks: 17 executed
See the profiling report at: file://<https://ci-builds.apache.org/job/Calcite/job/Calcite-snapshots/ws/buildSrc/build/reports/profile/profile-2025-07-16-15-38-30.html>
A fine-grained performance profile is available: use the --scan option.
Build step 'Invoke Gradle script' changed build result to FAILURE
Build step 'Invoke Gradle script' marked build as failure
Recording test results
ERROR: Step ‘Publish JUnit test result report’ failed: No test report files were found. Configuration error?
Build failed in Jenkins: Calcite » Calcite-snapshots #1441
Posted by Apache Jenkins Server <je...@builds.apache.org>.
See <https://ci-builds.apache.org/job/Calcite/job/Calcite-snapshots/1441/display/redirect?page=changes>
Changes:
[mbudiu] [CALCITE-7095] Allow MAP<VARIANT, X> to be indexed by any type of key
------------------------------------------
Started by GitHub push by mihaibudiu
Started by GitHub push by mihaibudiu
Running as SYSTEM
[EnvInject] - Loading node environment variables.
Building remotely on builds23 (ubuntu) in workspace <https://ci-builds.apache.org/job/Calcite/job/Calcite-snapshots/ws/>
[WS-CLEANUP] Deleting project workspace...
[WS-CLEANUP] Deferred wipeout is used...
[WS-CLEANUP] Done
The recommended git tool is: NONE
No credentials specified
Cloning the remote Git repository
Using shallow clone with depth 100
Avoid fetching tags
Honoring refspec on initial clone
Cloning repository https://github.com/apache/calcite.git
> git init <https://ci-builds.apache.org/job/Calcite/job/Calcite-snapshots/ws/> # timeout=10
Fetching upstream changes from https://github.com/apache/calcite.git
> git --version # timeout=10
> git --version # 'git version 2.34.1'
> git fetch --no-tags --force --progress --depth=100 -- https://github.com/apache/calcite.git +refs/heads/*:refs/remotes/origin/* # timeout=10
> git config remote.origin.url https://github.com/apache/calcite.git # timeout=10
> git config --add remote.origin.fetch +refs/heads/*:refs/remotes/origin/* # timeout=10
Avoid second fetch
> git rev-parse refs/remotes/origin/main^{commit} # timeout=10
Checking out Revision e2183d4896325aa443f3ac43d0ea92823396e1ce (refs/remotes/origin/main)
> git config core.sparsecheckout # timeout=10
> git checkout -f e2183d4896325aa443f3ac43d0ea92823396e1ce # timeout=10
Commit message: "[CALCITE-7095] Allow MAP<VARIANT, X> to be indexed by any type of key"
> git rev-list --no-walk ed71c9a70539a2401b0578b786366918abbaeebe # timeout=10
[Gradle] - Launching build.
[Calcite-snapshots] $ <https://ci-builds.apache.org/job/Calcite/job/Calcite-snapshots/ws/gradlew> "-Dorg.gradle.jvmargs=-Xmx1024m -XX:MaxMetaspaceSize=512m" -Pasf=true -PCI=true --no-build-cache --profile --no-daemon build publish
To honour the JVM settings for this build a single-use Daemon process will be forked. For more on this, please refer to https://docs.gradle.org/8.7/userguide/gradle_daemon.html#sec:disabling_the_daemon in the Gradle documentation.
Daemon will be stopped at the end of the build
> Task :buildSrc:javacc:checkKotlinGradlePluginConfigurationErrors
> Task :buildSrc:fmpp:checkKotlinGradlePluginConfigurationErrors
> Task :buildSrc:buildext:checkKotlinGradlePluginConfigurationErrors
> Task :buildSrc:checkKotlinGradlePluginConfigurationErrors
> Task :buildSrc:compileKotlin NO-SOURCE
> Task :buildSrc:compileJava NO-SOURCE
> Task :buildSrc:compileGroovy NO-SOURCE
> Task :buildSrc:processResources NO-SOURCE
> Task :buildSrc:classes UP-TO-DATE
> Task :buildSrc:jar
> Task :buildSrc:buildext:pluginDescriptors
> Task :buildSrc:fmpp:pluginDescriptors
> Task :buildSrc:javacc:pluginDescriptors
> Task :buildSrc:fmpp:processResources
> Task :buildSrc:javacc:processResources
> Task :buildSrc:buildext:processResources
> Task :buildSrc:buildext:compileKotlin
> Task :buildSrc:fmpp:compileKotlin
> Task :buildSrc:javacc:compileKotlin
> Task :buildSrc:buildext:compileJava NO-SOURCE
> Task :buildSrc:fmpp:compileJava NO-SOURCE
> Task :buildSrc:buildext:classes
> Task :buildSrc:fmpp:classes
> Task :buildSrc:javacc:compileJava NO-SOURCE
> Task :buildSrc:javacc:classes
> Task :buildSrc:buildext:jar
> Task :buildSrc:fmpp:jar
> Task :buildSrc:javacc:jar
> Configure project :
Building Apache Calcite 1.41.0-SNAPSHOT
FAILURE: Build failed with an exception.
* What went wrong:
A problem occurred configuring project ':plus'.
> Could not read workspace metadata from /home/jenkins/.gradle/caches/8.7/kotlin-dsl/scripts/6637131df35ca0cd3a1a087b88cfadb6/metadata.bin
* Try:
> Run with --stacktrace option to get the stack trace.
> Run with --info or --debug option to get more log output.
> Get more help at https://help.gradle.org.
BUILD FAILED in 44s
17 actionable tasks: 17 executed
See the profiling report at: file://<https://ci-builds.apache.org/job/Calcite/job/Calcite-snapshots/ws/buildSrc/build/reports/profile/profile-2025-07-16-15-25-01.html>
A fine-grained performance profile is available: use the --scan option.
Build step 'Invoke Gradle script' changed build result to FAILURE
Build step 'Invoke Gradle script' marked build as failure
Recording test results
ERROR: Step ‘Publish JUnit test result report’ failed: No test report files were found. Configuration error?