You are viewing a plain text version of this content. The canonical link for it is here.
Posted to dev@lucene.apache.org by Policeman Jenkins Server <je...@thetaphi.de> on 2015/08/29 16:22:54 UTC
[JENKINS] Lucene-Solr-5.x-Linux (32bit/jdk1.8.0_60) - Build # 13763
- Still Failing!
Build: http://jenkins.thetaphi.de/job/Lucene-Solr-5.x-Linux/13763/
Java: 32bit/jdk1.8.0_60 -server -XX:+UseConcMarkSweepGC
1 tests failed.
FAILED: junit.framework.TestSuite.org.apache.solr.cloud.HttpPartitionTest
Error Message:
ObjectTracker found 1 object(s) that were not released!!! [TransactionLog]
Stack Trace:
java.lang.AssertionError: ObjectTracker found 1 object(s) that were not released!!! [TransactionLog]
at __randomizedtesting.SeedInfo.seed([241D37BED7E7A079]:0)
at org.junit.Assert.fail(Assert.java:93)
at org.junit.Assert.assertTrue(Assert.java:43)
at org.junit.Assert.assertNull(Assert.java:551)
at org.apache.solr.SolrTestCaseJ4.afterClass(SolrTestCaseJ4.java:236)
at sun.reflect.GeneratedMethodAccessor33.invoke(Unknown Source)
at sun.reflect.DelegatingMethodAccessorImpl.invoke(DelegatingMethodAccessorImpl.java:43)
at java.lang.reflect.Method.invoke(Method.java:497)
at com.carrotsearch.randomizedtesting.RandomizedRunner.invoke(RandomizedRunner.java:1627)
at com.carrotsearch.randomizedtesting.RandomizedRunner$5.evaluate(RandomizedRunner.java:799)
at com.carrotsearch.randomizedtesting.rules.StatementAdapter.evaluate(StatementAdapter.java:36)
at com.carrotsearch.randomizedtesting.rules.SystemPropertiesRestoreRule$1.evaluate(SystemPropertiesRestoreRule.java:57)
at org.apache.lucene.util.AbstractBeforeAfterRule$1.evaluate(AbstractBeforeAfterRule.java:46)
at com.carrotsearch.randomizedtesting.rules.StatementAdapter.evaluate(StatementAdapter.java:36)
at org.apache.lucene.util.TestRuleStoreClassName$1.evaluate(TestRuleStoreClassName.java:42)
at com.carrotsearch.randomizedtesting.rules.NoShadowingOrOverridesOnMethodsRule$1.evaluate(NoShadowingOrOverridesOnMethodsRule.java:39)
at com.carrotsearch.randomizedtesting.rules.NoShadowingOrOverridesOnMethodsRule$1.evaluate(NoShadowingOrOverridesOnMethodsRule.java:39)
at com.carrotsearch.randomizedtesting.rules.StatementAdapter.evaluate(StatementAdapter.java:36)
at com.carrotsearch.randomizedtesting.rules.StatementAdapter.evaluate(StatementAdapter.java:36)
at com.carrotsearch.randomizedtesting.rules.StatementAdapter.evaluate(StatementAdapter.java:36)
at org.apache.lucene.util.TestRuleAssertionsRequired$1.evaluate(TestRuleAssertionsRequired.java:54)
at org.apache.lucene.util.TestRuleMarkFailure$1.evaluate(TestRuleMarkFailure.java:48)
at org.apache.lucene.util.TestRuleIgnoreAfterMaxFailures$1.evaluate(TestRuleIgnoreAfterMaxFailures.java:65)
at org.apache.lucene.util.TestRuleIgnoreTestSuites$1.evaluate(TestRuleIgnoreTestSuites.java:55)
at com.carrotsearch.randomizedtesting.rules.StatementAdapter.evaluate(StatementAdapter.java:36)
at com.carrotsearch.randomizedtesting.ThreadLeakControl$StatementRunner.run(ThreadLeakControl.java:365)
at java.lang.Thread.run(Thread.java:745)
Build Log:
[...truncated 10398 lines...]
[junit4] Suite: org.apache.solr.cloud.HttpPartitionTest
[junit4] 2> Creating dataDir: /home/jenkins/workspace/Lucene-Solr-5.x-Linux/solr/build/solr-core/test/J1/temp/solr.cloud.HttpPartitionTest_241D37BED7E7A079-001/init-core-data-001
[junit4] 2> 588069 INFO (SUITE-HttpPartitionTest-seed#[241D37BED7E7A079]-worker) [ ] o.a.s.BaseDistributedSearchTestCase Setting hostContext system property: /dq_ddw/
[junit4] 2> 588070 INFO (TEST-HttpPartitionTest.test-seed#[241D37BED7E7A079]) [ ] o.a.s.c.ZkTestServer STARTING ZK TEST SERVER
[junit4] 2> 588070 INFO (Thread-2095) [ ] o.a.s.c.ZkTestServer client port:0.0.0.0/0.0.0.0:0
[junit4] 2> 588070 INFO (Thread-2095) [ ] o.a.s.c.ZkTestServer Starting server
[junit4] 2> 588170 INFO (TEST-HttpPartitionTest.test-seed#[241D37BED7E7A079]) [ ] o.a.s.c.ZkTestServer start zk server on port:37010
[junit4] 2> 588170 INFO (TEST-HttpPartitionTest.test-seed#[241D37BED7E7A079]) [ ] o.a.s.c.c.SolrZkClient Using default ZkCredentialsProvider
[junit4] 2> 588171 INFO (TEST-HttpPartitionTest.test-seed#[241D37BED7E7A079]) [ ] o.a.s.c.c.ConnectionManager Waiting for client to connect to ZooKeeper
[junit4] 2> 588172 INFO (zkCallback-758-thread-1) [ ] o.a.s.c.c.ConnectionManager Watcher org.apache.solr.common.cloud.ConnectionManager@30cd05 name:ZooKeeperConnection Watcher:127.0.0.1:37010 got event WatchedEvent state:SyncConnected type:None path:null path:null type:None
[junit4] 2> 588172 INFO (TEST-HttpPartitionTest.test-seed#[241D37BED7E7A079]) [ ] o.a.s.c.c.ConnectionManager Client is connected to ZooKeeper
[junit4] 2> 588173 INFO (TEST-HttpPartitionTest.test-seed#[241D37BED7E7A079]) [ ] o.a.s.c.c.SolrZkClient Using default ZkACLProvider
[junit4] 2> 588173 INFO (TEST-HttpPartitionTest.test-seed#[241D37BED7E7A079]) [ ] o.a.s.c.c.SolrZkClient makePath: /solr
[junit4] 2> 588174 INFO (TEST-HttpPartitionTest.test-seed#[241D37BED7E7A079]) [ ] o.a.s.c.c.SolrZkClient Using default ZkCredentialsProvider
[junit4] 2> 588174 INFO (TEST-HttpPartitionTest.test-seed#[241D37BED7E7A079]) [ ] o.a.s.c.c.ConnectionManager Waiting for client to connect to ZooKeeper
[junit4] 2> 588175 INFO (zkCallback-759-thread-1) [ ] o.a.s.c.c.ConnectionManager Watcher org.apache.solr.common.cloud.ConnectionManager@181746d name:ZooKeeperConnection Watcher:127.0.0.1:37010/solr got event WatchedEvent state:SyncConnected type:None path:null path:null type:None
[junit4] 2> 588175 INFO (TEST-HttpPartitionTest.test-seed#[241D37BED7E7A079]) [ ] o.a.s.c.c.ConnectionManager Client is connected to ZooKeeper
[junit4] 2> 588175 INFO (TEST-HttpPartitionTest.test-seed#[241D37BED7E7A079]) [ ] o.a.s.c.c.SolrZkClient Using default ZkACLProvider
[junit4] 2> 588175 INFO (TEST-HttpPartitionTest.test-seed#[241D37BED7E7A079]) [ ] o.a.s.c.c.SolrZkClient makePath: /collections/collection1
[junit4] 2> 588176 INFO (TEST-HttpPartitionTest.test-seed#[241D37BED7E7A079]) [ ] o.a.s.c.c.SolrZkClient makePath: /collections/collection1/shards
[junit4] 2> 588176 INFO (TEST-HttpPartitionTest.test-seed#[241D37BED7E7A079]) [ ] o.a.s.c.c.SolrZkClient makePath: /collections/control_collection
[junit4] 2> 588176 INFO (TEST-HttpPartitionTest.test-seed#[241D37BED7E7A079]) [ ] o.a.s.c.c.SolrZkClient makePath: /collections/control_collection/shards
[junit4] 2> 588177 INFO (TEST-HttpPartitionTest.test-seed#[241D37BED7E7A079]) [ ] o.a.s.c.AbstractZkTestCase put /home/jenkins/workspace/Lucene-Solr-5.x-Linux/solr/core/src/test-files/solr/collection1/conf/solrconfig-tlog.xml to /configs/conf1/solrconfig.xml
[junit4] 2> 588177 INFO (TEST-HttpPartitionTest.test-seed#[241D37BED7E7A079]) [ ] o.a.s.c.c.SolrZkClient makePath: /configs/conf1/solrconfig.xml
[junit4] 2> 588178 INFO (TEST-HttpPartitionTest.test-seed#[241D37BED7E7A079]) [ ] o.a.s.c.AbstractZkTestCase put /home/jenkins/workspace/Lucene-Solr-5.x-Linux/solr/core/src/test-files/solr/collection1/conf/schema.xml to /configs/conf1/schema.xml
[junit4] 2> 588178 INFO (TEST-HttpPartitionTest.test-seed#[241D37BED7E7A079]) [ ] o.a.s.c.c.SolrZkClient makePath: /configs/conf1/schema.xml
[junit4] 2> 588179 INFO (TEST-HttpPartitionTest.test-seed#[241D37BED7E7A079]) [ ] o.a.s.c.AbstractZkTestCase put /home/jenkins/workspace/Lucene-Solr-5.x-Linux/solr/core/src/test-files/solr/collection1/conf/solrconfig.snippet.randomindexconfig.xml to /configs/conf1/solrconfig.snippet.randomindexconfig.xml
[junit4] 2> 588179 INFO (TEST-HttpPartitionTest.test-seed#[241D37BED7E7A079]) [ ] o.a.s.c.c.SolrZkClient makePath: /configs/conf1/solrconfig.snippet.randomindexconfig.xml
[junit4] 2> 588179 INFO (TEST-HttpPartitionTest.test-seed#[241D37BED7E7A079]) [ ] o.a.s.c.AbstractZkTestCase put /home/jenkins/workspace/Lucene-Solr-5.x-Linux/solr/core/src/test-files/solr/collection1/conf/stopwords.txt to /configs/conf1/stopwords.txt
[junit4] 2> 588179 INFO (TEST-HttpPartitionTest.test-seed#[241D37BED7E7A079]) [ ] o.a.s.c.c.SolrZkClient makePath: /configs/conf1/stopwords.txt
[junit4] 2> 588180 INFO (TEST-HttpPartitionTest.test-seed#[241D37BED7E7A079]) [ ] o.a.s.c.AbstractZkTestCase put /home/jenkins/workspace/Lucene-Solr-5.x-Linux/solr/core/src/test-files/solr/collection1/conf/protwords.txt to /configs/conf1/protwords.txt
[junit4] 2> 588180 INFO (TEST-HttpPartitionTest.test-seed#[241D37BED7E7A079]) [ ] o.a.s.c.c.SolrZkClient makePath: /configs/conf1/protwords.txt
[junit4] 2> 588181 INFO (TEST-HttpPartitionTest.test-seed#[241D37BED7E7A079]) [ ] o.a.s.c.AbstractZkTestCase put /home/jenkins/workspace/Lucene-Solr-5.x-Linux/solr/core/src/test-files/solr/collection1/conf/currency.xml to /configs/conf1/currency.xml
[junit4] 2> 588181 INFO (TEST-HttpPartitionTest.test-seed#[241D37BED7E7A079]) [ ] o.a.s.c.c.SolrZkClient makePath: /configs/conf1/currency.xml
[junit4] 2> 588181 INFO (TEST-HttpPartitionTest.test-seed#[241D37BED7E7A079]) [ ] o.a.s.c.AbstractZkTestCase put /home/jenkins/workspace/Lucene-Solr-5.x-Linux/solr/core/src/test-files/solr/collection1/conf/enumsConfig.xml to /configs/conf1/enumsConfig.xml
[junit4] 2> 588182 INFO (TEST-HttpPartitionTest.test-seed#[241D37BED7E7A079]) [ ] o.a.s.c.c.SolrZkClient makePath: /configs/conf1/enumsConfig.xml
[junit4] 2> 588182 INFO (TEST-HttpPartitionTest.test-seed#[241D37BED7E7A079]) [ ] o.a.s.c.AbstractZkTestCase put /home/jenkins/workspace/Lucene-Solr-5.x-Linux/solr/core/src/test-files/solr/collection1/conf/open-exchange-rates.json to /configs/conf1/open-exchange-rates.json
[junit4] 2> 588182 INFO (TEST-HttpPartitionTest.test-seed#[241D37BED7E7A079]) [ ] o.a.s.c.c.SolrZkClient makePath: /configs/conf1/open-exchange-rates.json
[junit4] 2> 588183 INFO (TEST-HttpPartitionTest.test-seed#[241D37BED7E7A079]) [ ] o.a.s.c.AbstractZkTestCase put /home/jenkins/workspace/Lucene-Solr-5.x-Linux/solr/core/src/test-files/solr/collection1/conf/mapping-ISOLatin1Accent.txt to /configs/conf1/mapping-ISOLatin1Accent.txt
[junit4] 2> 588183 INFO (TEST-HttpPartitionTest.test-seed#[241D37BED7E7A079]) [ ] o.a.s.c.c.SolrZkClient makePath: /configs/conf1/mapping-ISOLatin1Accent.txt
[junit4] 2> 588183 INFO (TEST-HttpPartitionTest.test-seed#[241D37BED7E7A079]) [ ] o.a.s.c.AbstractZkTestCase put /home/jenkins/workspace/Lucene-Solr-5.x-Linux/solr/core/src/test-files/solr/collection1/conf/old_synonyms.txt to /configs/conf1/old_synonyms.txt
[junit4] 2> 588184 INFO (TEST-HttpPartitionTest.test-seed#[241D37BED7E7A079]) [ ] o.a.s.c.c.SolrZkClient makePath: /configs/conf1/old_synonyms.txt
[junit4] 2> 588184 INFO (TEST-HttpPartitionTest.test-seed#[241D37BED7E7A079]) [ ] o.a.s.c.AbstractZkTestCase put /home/jenkins/workspace/Lucene-Solr-5.x-Linux/solr/core/src/test-files/solr/collection1/conf/synonyms.txt to /configs/conf1/synonyms.txt
[junit4] 2> 588184 INFO (TEST-HttpPartitionTest.test-seed#[241D37BED7E7A079]) [ ] o.a.s.c.c.SolrZkClient makePath: /configs/conf1/synonyms.txt
[junit4] 2> 588233 INFO (TEST-HttpPartitionTest.test-seed#[241D37BED7E7A079]) [ ] o.a.s.SolrTestCaseJ4 Writing core.properties file to /home/jenkins/workspace/Lucene-Solr-5.x-Linux/solr/build/solr-core/test/J1/temp/solr.cloud.HttpPartitionTest_241D37BED7E7A079-001/control-001/cores/collection1
[junit4] 2> 588235 INFO (TEST-HttpPartitionTest.test-seed#[241D37BED7E7A079]) [ ] o.e.j.s.Server jetty-9.2.13.v20150730
[junit4] 2> 588236 INFO (TEST-HttpPartitionTest.test-seed#[241D37BED7E7A079]) [ ] o.e.j.s.h.ContextHandler Started o.e.j.s.ServletContextHandler@10d9570{/dq_ddw,null,AVAILABLE}
[junit4] 2> 588236 INFO (TEST-HttpPartitionTest.test-seed#[241D37BED7E7A079]) [ ] o.e.j.s.ServerConnector Started ServerConnector@1061fb2{HTTP/1.1}{127.0.0.1:35476}
[junit4] 2> 588236 INFO (TEST-HttpPartitionTest.test-seed#[241D37BED7E7A079]) [ ] o.e.j.s.Server Started @590148ms
[junit4] 2> 588236 INFO (TEST-HttpPartitionTest.test-seed#[241D37BED7E7A079]) [ ] o.a.s.c.s.e.JettySolrRunner Jetty properties: {solr.data.dir=/home/jenkins/workspace/Lucene-Solr-5.x-Linux/solr/build/solr-core/test/J1/temp/solr.cloud.HttpPartitionTest_241D37BED7E7A079-001/tempDir-001/control/data, hostContext=/dq_ddw, hostPort=52423, coreRootDirectory=/home/jenkins/workspace/Lucene-Solr-5.x-Linux/solr/build/solr-core/test/J1/temp/solr.cloud.HttpPartitionTest_241D37BED7E7A079-001/control-001/cores}
[junit4] 2> 588237 INFO (TEST-HttpPartitionTest.test-seed#[241D37BED7E7A079]) [ ] o.a.s.s.SolrDispatchFilter SolrDispatchFilter.init(): sun.misc.Launcher$AppClassLoader@e2f2a
[junit4] 2> 588237 INFO (TEST-HttpPartitionTest.test-seed#[241D37BED7E7A079]) [ ] o.a.s.c.SolrResourceLoader new SolrResourceLoader for directory: '/home/jenkins/workspace/Lucene-Solr-5.x-Linux/solr/build/solr-core/test/J1/temp/solr.cloud.HttpPartitionTest_241D37BED7E7A079-001/control-001/'
[junit4] 2> 588245 INFO (TEST-HttpPartitionTest.test-seed#[241D37BED7E7A079]) [ ] o.a.s.c.c.SolrZkClient Using default ZkCredentialsProvider
[junit4] 2> 588246 INFO (TEST-HttpPartitionTest.test-seed#[241D37BED7E7A079]) [ ] o.a.s.c.c.ConnectionManager Waiting for client to connect to ZooKeeper
[junit4] 2> 588246 INFO (zkCallback-760-thread-1) [ ] o.a.s.c.c.ConnectionManager Watcher org.apache.solr.common.cloud.ConnectionManager@1464ee1 name:ZooKeeperConnection Watcher:127.0.0.1:37010/solr got event WatchedEvent state:SyncConnected type:None path:null path:null type:None
[junit4] 2> 588246 INFO (TEST-HttpPartitionTest.test-seed#[241D37BED7E7A079]) [ ] o.a.s.c.c.ConnectionManager Client is connected to ZooKeeper
[junit4] 2> 588247 INFO (TEST-HttpPartitionTest.test-seed#[241D37BED7E7A079]) [ ] o.a.s.c.c.SolrZkClient Using default ZkACLProvider
[junit4] 2> 588247 INFO (TEST-HttpPartitionTest.test-seed#[241D37BED7E7A079]) [ ] o.a.s.s.SolrDispatchFilter Loading solr.xml from SolrHome (not found in ZooKeeper)
[junit4] 2> 588247 INFO (TEST-HttpPartitionTest.test-seed#[241D37BED7E7A079]) [ ] o.a.s.c.SolrXmlConfig Loading container configuration from /home/jenkins/workspace/Lucene-Solr-5.x-Linux/solr/build/solr-core/test/J1/temp/solr.cloud.HttpPartitionTest_241D37BED7E7A079-001/control-001/solr.xml
[junit4] 2> 588252 INFO (TEST-HttpPartitionTest.test-seed#[241D37BED7E7A079]) [ ] o.a.s.c.CoresLocator Config-defined core root directory: /home/jenkins/workspace/Lucene-Solr-5.x-Linux/solr/build/solr-core/test/J1/temp/solr.cloud.HttpPartitionTest_241D37BED7E7A079-001/control-001/cores
[junit4] 2> 588252 INFO (TEST-HttpPartitionTest.test-seed#[241D37BED7E7A079]) [ ] o.a.s.c.CoreContainer New CoreContainer 23978959
[junit4] 2> 588252 INFO (TEST-HttpPartitionTest.test-seed#[241D37BED7E7A079]) [ ] o.a.s.c.CoreContainer Loading cores into CoreContainer [instanceDir=/home/jenkins/workspace/Lucene-Solr-5.x-Linux/solr/build/solr-core/test/J1/temp/solr.cloud.HttpPartitionTest_241D37BED7E7A079-001/control-001/]
[junit4] 2> 588252 INFO (TEST-HttpPartitionTest.test-seed#[241D37BED7E7A079]) [ ] o.a.s.c.CoreContainer loading shared library: /home/jenkins/workspace/Lucene-Solr-5.x-Linux/solr/build/solr-core/test/J1/temp/solr.cloud.HttpPartitionTest_241D37BED7E7A079-001/control-001/lib
[junit4] 2> 588253 WARN (TEST-HttpPartitionTest.test-seed#[241D37BED7E7A079]) [ ] o.a.s.c.SolrResourceLoader Can't find (or read) directory to add to classloader: lib (resolved as: /home/jenkins/workspace/Lucene-Solr-5.x-Linux/solr/build/solr-core/test/J1/temp/solr.cloud.HttpPartitionTest_241D37BED7E7A079-001/control-001/lib).
[junit4] 2> 588257 INFO (TEST-HttpPartitionTest.test-seed#[241D37BED7E7A079]) [ ] o.a.s.h.c.HttpShardHandlerFactory created with socketTimeout : 90000,urlScheme : ,connTimeout : 15000,maxConnectionsPerHost : 20,maxConnections : 10000,corePoolSize : 0,maximumPoolSize : 2147483647,maxThreadIdleTime : 5,sizeOfQueue : -1,fairnessPolicy : false,useRetries : false,
[junit4] 2> 588258 INFO (TEST-HttpPartitionTest.test-seed#[241D37BED7E7A079]) [ ] o.a.s.u.UpdateShardHandler Creating UpdateShardHandler HTTP client with params: socketTimeout=340000&connTimeout=45000&retry=true
[junit4] 2> 588258 INFO (TEST-HttpPartitionTest.test-seed#[241D37BED7E7A079]) [ ] o.a.s.l.LogWatcher SLF4J impl is org.slf4j.impl.Log4jLoggerFactory
[junit4] 2> 588258 INFO (TEST-HttpPartitionTest.test-seed#[241D37BED7E7A079]) [ ] o.a.s.l.LogWatcher Registering Log Listener [Log4j (org.slf4j.impl.Log4jLoggerFactory)]
[junit4] 2> 588258 INFO (TEST-HttpPartitionTest.test-seed#[241D37BED7E7A079]) [ ] o.a.s.c.ZkContainer Zookeeper client=127.0.0.1:37010/solr
[junit4] 2> 588258 INFO (TEST-HttpPartitionTest.test-seed#[241D37BED7E7A079]) [ ] o.a.s.c.ZkController zkHost includes chroot
[junit4] 2> 588259 INFO (TEST-HttpPartitionTest.test-seed#[241D37BED7E7A079]) [ ] o.a.s.c.c.SolrZkClient Using default ZkCredentialsProvider
[junit4] 2> 588259 INFO (TEST-HttpPartitionTest.test-seed#[241D37BED7E7A079]) [ ] o.a.s.c.c.ConnectionManager Waiting for client to connect to ZooKeeper
[junit4] 2> 588259 INFO (zkCallback-762-thread-1) [ ] o.a.s.c.c.ConnectionManager Watcher org.apache.solr.common.cloud.ConnectionManager@10e8255 name:ZooKeeperConnection Watcher:127.0.0.1:37010 got event WatchedEvent state:SyncConnected type:None path:null path:null type:None
[junit4] 2> 588260 INFO (TEST-HttpPartitionTest.test-seed#[241D37BED7E7A079]) [ ] o.a.s.c.c.ConnectionManager Client is connected to ZooKeeper
[junit4] 2> 588260 INFO (TEST-HttpPartitionTest.test-seed#[241D37BED7E7A079]) [ ] o.a.s.c.c.SolrZkClient Using default ZkACLProvider
[junit4] 2> 588261 INFO (TEST-HttpPartitionTest.test-seed#[241D37BED7E7A079]) [n:127.0.0.1:52423_dq_ddw ] o.a.s.c.c.ConnectionManager Waiting for client to connect to ZooKeeper
[junit4] 2> 588261 INFO (zkCallback-763-thread-1-processing-n:127.0.0.1:52423_dq_ddw) [n:127.0.0.1:52423_dq_ddw ] o.a.s.c.c.ConnectionManager Watcher org.apache.solr.common.cloud.ConnectionManager@988f15 name:ZooKeeperConnection Watcher:127.0.0.1:37010/solr got event WatchedEvent state:SyncConnected type:None path:null path:null type:None
[junit4] 2> 588262 INFO (TEST-HttpPartitionTest.test-seed#[241D37BED7E7A079]) [n:127.0.0.1:52423_dq_ddw ] o.a.s.c.c.ConnectionManager Client is connected to ZooKeeper
[junit4] 2> 588262 INFO (TEST-HttpPartitionTest.test-seed#[241D37BED7E7A079]) [n:127.0.0.1:52423_dq_ddw ] o.a.s.c.c.SolrZkClient makePath: /overseer/queue
[junit4] 2> 588263 INFO (TEST-HttpPartitionTest.test-seed#[241D37BED7E7A079]) [n:127.0.0.1:52423_dq_ddw ] o.a.s.c.c.SolrZkClient makePath: /overseer/collection-queue-work
[junit4] 2> 588264 INFO (TEST-HttpPartitionTest.test-seed#[241D37BED7E7A079]) [n:127.0.0.1:52423_dq_ddw ] o.a.s.c.c.SolrZkClient makePath: /overseer/collection-map-running
[junit4] 2> 588264 INFO (TEST-HttpPartitionTest.test-seed#[241D37BED7E7A079]) [n:127.0.0.1:52423_dq_ddw ] o.a.s.c.c.SolrZkClient makePath: /overseer/collection-map-completed
[junit4] 2> 588265 INFO (TEST-HttpPartitionTest.test-seed#[241D37BED7E7A079]) [n:127.0.0.1:52423_dq_ddw ] o.a.s.c.c.SolrZkClient makePath: /overseer/collection-map-failure
[junit4] 2> 588266 INFO (TEST-HttpPartitionTest.test-seed#[241D37BED7E7A079]) [n:127.0.0.1:52423_dq_ddw ] o.a.s.c.c.SolrZkClient makePath: /live_nodes
[junit4] 2> 588266 INFO (TEST-HttpPartitionTest.test-seed#[241D37BED7E7A079]) [n:127.0.0.1:52423_dq_ddw ] o.a.s.c.c.SolrZkClient makePath: /aliases.json
[junit4] 2> 588267 INFO (TEST-HttpPartitionTest.test-seed#[241D37BED7E7A079]) [n:127.0.0.1:52423_dq_ddw ] o.a.s.c.c.SolrZkClient makePath: /clusterstate.json
[junit4] 2> 588267 INFO (TEST-HttpPartitionTest.test-seed#[241D37BED7E7A079]) [n:127.0.0.1:52423_dq_ddw ] o.a.s.c.c.SolrZkClient makePath: /security.json
[junit4] 2> 588267 INFO (TEST-HttpPartitionTest.test-seed#[241D37BED7E7A079]) [n:127.0.0.1:52423_dq_ddw ] o.a.s.c.ZkController Register node as live in ZooKeeper:/live_nodes/127.0.0.1:52423_dq_ddw
[junit4] 2> 588267 INFO (TEST-HttpPartitionTest.test-seed#[241D37BED7E7A079]) [n:127.0.0.1:52423_dq_ddw ] o.a.s.c.c.SolrZkClient makePath: /live_nodes/127.0.0.1:52423_dq_ddw
[junit4] 2> 588268 INFO (TEST-HttpPartitionTest.test-seed#[241D37BED7E7A079]) [n:127.0.0.1:52423_dq_ddw ] o.a.s.c.c.SolrZkClient makePath: /overseer_elect
[junit4] 2> 588268 INFO (TEST-HttpPartitionTest.test-seed#[241D37BED7E7A079]) [n:127.0.0.1:52423_dq_ddw ] o.a.s.c.c.SolrZkClient makePath: /overseer_elect/election
[junit4] 2> 588269 INFO (TEST-HttpPartitionTest.test-seed#[241D37BED7E7A079]) [n:127.0.0.1:52423_dq_ddw ] o.a.s.c.Overseer Overseer (id=null) closing
[junit4] 2> 588269 INFO (TEST-HttpPartitionTest.test-seed#[241D37BED7E7A079]) [n:127.0.0.1:52423_dq_ddw ] o.a.s.c.LeaderElector Joined leadership election with path: /overseer_elect/election/94428015044722692-127.0.0.1:52423_dq_ddw-n_0000000000
[junit4] 2> 588269 INFO (TEST-HttpPartitionTest.test-seed#[241D37BED7E7A079]) [n:127.0.0.1:52423_dq_ddw ] o.a.s.c.OverseerElectionContext I am going to be the leader 127.0.0.1:52423_dq_ddw
[junit4] 2> 588270 INFO (TEST-HttpPartitionTest.test-seed#[241D37BED7E7A079]) [n:127.0.0.1:52423_dq_ddw ] o.a.s.c.c.SolrZkClient makePath: /overseer_elect/leader
[junit4] 2> 588270 INFO (TEST-HttpPartitionTest.test-seed#[241D37BED7E7A079]) [n:127.0.0.1:52423_dq_ddw ] o.a.s.c.Overseer Overseer (id=94428015044722692-127.0.0.1:52423_dq_ddw-n_0000000000) starting
[junit4] 2> 588271 INFO (TEST-HttpPartitionTest.test-seed#[241D37BED7E7A079]) [n:127.0.0.1:52423_dq_ddw ] o.a.s.c.c.SolrZkClient makePath: /overseer/queue-work
[junit4] 2> 588272 INFO (TEST-HttpPartitionTest.test-seed#[241D37BED7E7A079]) [n:127.0.0.1:52423_dq_ddw ] o.a.s.c.OverseerAutoReplicaFailoverThread Starting OverseerAutoReplicaFailoverThread autoReplicaFailoverWorkLoopDelay=10000 autoReplicaFailoverWaitAfterExpiration=30000 autoReplicaFailoverBadNodeExpiration=60000
[junit4] 2> 588273 INFO (OverseerCollectionConfigSetProcessor-94428015044722692-127.0.0.1:52423_dq_ddw-n_0000000000) [n:127.0.0.1:52423_dq_ddw ] o.a.s.c.OverseerTaskProcessor Process current queue of overseer operations
[junit4] 2> 588273 INFO (TEST-HttpPartitionTest.test-seed#[241D37BED7E7A079]) [n:127.0.0.1:52423_dq_ddw ] o.a.s.c.c.ZkStateReader Updating cluster state from ZooKeeper...
[junit4] 2> 588273 INFO (OverseerStateUpdate-94428015044722692-127.0.0.1:52423_dq_ddw-n_0000000000) [n:127.0.0.1:52423_dq_ddw ] o.a.s.c.Overseer Starting to work on the main queue
[junit4] 2> 588286 INFO (TEST-HttpPartitionTest.test-seed#[241D37BED7E7A079]) [n:127.0.0.1:52423_dq_ddw ] o.a.s.c.CoreContainer Security conf doesn't exist. Skipping setup for authorization module.
[junit4] 2> 588286 INFO (TEST-HttpPartitionTest.test-seed#[241D37BED7E7A079]) [n:127.0.0.1:52423_dq_ddw ] o.a.s.c.CoreContainer No authentication plugin used.
[junit4] 2> 588287 INFO (TEST-HttpPartitionTest.test-seed#[241D37BED7E7A079]) [n:127.0.0.1:52423_dq_ddw ] o.a.s.c.CoresLocator Looking for core definitions underneath /home/jenkins/workspace/Lucene-Solr-5.x-Linux/solr/build/solr-core/test/J1/temp/solr.cloud.HttpPartitionTest_241D37BED7E7A079-001/control-001/cores
[junit4] 2> 588287 INFO (TEST-HttpPartitionTest.test-seed#[241D37BED7E7A079]) [n:127.0.0.1:52423_dq_ddw ] o.a.s.c.SolrCore Created CoreDescriptor: {name=collection1, config=solrconfig.xml, transient=false, schema=schema.xml, loadOnStartup=true, configSetProperties=configsetprops.json, instanceDir=/home/jenkins/workspace/Lucene-Solr-5.x-Linux/solr/build/solr-core/test/J1/temp/solr.cloud.HttpPartitionTest_241D37BED7E7A079-001/control-001/cores/collection1, collection=control_collection, absoluteInstDir=/home/jenkins/workspace/Lucene-Solr-5.x-Linux/solr/build/solr-core/test/J1/temp/solr.cloud.HttpPartitionTest_241D37BED7E7A079-001/control-001/cores/collection1/, coreNodeName=, dataDir=data/, shard=}
[junit4] 2> 588287 INFO (TEST-HttpPartitionTest.test-seed#[241D37BED7E7A079]) [n:127.0.0.1:52423_dq_ddw ] o.a.s.c.CoresLocator Found core collection1 in /home/jenkins/workspace/Lucene-Solr-5.x-Linux/solr/build/solr-core/test/J1/temp/solr.cloud.HttpPartitionTest_241D37BED7E7A079-001/control-001/cores/collection1/
[junit4] 2> 588287 INFO (TEST-HttpPartitionTest.test-seed#[241D37BED7E7A079]) [n:127.0.0.1:52423_dq_ddw ] o.a.s.c.CoresLocator Found 1 core definitions
[junit4] 2> 588288 INFO (TEST-HttpPartitionTest.test-seed#[241D37BED7E7A079]) [n:127.0.0.1:52423_dq_ddw ] o.a.s.s.SolrDispatchFilter user.dir=/home/jenkins/workspace/Lucene-Solr-5.x-Linux/solr/build/solr-core/test/J1
[junit4] 2> 588288 INFO (coreLoadExecutor-2360-thread-1-processing-n:127.0.0.1:52423_dq_ddw) [n:127.0.0.1:52423_dq_ddw c:control_collection x:collection1] o.a.s.c.ZkController publishing state=down
[junit4] 2> 588288 INFO (coreLoadExecutor-2360-thread-1-processing-n:127.0.0.1:52423_dq_ddw) [n:127.0.0.1:52423_dq_ddw c:control_collection x:collection1] o.a.s.c.ZkController numShards not found on descriptor - reading it from system property
[junit4] 2> 588288 INFO (TEST-HttpPartitionTest.test-seed#[241D37BED7E7A079]) [n:127.0.0.1:52423_dq_ddw ] o.a.s.s.SolrDispatchFilter SolrDispatchFilter.init() done
[junit4] 2> 588289 INFO (OverseerStateUpdate-94428015044722692-127.0.0.1:52423_dq_ddw-n_0000000000) [n:127.0.0.1:52423_dq_ddw ] o.a.s.c.Overseer processMessage: queueSize: 1, message = {
[junit4] 2> "core":"collection1",
[junit4] 2> "roles":null,
[junit4] 2> "base_url":"http://127.0.0.1:52423/dq_ddw",
[junit4] 2> "node_name":"127.0.0.1:52423_dq_ddw",
[junit4] 2> "numShards":"1",
[junit4] 2> "state":"down",
[junit4] 2> "shard":null,
[junit4] 2> "collection":"control_collection",
[junit4] 2> "operation":"state"} current state version: 0
[junit4] 2> 588289 INFO (coreLoadExecutor-2360-thread-1-processing-n:127.0.0.1:52423_dq_ddw) [n:127.0.0.1:52423_dq_ddw c:control_collection x:collection1] o.a.s.c.ZkController look for our core node name
[junit4] 2> 588289 INFO (OverseerStateUpdate-94428015044722692-127.0.0.1:52423_dq_ddw-n_0000000000) [n:127.0.0.1:52423_dq_ddw ] o.a.s.c.o.ReplicaMutator Update state numShards=1 message={
[junit4] 2> "core":"collection1",
[junit4] 2> "roles":null,
[junit4] 2> "base_url":"http://127.0.0.1:52423/dq_ddw",
[junit4] 2> "node_name":"127.0.0.1:52423_dq_ddw",
[junit4] 2> "numShards":"1",
[junit4] 2> "state":"down",
[junit4] 2> "shard":null,
[junit4] 2> "collection":"control_collection",
[junit4] 2> "operation":"state"}
[junit4] 2> 588289 INFO (OverseerStateUpdate-94428015044722692-127.0.0.1:52423_dq_ddw-n_0000000000) [n:127.0.0.1:52423_dq_ddw ] o.a.s.c.o.ClusterStateMutator building a new cName: control_collection
[junit4] 2> 588290 INFO (OverseerStateUpdate-94428015044722692-127.0.0.1:52423_dq_ddw-n_0000000000) [n:127.0.0.1:52423_dq_ddw ] o.a.s.c.o.ReplicaMutator Assigning new node to shard shard=shard1
[junit4] 2> 588290 INFO (zkCallback-763-thread-1-processing-n:127.0.0.1:52423_dq_ddw) [n:127.0.0.1:52423_dq_ddw ] o.a.s.c.c.ZkStateReader A cluster state change: WatchedEvent state:SyncConnected type:NodeDataChanged path:/clusterstate.json, has occurred - updating... (live nodes size: 1)
[junit4] 2> 589289 INFO (coreLoadExecutor-2360-thread-1-processing-n:127.0.0.1:52423_dq_ddw) [n:127.0.0.1:52423_dq_ddw c:control_collection x:collection1] o.a.s.c.ZkController waiting to find shard id in clusterstate for collection1
[junit4] 2> 589289 INFO (coreLoadExecutor-2360-thread-1-processing-n:127.0.0.1:52423_dq_ddw) [n:127.0.0.1:52423_dq_ddw c:control_collection x:collection1] o.a.s.c.ZkController Check for collection zkNode:control_collection
[junit4] 2> 589290 INFO (coreLoadExecutor-2360-thread-1-processing-n:127.0.0.1:52423_dq_ddw) [n:127.0.0.1:52423_dq_ddw c:control_collection x:collection1] o.a.s.c.ZkController Collection zkNode exists
[junit4] 2> 589290 INFO (coreLoadExecutor-2360-thread-1-processing-n:127.0.0.1:52423_dq_ddw) [n:127.0.0.1:52423_dq_ddw c:control_collection x:collection1] o.a.s.c.c.ZkStateReader Load collection config from:/collections/control_collection
[junit4] 2> 589290 INFO (coreLoadExecutor-2360-thread-1-processing-n:127.0.0.1:52423_dq_ddw) [n:127.0.0.1:52423_dq_ddw c:control_collection x:collection1] o.a.s.c.c.ZkStateReader path=/collections/control_collection configName=conf1 specified config exists in ZooKeeper
[junit4] 2> 589290 INFO (coreLoadExecutor-2360-thread-1-processing-n:127.0.0.1:52423_dq_ddw) [n:127.0.0.1:52423_dq_ddw c:control_collection x:collection1] o.a.s.c.SolrResourceLoader new SolrResourceLoader for directory: '/home/jenkins/workspace/Lucene-Solr-5.x-Linux/solr/build/solr-core/test/J1/temp/solr.cloud.HttpPartitionTest_241D37BED7E7A079-001/control-001/cores/collection1/'
[junit4] 2> 589297 INFO (coreLoadExecutor-2360-thread-1-processing-n:127.0.0.1:52423_dq_ddw) [n:127.0.0.1:52423_dq_ddw c:control_collection x:collection1] o.a.s.c.Config loaded config solrconfig.xml with version 0
[junit4] 2> 589300 INFO (coreLoadExecutor-2360-thread-1-processing-n:127.0.0.1:52423_dq_ddw) [n:127.0.0.1:52423_dq_ddw c:control_collection x:collection1] o.a.s.c.SolrConfig current version of requestparams : -1
[junit4] 2> 589305 INFO (coreLoadExecutor-2360-thread-1-processing-n:127.0.0.1:52423_dq_ddw) [n:127.0.0.1:52423_dq_ddw c:control_collection x:collection1] o.a.s.c.SolrConfig Using Lucene MatchVersion: 5.4.0
[junit4] 2> 589311 INFO (coreLoadExecutor-2360-thread-1-processing-n:127.0.0.1:52423_dq_ddw) [n:127.0.0.1:52423_dq_ddw c:control_collection x:collection1] o.a.s.c.Config Loaded SolrConfig: solrconfig.xml
[junit4] 2> 589312 INFO (coreLoadExecutor-2360-thread-1-processing-n:127.0.0.1:52423_dq_ddw) [n:127.0.0.1:52423_dq_ddw c:control_collection x:collection1] o.a.s.s.IndexSchema Reading Solr Schema from /configs/conf1/schema.xml
[junit4] 2> 589315 INFO (coreLoadExecutor-2360-thread-1-processing-n:127.0.0.1:52423_dq_ddw) [n:127.0.0.1:52423_dq_ddw c:control_collection x:collection1] o.a.s.s.IndexSchema [collection1] Schema name=test
[junit4] 2> 589375 INFO (coreLoadExecutor-2360-thread-1-processing-n:127.0.0.1:52423_dq_ddw) [n:127.0.0.1:52423_dq_ddw c:control_collection x:collection1] o.a.s.s.OpenExchangeRatesOrgProvider Initialized with rates=open-exchange-rates.json, refreshInterval=1440.
[junit4] 2> 589378 INFO (coreLoadExecutor-2360-thread-1-processing-n:127.0.0.1:52423_dq_ddw) [n:127.0.0.1:52423_dq_ddw c:control_collection x:collection1] o.a.s.s.IndexSchema default search field in schema is text
[junit4] 2> 589379 INFO (coreLoadExecutor-2360-thread-1-processing-n:127.0.0.1:52423_dq_ddw) [n:127.0.0.1:52423_dq_ddw c:control_collection x:collection1] o.a.s.s.IndexSchema unique key field: id
[junit4] 2> 589384 INFO (coreLoadExecutor-2360-thread-1-processing-n:127.0.0.1:52423_dq_ddw) [n:127.0.0.1:52423_dq_ddw c:control_collection x:collection1] o.a.s.s.FileExchangeRateProvider Reloading exchange rates from file currency.xml
[junit4] 2> 589385 INFO (coreLoadExecutor-2360-thread-1-processing-n:127.0.0.1:52423_dq_ddw) [n:127.0.0.1:52423_dq_ddw c:control_collection x:collection1] o.a.s.s.FileExchangeRateProvider Reloading exchange rates from file currency.xml
[junit4] 2> 589386 INFO (coreLoadExecutor-2360-thread-1-processing-n:127.0.0.1:52423_dq_ddw) [n:127.0.0.1:52423_dq_ddw c:control_collection x:collection1] o.a.s.s.OpenExchangeRatesOrgProvider Reloading exchange rates from open-exchange-rates.json
[junit4] 2> 589387 WARN (coreLoadExecutor-2360-thread-1-processing-n:127.0.0.1:52423_dq_ddw) [n:127.0.0.1:52423_dq_ddw c:control_collection x:collection1] o.a.s.s.OpenExchangeRatesOrgProvider Unknown key IMPORTANT NOTE
[junit4] 2> 589387 WARN (coreLoadExecutor-2360-thread-1-processing-n:127.0.0.1:52423_dq_ddw) [n:127.0.0.1:52423_dq_ddw c:control_collection x:collection1] o.a.s.s.OpenExchangeRatesOrgProvider Expected key, got STRING
[junit4] 2> 589387 INFO (coreLoadExecutor-2360-thread-1-processing-n:127.0.0.1:52423_dq_ddw) [n:127.0.0.1:52423_dq_ddw c:control_collection x:collection1] o.a.s.s.OpenExchangeRatesOrgProvider Reloading exchange rates from open-exchange-rates.json
[junit4] 2> 589387 WARN (coreLoadExecutor-2360-thread-1-processing-n:127.0.0.1:52423_dq_ddw) [n:127.0.0.1:52423_dq_ddw c:control_collection x:collection1] o.a.s.s.OpenExchangeRatesOrgProvider Unknown key IMPORTANT NOTE
[junit4] 2> 589387 WARN (coreLoadExecutor-2360-thread-1-processing-n:127.0.0.1:52423_dq_ddw) [n:127.0.0.1:52423_dq_ddw c:control_collection x:collection1] o.a.s.s.OpenExchangeRatesOrgProvider Expected key, got STRING
[junit4] 2> 589388 INFO (coreLoadExecutor-2360-thread-1-processing-n:127.0.0.1:52423_dq_ddw) [n:127.0.0.1:52423_dq_ddw c:control_collection x:collection1] o.a.s.c.ConfigSetProperties Did not find ConfigSet properties, assuming default properties: Can't find resource 'configsetprops.json' in classpath or '/configs/conf1', cwd=/home/jenkins/workspace/Lucene-Solr-5.x-Linux/solr/build/solr-core/test/J1
[junit4] 2> 589388 INFO (coreLoadExecutor-2360-thread-1-processing-n:127.0.0.1:52423_dq_ddw) [n:127.0.0.1:52423_dq_ddw c:control_collection x:collection1] o.a.s.c.CoreContainer Creating SolrCore 'collection1' using configuration from collection control_collection
[junit4] 2> 589388 INFO (coreLoadExecutor-2360-thread-1-processing-n:127.0.0.1:52423_dq_ddw) [n:127.0.0.1:52423_dq_ddw c:control_collection s:shard1 r:core_node1 x:collection1] o.a.s.c.SolrCore org.apache.solr.core.MockDirectoryFactory
[junit4] 2> 589388 INFO (coreLoadExecutor-2360-thread-1-processing-n:127.0.0.1:52423_dq_ddw) [n:127.0.0.1:52423_dq_ddw c:control_collection s:shard1 r:core_node1 x:collection1] o.a.s.c.SolrCore [[collection1] ] Opening new SolrCore at [/home/jenkins/workspace/Lucene-Solr-5.x-Linux/solr/build/solr-core/test/J1/temp/solr.cloud.HttpPartitionTest_241D37BED7E7A079-001/control-001/cores/collection1/], dataDir=[null]
[junit4] 2> 589388 INFO (coreLoadExecutor-2360-thread-1-processing-n:127.0.0.1:52423_dq_ddw) [n:127.0.0.1:52423_dq_ddw c:control_collection s:shard1 r:core_node1 x:collection1] o.a.s.c.JmxMonitoredMap JMX monitoring is enabled. Adding Solr mbeans to JMX Server: com.sun.jmx.mbeanserver.JmxMBeanServer@1794068
[junit4] 2> 589389 INFO (coreLoadExecutor-2360-thread-1-processing-n:127.0.0.1:52423_dq_ddw) [n:127.0.0.1:52423_dq_ddw c:control_collection s:shard1 r:core_node1 x:collection1] o.a.s.c.CachingDirectoryFactory return new directory for /home/jenkins/workspace/Lucene-Solr-5.x-Linux/solr/build/solr-core/test/J1/temp/solr.cloud.HttpPartitionTest_241D37BED7E7A079-001/control-001/cores/collection1/data
[junit4] 2> 589389 INFO (coreLoadExecutor-2360-thread-1-processing-n:127.0.0.1:52423_dq_ddw) [n:127.0.0.1:52423_dq_ddw c:control_collection s:shard1 r:core_node1 x:collection1] o.a.s.c.SolrCore New index directory detected: old=null new=/home/jenkins/workspace/Lucene-Solr-5.x-Linux/solr/build/solr-core/test/J1/temp/solr.cloud.HttpPartitionTest_241D37BED7E7A079-001/control-001/cores/collection1/data/index/
[junit4] 2> 589389 WARN (coreLoadExecutor-2360-thread-1-processing-n:127.0.0.1:52423_dq_ddw) [n:127.0.0.1:52423_dq_ddw c:control_collection s:shard1 r:core_node1 x:collection1] o.a.s.c.SolrCore [collection1] Solr index directory '/home/jenkins/workspace/Lucene-Solr-5.x-Linux/solr/build/solr-core/test/J1/temp/solr.cloud.HttpPartitionTest_241D37BED7E7A079-001/control-001/cores/collection1/data/index' doesn't exist. Creating new index...
[junit4] 2> 589389 INFO (coreLoadExecutor-2360-thread-1-processing-n:127.0.0.1:52423_dq_ddw) [n:127.0.0.1:52423_dq_ddw c:control_collection s:shard1 r:core_node1 x:collection1] o.a.s.c.CachingDirectoryFactory return new directory for /home/jenkins/workspace/Lucene-Solr-5.x-Linux/solr/build/solr-core/test/J1/temp/solr.cloud.HttpPartitionTest_241D37BED7E7A079-001/control-001/cores/collection1/data/index
[junit4] 2> 589389 INFO (coreLoadExecutor-2360-thread-1-processing-n:127.0.0.1:52423_dq_ddw) [n:127.0.0.1:52423_dq_ddw c:control_collection s:shard1 r:core_node1 x:collection1] o.a.s.u.RandomMergePolicy RandomMergePolicy wrapping class org.apache.lucene.index.LogByteSizeMergePolicy: [LogByteSizeMergePolicy: minMergeSize=1677721, mergeFactor=27, maxMergeSize=2147483648, maxMergeSizeForForcedMerge=9223372036854775807, calibrateSizeByDeletes=true, maxMergeDocs=2147483647, maxCFSSegmentSizeMB=8.796093022207999E12, noCFSRatio=0.5276940457343379]
[junit4] 2> 589389 INFO (coreLoadExecutor-2360-thread-1-processing-n:127.0.0.1:52423_dq_ddw) [n:127.0.0.1:52423_dq_ddw c:control_collection s:shard1 r:core_node1 x:collection1] o.a.s.c.SolrCore SolrDeletionPolicy.onCommit: commits: num=1
[junit4] 2> commit{dir=MockDirectoryWrapper(RAMDirectory@93318d lockFactory=org.apache.lucene.store.SingleInstanceLockFactory@a56316),segFN=segments_1,generation=1}
[junit4] 2> 589389 INFO (coreLoadExecutor-2360-thread-1-processing-n:127.0.0.1:52423_dq_ddw) [n:127.0.0.1:52423_dq_ddw c:control_collection s:shard1 r:core_node1 x:collection1] o.a.s.c.SolrCore newest commit generation = 1
[junit4] 2> 589390 INFO (OldIndexDirectoryCleanupThreadForCore-collection1) [n:127.0.0.1:52423_dq_ddw c:control_collection s:shard1 r:core_node1 x:collection1] o.a.s.c.SolrCore Looking for old index directories to cleanup for core collection1 in /home/jenkins/workspace/Lucene-Solr-5.x-Linux/solr/build/solr-core/test/J1/temp/solr.cloud.HttpPartitionTest_241D37BED7E7A079-001/control-001/cores/collection1/data/
[junit4] 2> 589390 WARN (OldIndexDirectoryCleanupThreadForCore-collection1) [n:127.0.0.1:52423_dq_ddw c:control_collection s:shard1 r:core_node1 x:collection1] o.a.s.c.DirectoryFactory /home/jenkins/workspace/Lucene-Solr-5.x-Linux/solr/build/solr-core/test/J1/temp/solr.cloud.HttpPartitionTest_241D37BED7E7A079-001/control-001/cores/collection1/data/ does not point to a valid data directory; skipping clean-up of old index directories.
[junit4] 2> 589391 INFO (coreLoadExecutor-2360-thread-1-processing-n:127.0.0.1:52423_dq_ddw) [n:127.0.0.1:52423_dq_ddw c:control_collection s:shard1 r:core_node1 x:collection1] o.a.s.u.p.UpdateRequestProcessorChain creating updateRequestProcessorChain "nodistrib"
[junit4] 2> 589391 INFO (coreLoadExecutor-2360-thread-1-processing-n:127.0.0.1:52423_dq_ddw) [n:127.0.0.1:52423_dq_ddw c:control_collection s:shard1 r:core_node1 x:collection1] o.a.s.u.p.UpdateRequestProcessorChain creating updateRequestProcessorChain "dedupe"
[junit4] 2> 589392 INFO (coreLoadExecutor-2360-thread-1-processing-n:127.0.0.1:52423_dq_ddw) [n:127.0.0.1:52423_dq_ddw c:control_collection s:shard1 r:core_node1 x:collection1] o.a.s.u.p.UpdateRequestProcessorChain inserting DistributedUpdateProcessorFactory into updateRequestProcessorChain "dedupe"
[junit4] 2> 589392 INFO (coreLoadExecutor-2360-thread-1-processing-n:127.0.0.1:52423_dq_ddw) [n:127.0.0.1:52423_dq_ddw c:control_collection s:shard1 r:core_node1 x:collection1] o.a.s.u.p.UpdateRequestProcessorChain creating updateRequestProcessorChain "stored_sig"
[junit4] 2> 589392 INFO (coreLoadExecutor-2360-thread-1-processing-n:127.0.0.1:52423_dq_ddw) [n:127.0.0.1:52423_dq_ddw c:control_collection s:shard1 r:core_node1 x:collection1] o.a.s.u.p.UpdateRequestProcessorChain inserting DistributedUpdateProcessorFactory into updateRequestProcessorChain "stored_sig"
[junit4] 2> 589392 INFO (coreLoadExecutor-2360-thread-1-processing-n:127.0.0.1:52423_dq_ddw) [n:127.0.0.1:52423_dq_ddw c:control_collection s:shard1 r:core_node1 x:collection1] o.a.s.u.p.UpdateRequestProcessorChain creating updateRequestProcessorChain "distrib-dup-test-chain-explicit"
[junit4] 2> 589392 INFO (coreLoadExecutor-2360-thread-1-processing-n:127.0.0.1:52423_dq_ddw) [n:127.0.0.1:52423_dq_ddw c:control_collection s:shard1 r:core_node1 x:collection1] o.a.s.u.p.UpdateRequestProcessorChain creating updateRequestProcessorChain "distrib-dup-test-chain-implicit"
[junit4] 2> 589392 INFO (coreLoadExecutor-2360-thread-1-processing-n:127.0.0.1:52423_dq_ddw) [n:127.0.0.1:52423_dq_ddw c:control_collection s:shard1 r:core_node1 x:collection1] o.a.s.u.p.UpdateRequestProcessorChain inserting DistributedUpdateProcessorFactory into updateRequestProcessorChain "distrib-dup-test-chain-implicit"
[junit4] 2> 589392 INFO (coreLoadExecutor-2360-thread-1-processing-n:127.0.0.1:52423_dq_ddw) [n:127.0.0.1:52423_dq_ddw c:control_collection s:shard1 r:core_node1 x:collection1] o.a.s.c.SolrCore no updateRequestProcessorChain defined as default, creating implicit default
[junit4] 2> 589393 INFO (coreLoadExecutor-2360-thread-1-processing-n:127.0.0.1:52423_dq_ddw) [n:127.0.0.1:52423_dq_ddw c:control_collection s:shard1 r:core_node1 x:collection1] o.a.s.h.l.XMLLoader xsltCacheLifetimeSeconds=60
[junit4] 2> 589394 INFO (coreLoadExecutor-2360-thread-1-processing-n:127.0.0.1:52423_dq_ddw) [n:127.0.0.1:52423_dq_ddw c:control_collection s:shard1 r:core_node1 x:collection1] o.a.s.h.l.XMLLoader xsltCacheLifetimeSeconds=60
[junit4] 2> 589394 INFO (coreLoadExecutor-2360-thread-1-processing-n:127.0.0.1:52423_dq_ddw) [n:127.0.0.1:52423_dq_ddw c:control_collection s:shard1 r:core_node1 x:collection1] o.a.s.h.l.XMLLoader xsltCacheLifetimeSeconds=60
[junit4] 2> 589395 INFO (coreLoadExecutor-2360-thread-1-processing-n:127.0.0.1:52423_dq_ddw) [n:127.0.0.1:52423_dq_ddw c:control_collection s:shard1 r:core_node1 x:collection1] o.a.s.h.l.XMLLoader xsltCacheLifetimeSeconds=60
[junit4] 2> 589396 INFO (coreLoadExecutor-2360-thread-1-processing-n:127.0.0.1:52423_dq_ddw) [n:127.0.0.1:52423_dq_ddw c:control_collection s:shard1 r:core_node1 x:collection1] o.a.s.c.RequestHandlers Registered paths: /admin/mbeans,standard,/update/csv,/update/json/docs,/admin/luke,/admin/segments,/get,/admin/system,/replication,/admin/properties,/config,/schema,/admin/plugins,/admin/logging,/update/json,/admin/threads,/admin/ping,/update,/admin/file
[junit4] 2> 589396 INFO (coreLoadExecutor-2360-thread-1-processing-n:127.0.0.1:52423_dq_ddw) [n:127.0.0.1:52423_dq_ddw c:control_collection s:shard1 r:core_node1 x:collection1] o.a.s.c.SolrCore Using default statsCache cache: org.apache.solr.search.stats.LocalStatsCache
[junit4] 2> 589397 INFO (coreLoadExecutor-2360-thread-1-processing-n:127.0.0.1:52423_dq_ddw) [n:127.0.0.1:52423_dq_ddw c:control_collection s:shard1 r:core_node1 x:collection1] o.a.s.u.UpdateHandler Using UpdateLog implementation: org.apache.solr.update.UpdateLog
[junit4] 2> 589397 INFO (coreLoadExecutor-2360-thread-1-processing-n:127.0.0.1:52423_dq_ddw) [n:127.0.0.1:52423_dq_ddw c:control_collection s:shard1 r:core_node1 x:collection1] o.a.s.u.UpdateLog Initializing UpdateLog: dataDir= defaultSyncLevel=FLUSH numRecordsToKeep=100 maxNumLogsToKeep=10 numVersionBuckets=65536
[junit4] 2> 589397 INFO (coreLoadExecutor-2360-thread-1-processing-n:127.0.0.1:52423_dq_ddw) [n:127.0.0.1:52423_dq_ddw c:control_collection s:shard1 r:core_node1 x:collection1] o.a.s.c.SolrCore Hard AutoCommit: disabled
[junit4] 2> 589397 INFO (coreLoadExecutor-2360-thread-1-processing-n:127.0.0.1:52423_dq_ddw) [n:127.0.0.1:52423_dq_ddw c:control_collection s:shard1 r:core_node1 x:collection1] o.a.s.c.SolrCore Soft AutoCommit: disabled
[junit4] 2> 589398 INFO (coreLoadExecutor-2360-thread-1-processing-n:127.0.0.1:52423_dq_ddw) [n:127.0.0.1:52423_dq_ddw c:control_collection s:shard1 r:core_node1 x:collection1] o.a.s.u.RandomMergePolicy RandomMergePolicy wrapping class org.apache.lucene.index.LogDocMergePolicy: [LogDocMergePolicy: minMergeSize=1000, mergeFactor=15, maxMergeSize=9223372036854775807, maxMergeSizeForForcedMerge=9223372036854775807, calibrateSizeByDeletes=true, maxMergeDocs=2147483647, maxCFSSegmentSizeMB=8.796093022207999E12, noCFSRatio=0.0]
[junit4] 2> 589398 INFO (coreLoadExecutor-2360-thread-1-processing-n:127.0.0.1:52423_dq_ddw) [n:127.0.0.1:52423_dq_ddw c:control_collection s:shard1 r:core_node1 x:collection1] o.a.s.c.SolrCore SolrDeletionPolicy.onInit: commits: num=1
[junit4] 2> commit{dir=MockDirectoryWrapper(RAMDirectory@93318d lockFactory=org.apache.lucene.store.SingleInstanceLockFactory@a56316),segFN=segments_1,generation=1}
[junit4] 2> 589398 INFO (coreLoadExecutor-2360-thread-1-processing-n:127.0.0.1:52423_dq_ddw) [n:127.0.0.1:52423_dq_ddw c:control_collection s:shard1 r:core_node1 x:collection1] o.a.s.c.SolrCore newest commit generation = 1
[junit4] 2> 589398 INFO (coreLoadExecutor-2360-thread-1-processing-n:127.0.0.1:52423_dq_ddw) [n:127.0.0.1:52423_dq_ddw c:control_collection s:shard1 r:core_node1 x:collection1] o.a.s.s.SolrIndexSearcher Opening Searcher@defe19[collection1] main
[junit4] 2> 589398 INFO (coreLoadExecutor-2360-thread-1-processing-n:127.0.0.1:52423_dq_ddw) [n:127.0.0.1:52423_dq_ddw c:control_collection s:shard1 r:core_node1 x:collection1] o.a.s.c.c.ZkStateReader Load collection config from:/collections/control_collection
[junit4] 2> 589399 INFO (coreLoadExecutor-2360-thread-1-processing-n:127.0.0.1:52423_dq_ddw) [n:127.0.0.1:52423_dq_ddw c:control_collection s:shard1 r:core_node1 x:collection1] o.a.s.c.c.ZkStateReader path=/collections/control_collection configName=conf1 specified config exists in ZooKeeper
[junit4] 2> 589399 INFO (coreLoadExecutor-2360-thread-1-processing-n:127.0.0.1:52423_dq_ddw) [n:127.0.0.1:52423_dq_ddw c:control_collection s:shard1 r:core_node1 x:collection1] o.a.s.r.ManagedResourceStorage Setting up ZooKeeper-based storage for the RestManager with znodeBase: /configs/conf1
[junit4] 2> 589399 INFO (coreLoadExecutor-2360-thread-1-processing-n:127.0.0.1:52423_dq_ddw) [n:127.0.0.1:52423_dq_ddw c:control_collection s:shard1 r:core_node1 x:collection1] o.a.s.r.ManagedResourceStorage Configured ZooKeeperStorageIO with znodeBase: /configs/conf1
[junit4] 2> 589399 INFO (coreLoadExecutor-2360-thread-1-processing-n:127.0.0.1:52423_dq_ddw) [n:127.0.0.1:52423_dq_ddw c:control_collection s:shard1 r:core_node1 x:collection1] o.a.s.r.RestManager Initializing RestManager with initArgs: {}
[junit4] 2> 589399 INFO (coreLoadExecutor-2360-thread-1-processing-n:127.0.0.1:52423_dq_ddw) [n:127.0.0.1:52423_dq_ddw c:control_collection s:shard1 r:core_node1 x:collection1] o.a.s.r.ManagedResourceStorage Reading _rest_managed.json using ZooKeeperStorageIO:path=/configs/conf1
[junit4] 2> 589399 INFO (coreLoadExecutor-2360-thread-1-processing-n:127.0.0.1:52423_dq_ddw) [n:127.0.0.1:52423_dq_ddw c:control_collection s:shard1 r:core_node1 x:collection1] o.a.s.r.ManagedResourceStorage No data found for znode /configs/conf1/_rest_managed.json
[junit4] 2> 589399 INFO (coreLoadExecutor-2360-thread-1-processing-n:127.0.0.1:52423_dq_ddw) [n:127.0.0.1:52423_dq_ddw c:control_collection s:shard1 r:core_node1 x:collection1] o.a.s.r.ManagedResourceStorage Loaded null at path _rest_managed.json using ZooKeeperStorageIO:path=/configs/conf1
[junit4] 2> 589399 INFO (coreLoadExecutor-2360-thread-1-processing-n:127.0.0.1:52423_dq_ddw) [n:127.0.0.1:52423_dq_ddw c:control_collection s:shard1 r:core_node1 x:collection1] o.a.s.r.RestManager Initializing 0 registered ManagedResources
[junit4] 2> 589400 INFO (coreLoadExecutor-2360-thread-1-processing-n:127.0.0.1:52423_dq_ddw) [n:127.0.0.1:52423_dq_ddw c:control_collection s:shard1 r:core_node1 x:collection1] o.a.s.h.ReplicationHandler Commits will be reserved for 10000
[junit4] 2> 589400 INFO (searcherExecutor-2361-thread-1-processing-n:127.0.0.1:52423_dq_ddw x:collection1 s:shard1 c:control_collection r:core_node1) [n:127.0.0.1:52423_dq_ddw c:control_collection s:shard1 r:core_node1 x:collection1] o.a.s.c.SolrCore [collection1] Registered new searcher Searcher@defe19[collection1] main{ExitableDirectoryReader(UninvertingDirectoryReader())}
[junit4] 2> 589400 INFO (coreLoadExecutor-2360-thread-1-processing-n:127.0.0.1:52423_dq_ddw) [n:127.0.0.1:52423_dq_ddw c:control_collection s:shard1 r:core_node1 x:collection1] o.a.s.u.UpdateLog Looking up max value of version field to seed version buckets
[junit4] 2> 589400 INFO (coreLoadExecutor-2360-thread-1-processing-n:127.0.0.1:52423_dq_ddw) [n:127.0.0.1:52423_dq_ddw c:control_collection s:shard1 r:core_node1 x:collection1] o.a.s.u.VersionInfo Refreshing highest value of _version_ for 65536 version buckets from index
[junit4] 2> 589400 INFO (coreLoadExecutor-2360-thread-1-processing-n:127.0.0.1:52423_dq_ddw) [n:127.0.0.1:52423_dq_ddw c:control_collection s:shard1 r:core_node1 x:collection1] o.a.s.u.VersionInfo No terms found for _version_, cannot seed version bucket highest value from index
[junit4] 2> 589400 INFO (coreLoadExecutor-2360-thread-1-processing-n:127.0.0.1:52423_dq_ddw) [n:127.0.0.1:52423_dq_ddw c:control_collection s:shard1 r:core_node1 x:collection1] o.a.s.u.UpdateLog Could not find max version in index or recent updates, using new clock 1510848242109120512
[junit4] 2> 589402 INFO (coreLoadExecutor-2360-thread-1-processing-n:127.0.0.1:52423_dq_ddw) [n:127.0.0.1:52423_dq_ddw c:control_collection s:shard1 r:core_node1 x:collection1] o.a.s.u.UpdateLog Took 1.0ms to seed version buckets with highest version 1510848242109120512
[junit4] 2> 589402 INFO (coreLoadExecutor-2360-thread-1-processing-n:127.0.0.1:52423_dq_ddw) [n:127.0.0.1:52423_dq_ddw c:control_collection s:shard1 r:core_node1 x:collection1] o.a.s.c.ZkController watch zkdir /configs/conf1
[junit4] 2> 589402 INFO (coreLoadExecutor-2360-thread-1-processing-n:127.0.0.1:52423_dq_ddw) [n:127.0.0.1:52423_dq_ddw c:control_collection s:shard1 r:core_node1 x:collection1] o.a.s.c.CoreContainer registering core: collection1
[junit4] 2> 589402 INFO (coreZkRegister-2354-thread-1-processing-n:127.0.0.1:52423_dq_ddw x:collection1 s:shard1 c:control_collection r:core_node1) [n:127.0.0.1:52423_dq_ddw c:control_collection s:shard1 r:core_node1 x:collection1] o.a.s.c.ZkController Register replica - core:collection1 address:http://127.0.0.1:52423/dq_ddw collection:control_collection shard:shard1
[junit4] 2> 589403 INFO (coreZkRegister-2354-thread-1-processing-n:127.0.0.1:52423_dq_ddw x:collection1 s:shard1 c:control_collection r:core_node1) [n:127.0.0.1:52423_dq_ddw c:control_collection s:shard1 r:core_node1 x:collection1] o.a.s.c.c.SolrZkClient makePath: /collections/control_collection/leader_elect/shard1/election
[junit4] 2> 589404 INFO (coreZkRegister-2354-thread-1-processing-n:127.0.0.1:52423_dq_ddw x:collection1 s:shard1 c:control_collection r:core_node1) [n:127.0.0.1:52423_dq_ddw c:control_collection s:shard1 r:core_node1 x:collection1] o.a.s.c.LeaderElector Joined leadership election with path: /collections/control_collection/leader_elect/shard1/election/94428015044722692-core_node1-n_0000000000
[junit4] 2> 589404 INFO (coreZkRegister-2354-thread-1-processing-n:127.0.0.1:52423_dq_ddw x:collection1 s:shard1 c:control_collection r:core_node1) [n:127.0.0.1:52423_dq_ddw c:control_collection s:shard1 r:core_node1 x:collection1] o.a.s.c.ShardLeaderElectionContext Running the leader process for shard shard1
[junit4] 2> 589404 INFO (coreZkRegister-2354-thread-1-processing-n:127.0.0.1:52423_dq_ddw x:collection1 s:shard1 c:control_collection r:core_node1) [n:127.0.0.1:52423_dq_ddw c:control_collection s:shard1 r:core_node1 x:collection1] o.a.s.c.ShardLeaderElectionContext Enough replicas found to continue.
[junit4] 2> 589405 INFO (coreZkRegister-2354-thread-1-processing-n:127.0.0.1:52423_dq_ddw x:collection1 s:shard1 c:control_collection r:core_node1) [n:127.0.0.1:52423_dq_ddw c:control_collection s:shard1 r:core_node1 x:collection1] o.a.s.c.ShardLeaderElectionContext I may be the new leader - try and sync
[junit4] 2> 589405 INFO (OverseerStateUpdate-94428015044722692-127.0.0.1:52423_dq_ddw-n_0000000000) [n:127.0.0.1:52423_dq_ddw ] o.a.s.c.Overseer processMessage: queueSize: 1, message = {
[junit4] 2> "operation":"leader",
[junit4] 2> "shard":"shard1",
[junit4] 2> "collection":"control_collection"} current state version: 1
[junit4] 2> 589405 INFO (coreZkRegister-2354-thread-1-processing-n:127.0.0.1:52423_dq_ddw x:collection1 s:shard1 c:control_collection r:core_node1) [n:127.0.0.1:52423_dq_ddw c:control_collection s:shard1 r:core_node1 x:collection1] o.a.s.c.SyncStrategy Sync replicas to http://127.0.0.1:52423/dq_ddw/collection1/
[junit4] 2> 589405 INFO (coreZkRegister-2354-thread-1-processing-n:127.0.0.1:52423_dq_ddw x:collection1 s:shard1 c:control_collection r:core_node1) [n:127.0.0.1:52423_dq_ddw c:control_collection s:shard1 r:core_node1 x:collection1] o.a.s.c.SyncStrategy Sync Success - now sync replicas to me
[junit4] 2> 589405 INFO (coreZkRegister-2354-thread-1-processing-n:127.0.0.1:52423_dq_ddw x:collection1 s:shard1 c:control_collection r:core_node1) [n:127.0.0.1:52423_dq_ddw c:control_collection s:shard1 r:core_node1 x:collection1] o.a.s.c.SyncStrategy http://127.0.0.1:52423/dq_ddw/collection1/ has no replicas
[junit4] 2> 589405 INFO (coreZkRegister-2354-thread-1-processing-n:127.0.0.1:52423_dq_ddw x:collection1 s:shard1 c:control_collection r:core_node1) [n:127.0.0.1:52423_dq_ddw c:control_collection s:shard1 r:core_node1 x:collection1] o.a.s.c.ShardLeaderElectionContext I am the new leader: http://127.0.0.1:52423/dq_ddw/collection1/ shard1
[junit4] 2> 589405 INFO (coreZkRegister-2354-thread-1-processing-n:127.0.0.1:52423_dq_ddw x:collection1 s:shard1 c:control_collection r:core_node1) [n:127.0.0.1:52423_dq_ddw c:control_collection s:shard1 r:core_node1 x:collection1] o.a.s.c.c.SolrZkClient makePath: /collections/control_collection/leaders/shard1
[junit4] 2> 589406 INFO (OverseerStateUpdate-94428015044722692-127.0.0.1:52423_dq_ddw-n_0000000000) [n:127.0.0.1:52423_dq_ddw ] o.a.s.c.Overseer processMessage: queueSize: 1, message = {
[junit4] 2> "operation":"leader",
[junit4] 2> "shard":"shard1",
[junit4] 2> "collection":"control_collection",
[junit4] 2> "base_url":"http://127.0.0.1:52423/dq_ddw",
[junit4] 2> "core":"collection1",
[junit4] 2> "state":"active"} current state version: 1
[junit4] 2> 589507 INFO (zkCallback-763-thread-1-processing-n:127.0.0.1:52423_dq_ddw) [n:127.0.0.1:52423_dq_ddw ] o.a.s.c.c.ZkStateReader A cluster state change: WatchedEvent state:SyncConnected type:NodeDataChanged path:/clusterstate.json, has occurred - updating... (live nodes size: 1)
[junit4] 2> 589557 INFO (coreZkRegister-2354-thread-1-processing-n:127.0.0.1:52423_dq_ddw x:collection1 s:shard1 c:control_collection r:core_node1) [n:127.0.0.1:52423_dq_ddw c:control_collection s:shard1 r:core_node1 x:collection1] o.a.s.c.ZkController We are http://127.0.0.1:52423/dq_ddw/collection1/ and leader is http://127.0.0.1:52423/dq_ddw/collection1/
[junit4] 2> 589557 INFO (coreZkRegister-2354-thread-1-processing-n:127.0.0.1:52423_dq_ddw x:collection1 s:shard1 c:control_collection r:core_node1) [n:127.0.0.1:52423_dq_ddw c:control_collection s:shard1 r:core_node1 x:collection1] o.a.s.c.ZkController No LogReplay needed for core=collection1 baseURL=http://127.0.0.1:52423/dq_ddw
[junit4] 2> 589557 INFO (coreZkRegister-2354-thread-1-processing-n:127.0.0.1:52423_dq_ddw x:collection1 s:shard1 c:control_collection r:core_node1) [n:127.0.0.1:52423_dq_ddw c:control_collection s:shard1 r:core_node1 x:collection1] o.a.s.c.ZkController I am the leader, no recovery necessary
[junit4] 2> 589557 INFO (coreZkRegister-2354-thread-1-processing-n:127.0.0.1:52423_dq_ddw x:collection1 s:shard1 c:control_collection r:core_node1) [n:127.0.0.1:52423_dq_ddw c:control_collection s:shard1 r:core_node1 x:collection1] o.a.s.c.ZkController publishing state=active
[junit4] 2> 589557 INFO (coreZkRegister-2354-thread-1-processing-n:127.0.0.1:52423_dq_ddw x:collection1 s:shard1 c:control_collection r:core_node1) [n:127.0.0.1:52423_dq_ddw c:control_collection s:shard1 r:core_node1 x:collection1] o.a.s.c.ZkController numShards not found on descriptor - reading it from system property
[junit4] 2> 589558 INFO (OverseerStateUpdate-94428015044722692-127.0.0.1:52423_dq_ddw-n_0000000000) [n:127.0.0.1:52423_dq_ddw ] o.a.s.c.Overseer processMessage: queueSize: 1, message = {
[junit4] 2> "core":"collection1",
[junit4] 2> "core_node_name":"core_node1",
[junit4] 2> "roles":null,
[junit4] 2> "base_url":"http://127.0.0.1:52423/dq_ddw",
[junit4] 2> "node_name":"127.0.0.1:52423_dq_ddw",
[junit4] 2> "numShards":"1",
[junit4] 2> "state":"active",
[junit4] 2> "shard":"shard1",
[junit4] 2> "collection":"control_collection",
[junit4] 2> "operation":"state"} current state version: 2
[junit4] 2> 589558 INFO (OverseerStateUpdate-94428015044722692-127.0.0.1:52423_dq_ddw-n_0000000000) [n:127.0.0.1:52423_dq_ddw ] o.a.s.c.o.ReplicaMutator Update state numShards=1 message={
[junit4] 2> "core":"collection1",
[junit4] 2> "core_node_name":"core_node1",
[junit4] 2> "roles":null,
[junit4] 2> "base_url":"http://127.0.0.1:52423/dq_ddw",
[junit4] 2> "node_name":"127.0.0.1:52423_dq_ddw",
[junit4] 2> "numShards":"1",
[junit4] 2> "state":"active",
[junit4] 2> "shard":"shard1",
[junit4] 2> "collection":"control_collection",
[junit4] 2> "operation":"state"}
[junit4] 2> 589659 INFO (zkCallback-763-thread-1-processing-n:127.0.0.1:52423_dq_ddw) [n:127.0.0.1:52423_dq_ddw ] o.a.s.c.c.ZkStateReader A cluster state change: WatchedEvent state:SyncConnected type:NodeDataChanged path:/clusterstate.json, has occurred - updating... (live nodes size: 1)
[junit4] 2> 589790 INFO (TEST-HttpPartitionTest.test-seed#[241D37BED7E7A079]) [ ] o.a.s.c.c.SolrZkClient Using default ZkCredentialsProvider
[junit4] 2> 589791 INFO (TEST-HttpPartitionTest.test-seed#[241D37BED7E7A079]) [ ] o.a.s.c.c.ConnectionManager Waiting for client to connect to ZooKeeper
[junit4] 2> 589794 INFO (zkCallback-765-thread-1) [ ] o.a.s.c.c.ConnectionManager Watcher org.apache.solr.common.cloud.ConnectionManager@c4793f name:ZooKeeperConnection Watcher:127.0.0.1:37010/solr got event WatchedEvent state:SyncConnected type:None path:null path:null type:None
[junit4] 2> 589794 INFO (TEST-HttpPartitionTest.test-seed#[241D37BED7E7A079]) [ ] o.a.s.c.c.ConnectionManager Client is connected to ZooKeeper
[junit4] 2> 589794 INFO (TEST-HttpPartitionTest.test-seed#[241D37BED7E7A079]) [ ] o.a.s.c.c.SolrZkClient Using default ZkACLProvider
[junit4] 2> 589794 INFO (TEST-HttpPartitionTest.test-seed#[241D37BED7E7A079]) [ ] o.a.s.c.c.ZkStateReader Updating cluster state from ZooKeeper...
[junit4] 2> 589795 INFO (TEST-HttpPartitionTest.test-seed#[241D37BED7E7A079]) [ ] o.a.s.c.ChaosMonkey monkey: init - expire sessions:false cause connection loss:false
[junit4] 2> 589841 INFO (TEST-HttpPartitionTest.test-seed#[241D37BED7E7A079]) [ ] o.a.s.SolrTestCaseJ4 Writing core.properties file to /home/jenkins/workspace/Lucene-Solr-5.x-Linux/solr/build/solr-core/test/J1/temp/solr.cloud.HttpPartitionTest_241D37BED7E7A079-001/shard-1-001/cores/collection1
[junit4] 2> 589842 INFO (TEST-HttpPartitionTest.test-seed#[241D37BED7E7A079]) [ ] o.a.s.c.AbstractFullDistribZkTestBase create jetty 1 in directory /home/jenkins/workspace/Lucene-Solr-5.x-Linux/solr/build/solr-core/test/J1/temp/solr.cloud.HttpPartitionTest_241D37BED7E7A079-001/shard-1-001
[junit4] 2> 589842 INFO (TEST-HttpPartitionTest.test-seed#[241D37BED7E7A079]) [ ] o.e.j.s.Server jetty-9.2.13.v20150730
[junit4] 2> 589846 INFO (TEST-HttpPartitionTest.test-seed#[241D37BED7E7A079]) [ ] o.e.j.s.h.ContextHandler Started o.e.j.s.ServletContextHandler@500fd5{/dq_ddw,null,AVAILABLE}
[junit4] 2> 589847 INFO (TEST-HttpPartitionTest.test-seed#[241D37BED7E7A079]) [ ] o.e.j.s.ServerConnector Started ServerConnector@ac755{HTTP/1.1}{127.0.0.1:33680}
[junit4] 2> 589847 INFO (TEST-HttpPartitionTest.test-seed#[241D37BED7E7A079]) [ ] o.e.j.s.Server Started @591758ms
[junit4] 2> 589847 INFO (TEST-HttpPartitionTest.test-seed#[241D37BED7E7A079]) [ ] o.a.s.c.s.e.JettySolrRunner Jetty properties: {solr.data.dir=/home/jenkins/workspace/Lucene-Solr-5.x-Linux/solr/build/solr-core/test/J1/temp/solr.cloud.HttpPartitionTest_241D37BED7E7A079-001/tempDir-001/jetty1, solrconfig=solrconfig.xml, hostContext=/dq_ddw, hostPort=44486, coreRootDirectory=/home/jenkins/workspace/Lucene-Solr-5.x-Linux/solr/build/solr-core/test/J1/temp/solr.cloud.HttpPartitionTest_241D37BED7E7A079-001/shard-1-001/cores}
[junit4] 2> 589847 INFO (TEST-HttpPartitionTest.test-seed#[241D37BED7E7A079]) [ ] o.a.s.s.SolrDispatchFilter SolrDispatchFilter.init(): sun.misc.Launcher$AppClassLoader@e2f2a
[junit4] 2> 589847 INFO (TEST-HttpPartitionTest.test-seed#[241D37BED7E7A079]) [ ] o.a.s.c.SolrResourceLoader new SolrResourceLoader for directory: '/home/jenkins/workspace/Lucene-Solr-5.x-Linux/solr/build/solr-core/test/J1/temp/solr.cloud.HttpPartitionTest_241D37BED7E7A079-001/shard-1-001/'
[junit4] 2> 589855 INFO (TEST-HttpPartitionTest.test-seed#[241D37BED7E7A079]) [ ] o.a.s.c.c.SolrZkClient Using default ZkCredentialsProvider
[junit4] 2> 589856 INFO (TEST-HttpPartitionTest.test-seed#[241D37BED7E7A079]) [ ] o.a.s.c.c.ConnectionManager Waiting for client to connect to ZooKeeper
[junit4] 2> 589856 INFO (zkCallback-766-thread-1) [ ] o.a.s.c.c.ConnectionManager Watcher org.apache.solr.common.cloud.ConnectionManager@15eb2ba name:ZooKeeperConnection Watcher:127.0.0.1:37010/solr got event WatchedEvent state:SyncConnected type:None path:null path:null type:None
[junit4] 2> 589857 INFO (TEST-HttpPartitionTest.test-seed#[241D37BED7E7A079]) [ ] o.a.s.c.c.ConnectionManager Client is connected to ZooKeeper
[junit4] 2> 589857 INFO (TEST-HttpPartitionTest.test-seed#[241D37BED7E7A079]) [ ] o.a.s.c.c.SolrZkClient Using default ZkACLProvider
[junit4] 2> 589858 INFO (TEST-HttpPartitionTest.test-seed#[241D37BED7E7A079]) [ ] o.a.s.s.SolrDispatchFilter Loading solr.xml from SolrHome (not found in ZooKeeper)
[junit4] 2> 589858 INFO (TEST-HttpPartitionTest.test-seed#[241D37BED7E7A079]) [ ] o.a.s.c.SolrXmlConfig Loading container configuration from /home/jenkins/workspace/Lucene-Solr-5.x-Linux/solr/build/solr-core/test/J1/temp/solr.cloud.HttpPartitionTest_241D37BED7E7A079-001/shard-1-001/solr.xml
[junit4] 2> 589860 INFO (TEST-HttpPartitionTest.test-seed#[241D37BED7E7A079]) [ ] o.a.s.c.CoresLocator Config-defined core root directory: /home/jenkins/workspace/Lucene-Solr-5.x-Linux/solr/build/solr-core/test/J1/temp/solr.cloud.HttpPartitionTest_241D37BED7E7A079-001/shard-1-001/cores
[junit4] 2> 589860 INFO (TEST-HttpPartitionTest.test-seed#[241D37BED7E7A079]) [ ] o.a.s.c.CoreContainer New CoreContainer 3414703
[junit4] 2> 589860 INFO (TEST-HttpPartitionTest.test-seed#[241D37BED7E7A079]) [ ] o.a.s.c.CoreContainer Loading cores into CoreContainer [instanceDir=/home/jenkins/workspace/Lucene-Solr-5.x-Linux/solr/build/solr-core/test/J1/temp/solr.cloud.HttpPartitionTest_241D37BED7E7A079-001/shard-1-001/]
[junit4] 2> 589861 INFO (TEST-HttpPartitionTest.test-seed#[241D37BED7E7A079]) [ ] o.a.s.c.CoreContainer loading shared library: /home/jenkins/workspace/Lucene-Solr-5.x-Linux/solr/build/solr-core/test/J1/temp/solr.cloud.HttpPartitionTest_241D37BED7E7A079-001/shard-1-001/lib
[junit4] 2> 589861 WARN (TEST-HttpPartitionTest.test-seed#[241D37BED7E7A079]) [ ] o.a.s.c.SolrResourceLoader Can't find (or read) directory to add to classloader: lib (resolved as: /home/jenkins/workspace/Lucene-Solr-5.x-Linux/solr/build/solr-core/test/J1/temp/solr.cloud.HttpPartitionTest_241D37BED7E7A079-001/shard-1-001/lib).
[junit4] 2> 589865 INFO (TEST-HttpPartitionTest.test-seed#[241D37BED7E7A079]) [ ] o.a.s.h.c.HttpShardHandlerFactory created with socketTimeout : 90000,urlScheme : ,connTimeout : 15000,maxConnectionsPerHost : 20,maxConnections : 10000,corePoolSize : 0,maximumPoolSize : 2147483647,maxThreadIdleTime : 5,sizeOfQueue : -1,fairnessPolicy : false,useRetries : false,
[junit4] 2> 589866 INFO (TEST-HttpPartitionTest.test-seed#[241D37BED7E7A079]) [ ] o.a.s.u.UpdateShardHandler Creating UpdateShardHandler HTTP client with params: socketTimeout=340000&connTimeout=45000&retry=true
[junit4] 2> 589866 INFO (TEST-HttpPartitionTest.test-seed#[241D37BED7E7A079]) [ ] o.a.s.l.LogWatcher SLF4J impl is org.slf4j.impl.Log4jLoggerFactory
[junit4] 2> 589866 INFO (TEST-HttpPartitionTest.test-seed#[241D37BED7E7A079]) [ ] o.a.s.l.LogWatcher Registering Log Listener [Log4j (org.slf4j.impl.Log4jLoggerFactory)]
[junit4] 2> 589866 INFO (TEST-HttpPartitionTest.test-seed#[241D37BED7E7A079]) [ ] o.a.s.c.ZkContainer Zookeeper client=127.0.0.1:37010/solr
[junit4] 2> 589866 INFO (TEST-HttpPartitionTest.test-seed#[241D37BED7E7A079]) [ ] o.a.s.c.ZkController zkHost includes chroot
[junit4] 2> 589866 INFO (TEST-HttpPartitionTest.test-seed#[241D37BED7E7A079]) [ ] o.a.s.c.c.SolrZkClient Using default ZkCredentialsProvider
[junit4] 2> 589867 INFO (TEST-HttpPartitionTest.test-seed#[241D37BED7E7A079]) [ ] o.a.s.c.c.ConnectionManager Waiting for client to connect to ZooKeeper
[junit4] 2> 589867 INFO (zkCallback-768-thread-1) [ ] o.a.s.c.c.ConnectionManager Watcher org.apache.solr.common.cloud.ConnectionManager@1c28086 name:ZooKeeperConnection Watcher:127.0.0.1:37010 got event WatchedEvent state:SyncConnected type:None path:null path:null type:None
[junit4] 2> 589867 INFO (TEST-HttpPartitionTest.test-seed#[241D37BED7E7A079]) [ ] o.a.s.c.c.ConnectionManager Client is connected to ZooKeeper
[junit4] 2> 589868 INFO (TEST-HttpPartitionTest.test-seed#[241D37BED7E7A079]) [ ] o.a.s.c.c.SolrZkClient Using default ZkACLProvider
[junit4] 2> 589868 INFO (TEST-HttpPartitionTest.test-seed#[241D37BED7E7A079]) [n:127.0.0.1:44486_dq_ddw ] o.a.s.c.c.ConnectionManager Waiting for client to connect to ZooKeeper
[junit4] 2> 589869 INFO (zkCallback-769-thread-1-processing-n:127.0.0.1:44486_dq_ddw) [n:127.0.0.1:44486_dq_ddw ] o.a.s.c.c.ConnectionManager Watcher org.apache.solr.common.cloud.ConnectionManager@772cd name:ZooKeeperConnection Watcher:127.0.0.1:37010/solr got event WatchedEvent state:SyncConnected type:None path:null path:null type:None
[junit4] 2> 589869 INFO (TEST-HttpPartitionTest.test-seed#[241D37BED7E7A079]) [n:127.0.0.1:44486_dq_ddw ] o.a.s.c.c.ConnectionManager Client is connected to ZooKeeper
[junit4] 2> 589871 INFO (TEST-HttpPartitionTest.test-seed#[241D37BED7E7A079]) [n:127.0.0.1:44486_dq_ddw ] o.a.s.c.c.ZkStateReader Updating cluster state from ZooKeeper...
[junit4] 2> 590872 INFO (TEST-HttpPartitionTest.test-seed#[241D37BED7E7A079]) [n:127.0.0.1:44486_dq_ddw ] o.a.s.c.ZkController Register node as live in ZooKeeper:/live_nodes/127.0.0.1:44486_dq_ddw
[junit4] 2> 590873 INFO (TEST-HttpPartitionTest.test-seed#[241D37BED7E7A079]) [n:127.0.0.1:44486_dq_ddw ] o.a.s.c.c.SolrZkClient makePath: /live_nodes/127.0.0.1:44486_dq_ddw
[junit4] 2> 590873 INFO (zkCallback-769-thread-1-processing-n:127.0.0.1:44486_dq_ddw) [n:127.0.0.1:44486_dq_ddw ] o.a.s.c.c.ZkStateReader A live node change: WatchedEvent state:SyncConnected type:NodeChildrenChanged path:/live_nodes, has occurred - updating... (live nodes size: 1)
[junit4] 2> 590873 INFO (zkCallback-763-thread-1-processing-n:127.0.0.1:52423_dq_ddw) [n:127.0.0.1:52423_dq_ddw ] o.a.s.c.c.ZkStateReader A live node change: WatchedEvent state:SyncConnected type:NodeChildrenChanged path:/live_nodes, has occurred - updating... (live nodes size: 1)
[junit4] 2> 590873 INFO (zkCallback-765-thread-1) [ ] o.a.s.c.c.ZkStateReader A live node change: WatchedEvent state:SyncConnected type:NodeChildrenChanged path:/live_nodes, has occurred - updating... (live nodes size: 1)
[junit4] 2> 590874 INFO (TEST-HttpPartitionTest.test-seed#[241D37BED7E7A079]) [n:127.0.0.1:44486_dq_ddw ] o.a.s.c.Overseer Overseer (id=null) closing
[junit4] 2> 590874 INFO (TEST-HttpPartitionTest.test-seed#[241D37BED7E7A079]) [n:127.0.0.1:44486_dq_ddw ] o.a.s.c.LeaderElector Joined leadership election with path: /overseer_elect/election/94428015044722696-127.0.0.1:44486_dq_ddw-n_0000000001
[junit4] 2> 590875 INFO (TEST-HttpPartitionTest.test-seed#[241D37BED7E7A079]) [n:127.0.0.1:44486_dq_ddw ] o.a.s.c.LeaderElector Watching path /overseer_elect/election/94428015044722692-127.0.0.1:52423_dq_ddw-n_0000000000 to know if I could be the leader
[junit4] 2> 590897 INFO (TEST-HttpPartitionTest.test-seed#[241D37BED7E7A079]) [n:127.0.0.1:44486_dq_ddw ] o.a.s.c.CoreContainer Security conf doesn't exist. Skipping setup for authorization module.
[junit4] 2> 590898 INFO (TEST-HttpPartitionTest.test-seed#[241D37BED7E7A079]) [n:127.0.0.1:44486_dq_ddw ] o.a.s.c.CoreContainer No authentication plugin used.
[junit4] 2> 590898 INFO (TEST-HttpPartitionTest.test-seed#[241D37BED7E7A079]) [n:127.0.0.1:44486_dq_ddw ] o.a.s.c.CoresLocator Looking for core definitions underneath /home/jenkins/workspace/Lucene-Solr-5.x-Linux/solr/build/solr-core/test/J1/temp/solr.cloud.HttpPartitionTest_241D37BED7E7A079-001/shard-1-001/cores
[junit4] 2> 590898 INFO (TEST-HttpPartitionTest.test-seed#[241D37BED7E7A079]) [n:127.0.0.1:44486_dq_ddw ] o.a.s.c.SolrCore Created CoreDescriptor: {name=collection1, config=solrconfig.xml, transient=false, schema=schema.xml, loadOnStartup=true, configSetProperties=configsetprops.json, instanceDir=/home/jenkins/workspace/Lucene-Solr-5.x-Linux/solr/build/solr-core/test/J1/temp/solr.cloud.HttpPartitionTest_241D37BED7E7A079-001/shard-1-001/cores/collection1, collection=collection1, absoluteInstDir=/home/jenkins/workspace/Lucene-Solr-5.x-Linux/solr/build/solr-core/test/J1/temp/solr.cloud.HttpPartitionTest_241D37BED7E7A079-001/shard-1-001/cores/collection1/, coreNodeName=, dataDir=data/, shard=}
[junit4] 2> 590898 INFO (TEST-HttpPartitionTest.test-seed#[241D37BED7E7A079]) [n:127.0.0.1:44486_dq_ddw ] o.a.s.c.CoresLocator Found core collection1 in /home/jenkins/workspace/Lucene-Solr-5.x-Linux/solr/build/solr-core/test/J1/temp/solr.cloud.HttpPartitionTest_241D37BED7E7A079-001/shard-1-001/cores/collection1/
[junit4] 2> 590899 INFO (TEST-HttpPartitionTest.test-seed#[241D37BED7E7A079]) [n:127.0.0.1:44486_dq_ddw ] o.a.s.c.CoresLocator Found 1 core definitions
[junit4] 2> 590899 INFO (TEST-HttpPartitionTest.test-seed#[241D37BED7E7A079]) [n:127.0.0.1:44486_dq_ddw ] o.a.s.s.SolrDispatchFilter user.dir=/home/jenkins/workspace/Lucene-Solr-5.x-Linux/solr/build/solr-core/test/J1
[junit4] 2> 590899 INFO (coreLoadExecutor-2371-thread-1-processing-n:127.0.0.1:44486_dq_ddw) [n:127.0.0.1:44486_dq_ddw c:collection1 x:collection1] o.a.s.c.ZkController publishing state=down
[junit4] 2> 590899 INFO (coreLoadExecutor-2371-thread-1-processing-n:127.0.0.1:44486_dq_ddw) [n:127.0.0.1:44486_dq_ddw c:collection1 x:collection1] o.a.s.c.ZkController numShards not found on descriptor - reading it from system property
[junit4] 2> 590899 INFO (TEST-HttpPartitionTest.test-seed#[241D37BED7E7A079]) [n:127.0.0.1:44486_dq_ddw ] o.a.s.s.SolrDispatchFilter SolrDispatchFilter.init() done
[junit4] 2> 590906 INFO (coreLoadExecutor-2371-thread-1-processing-n:127.0.0.1:44486_dq_ddw) [n:127.0.0.1:44486_dq_ddw c:collection1 x:collection1] o.a.s.c.ZkController look for our core node name
[junit4] 2> 590906 INFO (OverseerStateUpdate-94428015044722692-127.0.0.1:52423_dq_ddw-n_0000000000) [n:127.0.0.1:52423_dq_ddw ] o.a.s.c.Overseer processMessage: queueSize: 1, message = {
[junit4] 2> "core":"collection1",
[junit4] 2> "roles":null,
[junit4] 2> "base_url":"http://127.0.0.1:44486/dq_ddw",
[junit4] 2> "node_name":"127.0.0.1:44486_dq_ddw",
[junit4] 2> "numShards":"2",
[junit4] 2> "state":"down",
[junit4] 2> "shard":null,
[junit4] 2> "collection":"collection1",
[junit4] 2> "operation":"state"} current state version: 3
[junit4] 2> 590906 INFO (OverseerStateUpdate-94428015044722692-127.0.0.1:52423_dq_ddw-n_0000000000) [n:127.0.0.1:52423_dq_ddw ] o.a.s.c.o.ReplicaMutator Update state numShards=2 message={
[junit4] 2> "core":"collection1",
[junit4] 2> "roles":null,
[junit4] 2> "base_url":"http://127.0.0.1:44486/dq_ddw",
[junit4] 2> "node_name":"127.0.0.1:44486_dq_ddw",
[junit4] 2> "numShards":"2",
[junit4] 2> "state":"down",
[junit4] 2> "shard":null,
[junit4] 2> "collection":"collection1",
[junit4] 2> "operation":"state"}
[junit4] 2> 590906 INFO (OverseerStateUpdate-94428015044722692-127.0.0.1:52423_dq_ddw-n_0000000000) [n:127.0.0.1:52423_dq_ddw ] o.a.s.c.o.ClusterStateMutator building a new cName: collection1
[junit4] 2> 590907 INFO (OverseerStateUpdate-94428015044722692-127.0.0.1:52423_dq_ddw-n_0000000000) [n:127.0.0.1:52423_dq_ddw ] o.a.s.c.o.ReplicaMutator Assigning new node to shard shard=shard2
[junit4] 2> 591008 INFO (zkCallback-763-thread-1-processing-n:127.0.0.1:52423_dq_ddw) [n:127.0.0.1:52423_dq_ddw ] o.a.s.c.c.ZkStateReader A cluster state change: WatchedEvent state:SyncConnected type:NodeDataChanged path:/clusterstate.json, has occurred - updating... (live nodes size: 2)
[junit4] 2> 591008 INFO (zkCallback-769-thread-1-processing-n:127.0.0.1:44486_dq_ddw) [n:127.0.0.1:44486_dq_ddw ] o.a.s.c.c.ZkStateReader A cluster state change: WatchedEvent state:SyncConnected type:NodeDataChanged path:/clusterstate.json, has occurred - updating... (live nodes size: 2)
[junit4] 2> 591008 INFO (zkCallback-765-thread-1) [ ] o.a.s.c.c.ZkStateReader A cluster state change: WatchedEvent state:SyncConnected type:NodeDataChanged path:/clusterstate.json, has occurred - updating... (live nodes size: 2)
[junit4] 2> 591906 INFO (coreLoadExecutor-2371-thread-1-processing-n:127.0.0.1:44486_dq_ddw) [n:127.0.0.1:44486_dq_ddw c:collection1 x:collection1] o.a.s.c.ZkController waiting to find shard id in clusterstate for collection1
[junit4] 2> 591907 INFO (coreLoadExecutor-2371-thread-1-processing-n:127.0.0.1:44486_dq_ddw) [n:127.0.0.1:44486_dq_ddw c:collection1 x:collection1] o.a.s.c.ZkController Check for collection zkNode:collection1
[junit4] 2> 591907 INFO (coreLoadExecutor-2371-thread-1-processing-n:127.0.0.1:44486_dq_ddw) [n:127.0.0.1:44486_dq_ddw c:collection1 x:collection1] o.a.s.c.ZkController Collection zkNode exists
[junit4] 2> 591907 INFO (coreLoadExecutor-2371-thread-1-processing-n:127.0.0.1:44486_dq_ddw) [n:127.0.0.1:44486_dq_ddw c:collection1 x:collection1] o.a.s.c.c.ZkStateReader Load collection config from:/collections/collection1
[junit4] 2> 591907 INFO (coreLoadExecutor-2371-thread-1-processing-n:127.0.0.1:44486_dq_ddw) [n:127.0.0.1:44486_dq_ddw c:collection1 x:collection1] o.a.s.c.c.ZkStateReader path=/collections/collection1 configName=conf1 specified config exists in ZooKeeper
[junit4] 2> 591907 INFO (coreLoadExecutor-2371-thread-1-processing-n:127.0.0.1:44486_dq_ddw) [n:127.0.0.1:44486_dq_ddw c:collection1 x:collection1] o.a.s.c.SolrResourceLoader new SolrResourceLoader for directory: '/home/jenkins/workspace/Lucene-Solr-5.x-Linux/solr/build/solr-core/test/J1/temp/solr.cloud.HttpPartitionTest_241D37BED7E7A079-001/shard-1-001/cores/collection1/'
[junit4] 2> 591914 INFO (coreLoadExecutor-2371-thread-1-processing-n:127.0.0.1:44486_dq_ddw) [n:127.0.0.1:44486_dq_ddw c:collection1 x:collection1] o.a.s.c.Config loaded config solrconfig.xml with version 0
[junit4] 2> 591917 INFO (coreLoadExecutor-2371-thread-1-processing-n:127.0.0.1:44486_dq_ddw) [n:127.0.0.1:44486_dq_ddw c:collection1 x:collection1] o.a.s.c.SolrConfig current version of requestparams : -1
[junit4] 2> 591919 INFO (coreLoadExecutor-2371-thread-1-processing-n:127.0.0.1:44486_dq_ddw) [n:127.0.0.1:44486_dq_ddw c:collection1 x:collection1] o.a.s.c.SolrConfig Using Lucene MatchVersion: 5.4.0
[junit4] 2> 591926 INFO (coreLoadExecutor-2371-thread-1-processing-n:127.0.0.1:44486_dq_ddw) [n:127.0.0.1:44486_dq_ddw c:collection1 x:collection1] o.a.s.c.Config Loaded SolrConfig: solrconfig.xml
[junit4] 2> 591926 INFO (coreLoadExecutor-2371-thread-1-processing-n:127.0.0.1:44486_dq_ddw) [n:127.0.0.1:44486_dq_ddw c:collection1 x:collection1] o.a.s.s.IndexSchema Reading Solr Schema from /configs/conf1/schema.xml
[junit4] 2> 591929 INFO (coreLoadExecutor-2371-thread-1-processing-n:127.0.0.1:44486_dq_ddw) [n:127.0.0.1:44486_dq_ddw c:collection1 x:collection1] o.a.s.s.IndexSchema [collection1] Schema name=test
[junit4] 2> 591993 INFO (coreLoadExecutor-2371-thread-1-processing-n:127.0.0.1:44486_dq_ddw) [n:127.0.0.1:44486_dq_ddw c:collection1 x:collection1] o.a.s.s.OpenExchangeRatesOrgProvider Initialized with rates=open-exchange-rates.json, refreshInterval=1440.
[junit4] 2> 591996 INFO (coreLoadExecutor-2371-thread-1-processing-n:127.0.0.1:44486_dq_ddw) [n:127.0.0.1:44486_dq_ddw c:collection1 x:collection1] o.a.s.s.IndexSchema default search field in schema is text
[junit4] 2> 591997 INFO (coreLoadExecutor-2371-thread-1-processing-n:127.0.0.1:44486_dq_ddw) [n:127.0.0.1:44486_dq_ddw c:collection1 x:collection1] o.a.s.s.IndexSchema unique key field: id
[junit4] 2> 592001 INFO (coreLoadExecutor-2371-thread-1-processing-n:127.0.0.1:44486_dq_ddw) [n:127.0.0.1:44486_dq_ddw c:collection1 x:collection1] o.a.s.s.FileExchangeRateProvider Reloading exchange rates from file currency.xml
[junit4] 2> 592002 INFO (coreLoadExecutor-2371-thread-1-processing-n:127.0.0.1:44486_dq_ddw) [n:127.0.0.1:44486_dq_ddw c:collection1 x:collection1] o.a.s.s.FileExchangeRateProvider Reloading exchange rates from file currency.xml
[junit4] 2> 592003 INFO (coreLoadExecutor-2371-thread-1-processing-n:127.0.0.1:44486_dq_ddw) [n:127.0.0.1:44486_dq_ddw c:collection1 x:collection1] o.a.s.s.OpenExchangeRatesOrgProvider Reloading exchange rates from open-exchange-rates.json
[junit4] 2> 592003 WARN (coreLoadExecutor-2371-thread-1-processing-n:127.0.0.1:44486_dq_ddw) [n:127.0.0.1:44486_dq_ddw c:collection1 x:collection1] o.a.s.s.OpenExchangeRatesOrgProvider Unknown key IMPORTANT NOTE
[junit4] 2> 592003 WARN (coreLoadExecutor-2371-thread-1-processing-n:127.0.0.1:44486_dq_ddw) [n:127.0.0.1:44486_dq_ddw c:collection1 x:collection1] o.a.s.s.OpenExchangeRatesOrgProvider Expected key, got STRING
[junit4] 2> 592003 INFO (coreLoadExecutor-2371-thread-1-processing-n:127.0.0.1:44486_dq_ddw) [n:127.0.0.1:44486_dq_ddw c:collection1 x:collection1] o.a.s.s.OpenExchangeRatesOrgProvider Reloading exchange rates from open-exchange-rates.json
[junit4] 2> 592004 WARN (coreLoadExecutor-2371-thread-1-processing-n:127.0.0.1:44486_dq_ddw) [n:127.0.0.1:44486_dq_ddw c:collection1 x:collection1] o.a.s.s.OpenExchangeRatesOrgProvider Unknown key IMPORTANT NOTE
[junit4] 2> 592004 WARN (coreLoadExecutor-2371-thread-1-processing-n:127.0.0.1:44486_dq_ddw) [n:127.0.0.1:44486_dq_ddw c:collection1 x:collection1] o.a.s.s.OpenExchangeRatesOrgProvider Expected key, got STRING
[junit4] 2> 592004 INFO (coreLoadExecutor-2371-thread-1-processing-n:127.0.0.1:44486_dq_ddw) [n:127.0.0.1:44486_dq_ddw c:collection1 x:collection1] o.a.s.c.ConfigSetProperties Did not find ConfigSet properties, assuming default properties: Can't find resource 'configsetprops.json' in classpath or '/configs/conf1', cwd=/home/jenkins/workspace/Lucene-Solr-5.x-Linux/solr/build/solr-core/test/J1
[junit4] 2> 592004 INFO (coreLoadExecutor-2371-thread-1-processing-n:127.0.0.1:44486_dq_ddw) [n:127.0.0.1:44486_dq_ddw c:collection1 x:collection1] o.a.s.c.CoreContainer Creating SolrCore 'collection1' using configuration from collection collection1
[junit4] 2> 592005 INFO (coreLoadExecutor-2371-thread-1-processing-n:127.0.0.1:44486_dq_ddw) [n:127.0.0.1:44486_dq_ddw c:collection1 s:shard2 r:core_node1 x:collection1] o.a.s.c.SolrCore org.apache.solr.core.MockDirectoryFactory
[junit4] 2> 592005 INFO (coreLoadExecutor-2371-thread-1-processing-n:127.0.0.1:44486_dq_ddw) [n:127.0.0.1:44486_dq_ddw c:collection1 s:shard2 r:core_node1 x:collection1] o.a.s.c.SolrCore [[collection1] ] Opening new SolrCore at [/home/jenkins/workspace/Lucene-Solr-5.x-Linux/solr/build/solr-core/test/J1/temp/solr.cloud.HttpPartitionTest_241D37BED7E7A079-001/shard-1-001/cores/collection1/], dataDir=[null]
[junit4] 2> 592005 INFO (coreLoadExecutor-2371-thread-1-processing-n:127.0.0.1:44486_dq_ddw) [n:127.0.0.1:44486_dq_ddw c:collection1 s:shard2 r:core_node1 x:collection1] o.a.s.c.JmxMonitoredMap JMX monitoring is enabled. Adding Solr mbeans to JMX Server: com.sun.jmx.mbeanserver.JmxMBeanServer@1794068
[junit4] 2> 592005 INFO (coreLoadExecutor-2371-thread-1-processing-n:127.0.0.1:44486_dq_ddw) [n:127.0.0.1:44486_dq_ddw c:collection1 s:shard2 r:core_node1 x:collection1] o.a.s.c.CachingDirectoryFactory return new directory for /home/jenkins/workspace/Lucene-Solr-5.x-Linux/solr/build/solr-core/test/J1/temp/solr.cloud.HttpPartitionTest_241D37BED7E7A079-001/shard-1-001/cores/collection1/data
[junit4] 2> 592005 INFO (coreLoadExecutor-2371-thread-1-processing-n:127.0.0.1:44486_dq_ddw) [n:127.0.0.1:44486_dq_ddw c:collection1 s:shard2 r:core_node1 x:collection1] o.a.s.c.SolrCore New index directory detected: old=null new=/home/jenkins/workspace/Lucene-Solr-5.x-Linux/solr/build/solr-core/test/J1/temp/solr.cloud.HttpPartitionTest_241D37BED7E7A079-001/shard-1-001/cores/collection1/data/index/
[junit4] 2> 592005 WARN (coreLoadExecutor-2371-thread-1-processing-n:127.0.0.1:44486_dq_ddw) [n:127.0.0.1:44486_dq_ddw c:collection1 s:shard2 r:core_node1 x:collection1] o.a.s.c.SolrCore [collection1] Solr index directory '/home/jenkins/workspace/Lucene-Solr-5.x-Linux/solr/build/solr-core/test/J1/temp/solr.cloud.HttpPartitionTest_241D37BED7E7A079-001/shard-1-001/cores/collection1/data/index' doesn't exist. Creating new index...
[junit4] 2> 592006 INFO (coreLoadExecutor-2371-thread-1-processing-n:127.0.0.1:44486_dq_ddw) [n:127.0.0.1:44486_dq_ddw c:collection1 s:shard2 r:core_node1 x:collection1] o.a.s.c.CachingDirectoryFactory return new directory for /home/jenkins/workspace/Lucene-Solr-5.x-Linux/solr/build/solr-core/test/J1/temp/solr.cloud.HttpPartitionTest_241D37BED7E7A079-001/shard-1-001/cores/collection1/data/index
[junit4] 2> 592006 INFO (coreLoadExecutor-2371-thread-1-processing-n:127.0.0.1:44486_dq_ddw) [n:127.0.0.1:44486_dq_ddw c:collection1 s:shard2 r:core_node1 x:collection1] o.a.s.u.RandomMergePolicy RandomMergePolicy wrapping class org.apache.lucene.index.LogByteSizeMergePolicy: [LogByteSizeMergePolicy: minMergeSize=1677721, mergeFactor=27, maxMergeSize=2147483648, maxMergeSizeForForcedMerge=9223372036854775807, calibrateSizeByDeletes=true, maxMergeDocs=2147483647, maxCFSSegmentSizeMB=8.796093022207999E12, noCFSRatio=0.5276940457343379]
[junit4] 2> 592006 INFO (coreLoadExecutor-2371-thread-1-processing-n:127.0.0.1:44486_dq_ddw) [n:127.0.0.1:44486_dq_ddw c:collection1 s:shard2 r:core_node1 x:collection1] o.a.s.c.SolrCore SolrDeletionPolicy.onCommit: commits: num=1
[junit4] 2> commit{dir=MockDirectoryWrapper(RAMDirectory@8ab29 lockFactory=org.apache.lucene.store.SingleInstanceLockFactory@df3fe2),segFN=segments_1,generation=1}
[junit4] 2> 592006 INFO (coreLoadExecutor-2371-thread-1-processing-n:127.0.0.1:44486_dq_ddw) [n:127.0.0.1:44486_dq_ddw c:collection1 s:shard2 r:core_node1 x:collection1] o.a.s.c.SolrCore newest commit generation = 1
[junit4] 2> 592006 INFO (OldIndexDirectoryCleanupThreadForCore-collection1) [n:127.0.0.1:44486_dq_ddw c:collection1 s:shard2 r:core_node1 x:collection1] o.a.s.c.SolrCore Looking for old index directories to cleanup for core collection1 in /home/jenkins/workspace/Lucene-Solr-5.x-Linux/solr/build/solr-core/test/J1/temp/solr.cloud.HttpPartitionTest_241D37BED7E7A079-001/shard-1-001/cores/collection1/data/
[junit4] 2> 592007 WARN (OldIndexDirectoryCleanupThreadForCore-collection1) [n:127.0.0.1:44486_dq_ddw c:collection1 s:shard2 r:core_node1 x:collection1] o.a.s.c.DirectoryFactory /home/jenkins/workspace/Lucene-Solr-5.x-Linux/solr/build/solr-core/test/J1/temp/solr.cloud.HttpPartitionTest_241D37BED7E7A079-001/shard-1-001/cores/collection1/data/ does not point to a valid data directory; skipping clean-up of old index directories.
[junit4] 2> 592008 INFO (coreLoadExecutor-2371-thread-1-processing-n:127.0.0.1:44486_dq_ddw) [n:127.0.0.1:44486_dq_ddw c:collection1 s:shard2 r:core_node1 x:collection1] o.a.s.u.p.UpdateRequestProcessorChain creating updateRequestProcessorChain "nodistrib"
[junit4] 2> 592008 INFO (coreLoadExecutor-2371-thread-1-processing-n:127.0.0.1:44486_dq_ddw) [n:127.0.0.1:44486_dq_ddw c:collection1 s:shard2 r:core_node1 x:collection1] o.a.s.u.p.UpdateRequestProcessorChain creating updateRequestProcessorChain "dedupe"
[junit4] 2> 592008 INFO (coreLoadExecutor-2371-thread-1-processing-n:127.0.0.1:44486_dq_ddw) [n:127.0.0.1:44486_dq_ddw c:collection1 s:shard2 r:core_node1 x:collection1] o.a.s.u.p.UpdateRequestProcessorChain inserting DistributedUpdateProcessorFactory into updateRequestProcessorChain "dedupe"
[junit4] 2> 592008 INFO (coreLoadExecutor-2371-thread-1-processing-n:127.0.0.1:44486_dq_ddw) [n:127.0.0.1:44486_dq_ddw c:collection1 s:shard2 r:core_node1 x:collection1] o.a.s.u.p.UpdateRequestProcessorChain creating updateRequestProcessorChain "stored_sig"
[junit4] 2> 592008 INFO (coreLoadExecutor-2371-thread-1-processing-n:127.0.0.1:44486_dq_ddw) [n:127.0.0.1:44486_dq_ddw c:collection1 s:shard2 r:core_node1 x:collection1] o.a.s.u.p.UpdateRequestProcessorChain inserting DistributedUpdateProcessorFactory into updateRequestProcessorChain "stored_sig"
[junit4] 2> 592008 INFO (coreLoadExecutor-2371-thread-1-processing-n:127.0.0.1:44486_dq_ddw) [n:127.0.0.1:44486_dq_ddw c:collection1 s:shard2 r:core_node1 x:collection1] o.a.s.u.p.UpdateRequestProcessorChain creating updateRequestProcessorChain "distrib-dup-test-chain-explicit"
[junit4] 2> 592009 INFO (coreLoadExecutor-2371-thread-1-processing-n:127.0.0.1:44486_dq_ddw) [n:127.0.0.1:44486_dq_ddw c:collection1 s:shard2 r:core_node1 x:collection1] o.a.s.u.p.UpdateRequestProcessorChain creating updateRequestProcessorChain "distrib-dup-test-chain-implicit"
[junit4] 2> 592009 INFO (coreLoadExecutor-2371-thread-1-processing-n:127.0.0.1:44486_dq_ddw) [n:127.0.0.1:44486_dq_ddw c:collection1 s:shard2 r:core_node1 x:collection1] o.a.s.u.p.UpdateRequestProcessorChain inserting DistributedUpdateProcessorFactory into updateRequestProcessorChain "distrib-dup-test-chain-implicit"
[junit4] 2> 592009 INFO (coreLoadExecutor-2371-thread-1-processing-n:127.0.0.1:44486_dq_ddw) [n:127.0.0.1:44486_dq_ddw c:collection1 s:shard2 r:core_node1 x:collection1] o.a.s.c.SolrCore no updateRequestProcessorChain defined as default, creating implicit default
[junit4] 2> 592010 INFO (coreLoadExecutor-2371-thread-1-processing-n:127.0.0.1:44486_dq_ddw) [n:127.0.0.1:44486_dq_ddw c:collection1 s:shard2 r:core_node1 x:collection1] o.a.s.h.l.XMLLoader xsltCacheLifetimeSeconds=60
[junit4] 2> 592011 INFO (coreLoadExecutor-2371-thread-1-processing-n:127.0.0.1:44486_dq_ddw) [n:127.0.0.1:44486_dq_ddw c:collection1 s:shard2 r:core_node1 x:collection1] o.a.s.h.l.XMLLoader xsltCacheLifetimeSeconds=60
[junit4] 2> 592011 INFO (coreLoadExecutor-2371-thread-1-processing-n:127.0.0.1:44486_dq_ddw) [n:127.0.0.1:44486_dq_ddw c:collection1 s:shard2 r:core_node1 x:collection1] o.a.s.h.l.XMLLoader xsltCacheLifetimeSeconds=60
[junit4] 2> 592012 INFO (coreLoadExecutor-2371-thread-1-processing-n:127.0.0.1:44486_dq_ddw) [n:127.0.0.1:44486_dq_ddw c:collection1 s:shard2 r:core_node1 x:collection1] o.a.s.h.l.XMLLoader xsltCacheLifetimeSeconds=60
[junit4] 2> 592014 INFO (coreLoadExecutor-2371-thread-1-processing-n:127.0.0.1:44486_dq_ddw) [n:127.0.0.1:44486_dq_ddw c:collection1 s:shard2 r:core_node1 x:collection1] o.a.s.c.RequestHandlers Registered paths: /admin/mbeans,standard,/update/csv,/update/json/docs,/admin/luke,/admin/segments,/get,/admin/system,/replication,/admin/properties,/config,/schema,/admin/plugins,/admin/logging,/update/json,/admin/threads,/admin/ping,/update,/admin/file
[junit4] 2> 592014 INFO (coreLoadExecutor-2371-thread-1-processing-n:127.0.0.1:44486_dq_ddw) [n:127.0.0.1:44486_dq_ddw c:collection1 s:shard2 r:core_node1 x:collection1] o.a.s.c.SolrCore Using default statsCache cache: org.apache.solr.search.stats.LocalStatsCache
[junit4] 2> 592014 INFO (coreLoadExecutor-2371-thread-1-processing-n:127.0.0.1:44486_dq_ddw) [n:127.0.0.1:44486_dq_ddw c:collection1 s:shard2 r:core_node1 x:collection1] o.a.s.u.UpdateHandler Using UpdateLog implementation: org.apache.solr.update.UpdateLog
[junit4] 2> 592014 INFO (coreLoadExecutor-2371-thread-1-processing-n:127.0.0.1:44486_dq_ddw) [n:127.0.0.1:44486_dq_ddw c:collection1 s:shard2 r:core_node1 x:collection1] o
[...truncated too long message...]
[junit4] 2> 724107 INFO (SUITE-HttpPartitionTest-seed#[241D37BED7E7A079]-worker) [n:127.0.0.1:54363_dq_ddw c:collection1 s:shard2 r:core_node3 x:collection1] o.a.s.SolrTestCaseJ4 ###deleteCore
[junit4] 2> ObjectTracker found 1 object(s) that were not released!!! [TransactionLog]
[junit4] 2> org.apache.solr.common.util.ObjectReleaseTracker$ObjectTrackerException
[junit4] 2> at org.apache.solr.common.util.ObjectReleaseTracker.track(ObjectReleaseTracker.java:34)
[junit4] 2> at org.apache.solr.update.TransactionLog.<init>(TransactionLog.java:183)
[junit4] 2> at org.apache.solr.update.TransactionLog.<init>(TransactionLog.java:141)
[junit4] 2> at org.apache.solr.update.UpdateLog.ensureLog(UpdateLog.java:864)
[junit4] 2> at org.apache.solr.update.UpdateLog.add(UpdateLog.java:425)
[junit4] 2> at org.apache.solr.update.UpdateLog.add(UpdateLog.java:411)
[junit4] 2> at org.apache.solr.update.DirectUpdateHandler2.doNormalUpdate(DirectUpdateHandler2.java:293)
[junit4] 2> at org.apache.solr.update.DirectUpdateHandler2.addDoc0(DirectUpdateHandler2.java:202)
[junit4] 2> at org.apache.solr.update.DirectUpdateHandler2.addDoc(DirectUpdateHandler2.java:164)
[junit4] 2> at org.apache.solr.update.processor.RunUpdateProcessor.processAdd(RunUpdateProcessorFactory.java:69)
[junit4] 2> at org.apache.solr.update.processor.UpdateRequestProcessor.processAdd(UpdateRequestProcessor.java:51)
[junit4] 2> at org.apache.solr.update.processor.DistributedUpdateProcessor.doLocalAdd(DistributedUpdateProcessor.java:954)
[junit4] 2> at org.apache.solr.update.processor.DistributedUpdateProcessor.versionAdd(DistributedUpdateProcessor.java:1109)
[junit4] 2> at org.apache.solr.update.processor.DistributedUpdateProcessor.processAdd(DistributedUpdateProcessor.java:705)
[junit4] 2> at org.apache.solr.update.processor.LogUpdateProcessor.processAdd(LogUpdateProcessorFactory.java:104)
[junit4] 2> at org.apache.solr.handler.loader.JavabinLoader$1.update(JavabinLoader.java:101)
[junit4] 2> at org.apache.solr.client.solrj.request.JavaBinUpdateRequestCodec$1.readOuterMostDocIterator(JavaBinUpdateRequestCodec.java:179)
[junit4] 2> at org.apache.solr.client.solrj.request.JavaBinUpdateRequestCodec$1.readIterator(JavaBinUpdateRequestCodec.java:135)
[junit4] 2> at org.apache.solr.common.util.JavaBinCodec.readVal(JavaBinCodec.java:249)
[junit4] 2> at org.apache.solr.client.solrj.request.JavaBinUpdateRequestCodec$1.readNamedList(JavaBinUpdateRequestCodec.java:121)
[junit4] 2> at org.apache.solr.common.util.JavaBinCodec.readVal(JavaBinCodec.java:214)
[junit4] 2> at org.apache.solr.common.util.JavaBinCodec.unmarshal(JavaBinCodec.java:134)
[junit4] 2> at org.apache.solr.client.solrj.request.JavaBinUpdateRequestCodec.unmarshal(JavaBinUpdateRequestCodec.java:186)
[junit4] 2> at org.apache.solr.handler.loader.JavabinLoader.parseAndLoadDocs(JavabinLoader.java:111)
[junit4] 2> at org.apache.solr.handler.loader.JavabinLoader.load(JavabinLoader.java:58)
[junit4] 2> at org.apache.solr.handler.UpdateRequestHandler$1.load(UpdateRequestHandler.java:98)
[junit4] 2> at org.apache.solr.handler.ContentStreamHandlerBase.handleRequestBody(ContentStreamHandlerBase.java:74)
[junit4] 2> at org.apache.solr.handler.RequestHandlerBase.handleRequest(RequestHandlerBase.java:151)
[junit4] 2> at org.apache.solr.core.SolrCore.execute(SolrCore.java:2079)
[junit4] 2> at org.apache.solr.servlet.HttpSolrCall.execute(HttpSolrCall.java:667)
[junit4] 2> at org.apache.solr.servlet.HttpSolrCall.call(HttpSolrCall.java:460)
[junit4] 2> at org.apache.solr.servlet.SolrDispatchFilter.doFilter(SolrDispatchFilter.java:210)
[junit4] 2> at org.apache.solr.servlet.SolrDispatchFilter.doFilter(SolrDispatchFilter.java:179)
[junit4] 2> at org.eclipse.jetty.servlet.ServletHandler$CachedChain.doFilter(ServletHandler.java:1652)
[junit4] 2> at org.apache.solr.client.solrj.embedded.JettySolrRunner$DebugFilter.doFilter(JettySolrRunner.java:106)
[junit4] 2> at org.eclipse.jetty.servlet.ServletHandler$CachedChain.doFilter(ServletHandler.java:1652)
[junit4] 2> at org.eclipse.jetty.servlets.UserAgentFilter.doFilter(UserAgentFilter.java:83)
[junit4] 2> at org.eclipse.jetty.servlets.GzipFilter.doFilter(GzipFilter.java:300)
[junit4] 2> at org.eclipse.jetty.servlet.ServletHandler$CachedChain.doFilter(ServletHandler.java:1652)
[junit4] 2> at org.eclipse.jetty.servlet.ServletHandler.doHandle(ServletHandler.java:585)
[junit4] 2> at org.eclipse.jetty.server.session.SessionHandler.doHandle(SessionHandler.java:221)
[junit4] 2> at org.eclipse.jetty.server.handler.ContextHandler.doHandle(ContextHandler.java:1127)
[junit4] 2> at org.eclipse.jetty.servlet.ServletHandler.doScope(ServletHandler.java:515)
[junit4] 2> at org.eclipse.jetty.server.session.SessionHandler.doScope(SessionHandler.java:185)
[junit4] 2> at org.eclipse.jetty.server.handler.ContextHandler.doScope(ContextHandler.java:1061)
[junit4] 2> at org.eclipse.jetty.server.handler.ScopedHandler.handle(ScopedHandler.java:141)
[junit4] 2> at org.eclipse.jetty.server.handler.HandlerWrapper.handle(HandlerWrapper.java:97)
[junit4] 2> at org.eclipse.jetty.server.Server.handle(Server.java:499)
[junit4] 2> at org.eclipse.jetty.server.HttpChannel.handle(HttpChannel.java:310)
[junit4] 2> at org.eclipse.jetty.server.HttpConnection.onFillable(HttpConnection.java:257)
[junit4] 2> at org.eclipse.jetty.io.AbstractConnection$2.run(AbstractConnection.java:540)
[junit4] 2> at org.eclipse.jetty.util.thread.QueuedThreadPool.runJob(QueuedThreadPool.java:635)
[junit4] 2> at org.eclipse.jetty.util.thread.QueuedThreadPool$3.run(QueuedThreadPool.java:555)
[junit4] 2> at java.lang.Thread.run(Thread.java:745)
[junit4] 2>
[junit4] 2> Aug 29, 2015 2:08:19 PM com.carrotsearch.randomizedtesting.ThreadLeakControl checkThreadLeaks
[junit4] 2> WARNING: Will linger awaiting termination of 1 leaked thread(s).
[junit4] 2> NOTE: test params are: codec=CheapBastard, sim=DefaultSimilarity, locale=de_LU, timezone=SystemV/YST9
[junit4] 2> NOTE: Linux 3.19.0-26-generic i386/Oracle Corporation 1.8.0_60 (32-bit)/cpus=12,threads=1,free=96649896,total=209883136
[junit4] 2> NOTE: All tests run in this JVM: [NotRequiredUniqueKeyTest, TestLFUCache, HdfsRecoverLeaseTest, CursorMarkTest, SuggesterFSTTest, TestDistributedStatsComponentCardinality, TestSolrConfigHandlerCloud, URLClassifyProcessorTest, ClusterStateUpdateTest, TestFiltering, TestDistributedGrouping, TestSerializedLuceneMatchVersion, TestConfigSets, TestStressVersions, CSVRequestHandlerTest, DocValuesTest, SoftAutoCommitTest, BigEndianAscendingWordSerializerTest, TestBlobHandler, UpdateRequestProcessorFactoryTest, DateRangeFieldTest, TestQuerySenderNoQuery, ZkCLITest, SolrTestCaseJ4Test, TestDistribIDF, TestAddFieldRealTimeGet, TestFastOutputStream, VMParamsZkACLAndCredentialsProvidersTest, TestRebalanceLeaders, TestReRankQParserPlugin, TestFieldSortValues, TestNoOpRegenerator, CollectionStateFormat2Test, DistributedIntervalFacetingTest, InfoHandlerTest, TestSurroundQueryParser, SimplePostToolTest, ZkControllerTest, TestStressUserVersions, TestConfigSetsAPIExclusivity, CircularListTest, TestComplexPhraseQParserPlugin, SpatialHeatmapFacetsTest, TestTrie, TestRestManager, MinimalSchemaTest, RollingRestartTest, NumericFieldsTest, CursorPagingTest, TestQuerySenderListener, TestHashQParserPlugin, DeleteReplicaTest, WordBreakSolrSpellCheckerTest, ShardRoutingCustomTest, HighlighterMaxOffsetTest, PKIAuthenticationIntegrationTest, TestChildDocTransformer, TestReplicaProperties, SolrPluginUtilsTest, TestSolrQueryParserDefaultOperatorResource, TestCrossCoreJoin, TestImplicitCoreProperties, BasicFunctionalityTest, SpatialFilterTest, SpellPossibilityIteratorTest, HdfsSyncSliceTest, HttpPartitionTest]
[junit4] 2> NOTE: reproduce with: ant test -Dtestcase=HttpPartitionTest -Dtests.seed=241D37BED7E7A079 -Dtests.multiplier=3 -Dtests.slow=true -Dtests.locale=de_LU -Dtests.timezone=SystemV/YST9 -Dtests.asserts=true -Dtests.file.encoding=UTF-8
[junit4] ERROR 0.00s J1 | HttpPartitionTest (suite) <<<
[junit4] > Throwable #1: java.lang.AssertionError: ObjectTracker found 1 object(s) that were not released!!! [TransactionLog]
[junit4] > at __randomizedtesting.SeedInfo.seed([241D37BED7E7A079]:0)
[junit4] > at org.apache.solr.SolrTestCaseJ4.afterClass(SolrTestCaseJ4.java:236)
[junit4] > at java.lang.Thread.run(Thread.java:745)
[junit4] Completed [255/536] on J1 in 136.88s, 1 test, 1 failure <<< FAILURES!
[...truncated 866 lines...]
BUILD FAILED
/home/jenkins/workspace/Lucene-Solr-5.x-Linux/build.xml:785: The following error occurred while executing this line:
/home/jenkins/workspace/Lucene-Solr-5.x-Linux/build.xml:729: The following error occurred while executing this line:
/home/jenkins/workspace/Lucene-Solr-5.x-Linux/build.xml:59: The following error occurred while executing this line:
/home/jenkins/workspace/Lucene-Solr-5.x-Linux/solr/build.xml:233: The following error occurred while executing this line:
/home/jenkins/workspace/Lucene-Solr-5.x-Linux/solr/common-build.xml:524: The following error occurred while executing this line:
/home/jenkins/workspace/Lucene-Solr-5.x-Linux/lucene/common-build.xml:1452: The following error occurred while executing this line:
/home/jenkins/workspace/Lucene-Solr-5.x-Linux/lucene/common-build.xml:1006: There were test failures: 536 suites, 2128 tests, 1 suite-level error, 70 ignored (34 assumptions)
Total time: 49 minutes 32 seconds
Build step 'Invoke Ant' marked build as failure
Archiving artifacts
[WARNINGS] Skipping publisher since build result is FAILURE
Recording test results
Email was triggered for: Failure - Any
Sending email for trigger: Failure - Any
[JENKINS] Lucene-Solr-5.x-Linux (32bit/jdk1.7.0_80) - Build # 13766
- Still Failing!
Posted by Policeman Jenkins Server <je...@thetaphi.de>.
Build: http://jenkins.thetaphi.de/job/Lucene-Solr-5.x-Linux/13766/
Java: 32bit/jdk1.7.0_80 -server -XX:+UseSerialGC
1 tests failed.
FAILED: org.apache.solr.cloud.TestConfigSetsAPIExclusivity.testAPIExclusivity
Error Message:
Unexpected exception: org.apache.solr.client.solrj.impl.HttpSolrClient$RemoteSolrException: Error from server at http://127.0.0.1:42267/solr: delete the configset time out:300s expected:<0> but was:<1>
Stack Trace:
java.lang.AssertionError: Unexpected exception: org.apache.solr.client.solrj.impl.HttpSolrClient$RemoteSolrException: Error from server at http://127.0.0.1:42267/solr: delete the configset time out:300s expected:<0> but was:<1>
at __randomizedtesting.SeedInfo.seed([2A6DF2E6432EEABA:5718EB1D1A8A53F3]:0)
at org.junit.Assert.fail(Assert.java:93)
at org.junit.Assert.failNotEquals(Assert.java:647)
at org.junit.Assert.assertEquals(Assert.java:128)
at org.junit.Assert.assertEquals(Assert.java:472)
at org.apache.solr.cloud.TestConfigSetsAPIExclusivity.testAPIExclusivity(TestConfigSetsAPIExclusivity.java:95)
at sun.reflect.NativeMethodAccessorImpl.invoke0(Native Method)
at sun.reflect.NativeMethodAccessorImpl.invoke(NativeMethodAccessorImpl.java:57)
at sun.reflect.DelegatingMethodAccessorImpl.invoke(DelegatingMethodAccessorImpl.java:43)
at java.lang.reflect.Method.invoke(Method.java:606)
at com.carrotsearch.randomizedtesting.RandomizedRunner.invoke(RandomizedRunner.java:1627)
at com.carrotsearch.randomizedtesting.RandomizedRunner$6.evaluate(RandomizedRunner.java:836)
at com.carrotsearch.randomizedtesting.RandomizedRunner$7.evaluate(RandomizedRunner.java:872)
at com.carrotsearch.randomizedtesting.RandomizedRunner$8.evaluate(RandomizedRunner.java:886)
at com.carrotsearch.randomizedtesting.rules.SystemPropertiesRestoreRule$1.evaluate(SystemPropertiesRestoreRule.java:57)
at org.apache.lucene.util.TestRuleSetupTeardownChained$1.evaluate(TestRuleSetupTeardownChained.java:50)
at org.apache.lucene.util.AbstractBeforeAfterRule$1.evaluate(AbstractBeforeAfterRule.java:46)
at org.apache.lucene.util.TestRuleThreadAndTestName$1.evaluate(TestRuleThreadAndTestName.java:49)
at org.apache.lucene.util.TestRuleIgnoreAfterMaxFailures$1.evaluate(TestRuleIgnoreAfterMaxFailures.java:65)
at org.apache.lucene.util.TestRuleMarkFailure$1.evaluate(TestRuleMarkFailure.java:48)
at com.carrotsearch.randomizedtesting.rules.StatementAdapter.evaluate(StatementAdapter.java:36)
at com.carrotsearch.randomizedtesting.ThreadLeakControl$StatementRunner.run(ThreadLeakControl.java:365)
at com.carrotsearch.randomizedtesting.ThreadLeakControl.forkTimeoutingTask(ThreadLeakControl.java:798)
at com.carrotsearch.randomizedtesting.ThreadLeakControl$3.evaluate(ThreadLeakControl.java:458)
at com.carrotsearch.randomizedtesting.RandomizedRunner.runSingleTest(RandomizedRunner.java:845)
at com.carrotsearch.randomizedtesting.RandomizedRunner$3.evaluate(RandomizedRunner.java:747)
at com.carrotsearch.randomizedtesting.RandomizedRunner$4.evaluate(RandomizedRunner.java:781)
at com.carrotsearch.randomizedtesting.RandomizedRunner$5.evaluate(RandomizedRunner.java:792)
at com.carrotsearch.randomizedtesting.rules.StatementAdapter.evaluate(StatementAdapter.java:36)
at com.carrotsearch.randomizedtesting.rules.SystemPropertiesRestoreRule$1.evaluate(SystemPropertiesRestoreRule.java:57)
at org.apache.lucene.util.AbstractBeforeAfterRule$1.evaluate(AbstractBeforeAfterRule.java:46)
at com.carrotsearch.randomizedtesting.rules.StatementAdapter.evaluate(StatementAdapter.java:36)
at org.apache.lucene.util.TestRuleStoreClassName$1.evaluate(TestRuleStoreClassName.java:42)
at com.carrotsearch.randomizedtesting.rules.NoShadowingOrOverridesOnMethodsRule$1.evaluate(NoShadowingOrOverridesOnMethodsRule.java:39)
at com.carrotsearch.randomizedtesting.rules.NoShadowingOrOverridesOnMethodsRule$1.evaluate(NoShadowingOrOverridesOnMethodsRule.java:39)
at com.carrotsearch.randomizedtesting.rules.StatementAdapter.evaluate(StatementAdapter.java:36)
at com.carrotsearch.randomizedtesting.rules.StatementAdapter.evaluate(StatementAdapter.java:36)
at com.carrotsearch.randomizedtesting.rules.StatementAdapter.evaluate(StatementAdapter.java:36)
at org.apache.lucene.util.TestRuleAssertionsRequired$1.evaluate(TestRuleAssertionsRequired.java:54)
at org.apache.lucene.util.TestRuleMarkFailure$1.evaluate(TestRuleMarkFailure.java:48)
at org.apache.lucene.util.TestRuleIgnoreAfterMaxFailures$1.evaluate(TestRuleIgnoreAfterMaxFailures.java:65)
at org.apache.lucene.util.TestRuleIgnoreTestSuites$1.evaluate(TestRuleIgnoreTestSuites.java:55)
at com.carrotsearch.randomizedtesting.rules.StatementAdapter.evaluate(StatementAdapter.java:36)
at com.carrotsearch.randomizedtesting.ThreadLeakControl$StatementRunner.run(ThreadLeakControl.java:365)
at java.lang.Thread.run(Thread.java:745)
Build Log:
[...truncated 10186 lines...]
[junit4] Suite: org.apache.solr.cloud.TestConfigSetsAPIExclusivity
[junit4] 2> Creating dataDir: /home/jenkins/workspace/Lucene-Solr-5.x-Linux/solr/build/solr-core/test/J2/temp/solr.cloud.TestConfigSetsAPIExclusivity_2A6DF2E6432EEABA-001/init-core-data-001
[junit4] 2> 399036 INFO (SUITE-TestConfigSetsAPIExclusivity-seed#[2A6DF2E6432EEABA]-worker) [ ] o.a.s.SolrTestCaseJ4 Randomized ssl (false) and clientAuth (false)
[junit4] 2> 399038 INFO (TEST-TestConfigSetsAPIExclusivity.testAPIExclusivity-seed#[2A6DF2E6432EEABA]) [ ] o.a.s.SolrTestCaseJ4 ###Starting testAPIExclusivity
[junit4] 2> 399040 INFO (TEST-TestConfigSetsAPIExclusivity.testAPIExclusivity-seed#[2A6DF2E6432EEABA]) [ ] o.a.s.c.ZkTestServer STARTING ZK TEST SERVER
[junit4] 2> 399040 INFO (Thread-726) [ ] o.a.s.c.ZkTestServer client port:0.0.0.0/0.0.0.0:0
[junit4] 2> 399040 INFO (Thread-726) [ ] o.a.s.c.ZkTestServer Starting server
[junit4] 2> 399140 INFO (TEST-TestConfigSetsAPIExclusivity.testAPIExclusivity-seed#[2A6DF2E6432EEABA]) [ ] o.a.s.c.ZkTestServer start zk server on port:56447
[junit4] 2> 399140 INFO (TEST-TestConfigSetsAPIExclusivity.testAPIExclusivity-seed#[2A6DF2E6432EEABA]) [ ] o.a.s.c.c.SolrZkClient Using default ZkCredentialsProvider
[junit4] 2> 399141 INFO (TEST-TestConfigSetsAPIExclusivity.testAPIExclusivity-seed#[2A6DF2E6432EEABA]) [ ] o.a.s.c.c.ConnectionManager Waiting for client to connect to ZooKeeper
[junit4] 2> 399142 INFO (zkCallback-339-thread-1) [ ] o.a.s.c.c.ConnectionManager Watcher org.apache.solr.common.cloud.ConnectionManager@a07ed9 name:ZooKeeperConnection Watcher:127.0.0.1:56447 got event WatchedEvent state:SyncConnected type:None path:null path:null type:None
[junit4] 2> 399142 INFO (TEST-TestConfigSetsAPIExclusivity.testAPIExclusivity-seed#[2A6DF2E6432EEABA]) [ ] o.a.s.c.c.ConnectionManager Client is connected to ZooKeeper
[junit4] 2> 399143 INFO (TEST-TestConfigSetsAPIExclusivity.testAPIExclusivity-seed#[2A6DF2E6432EEABA]) [ ] o.a.s.c.c.SolrZkClient Using default ZkACLProvider
[junit4] 2> 399143 INFO (TEST-TestConfigSetsAPIExclusivity.testAPIExclusivity-seed#[2A6DF2E6432EEABA]) [ ] o.a.s.c.c.SolrZkClient makePath: /solr/solr.xml
[junit4] 2> 399146 INFO (jetty-launcher-338-thread-1) [ ] o.e.j.s.Server jetty-9.2.13.v20150730
[junit4] 2> 399147 INFO (jetty-launcher-338-thread-1) [ ] o.e.j.s.h.ContextHandler Started o.e.j.s.ServletContextHandler@5d40aa{/solr,null,AVAILABLE}
[junit4] 2> 399148 INFO (jetty-launcher-338-thread-1) [ ] o.e.j.s.ServerConnector Started ServerConnector@6f49a3{HTTP/1.1}{127.0.0.1:42267}
[junit4] 2> 399148 INFO (jetty-launcher-338-thread-1) [ ] o.e.j.s.Server Started @400934ms
[junit4] 2> 399149 INFO (jetty-launcher-338-thread-1) [ ] o.a.s.c.s.e.JettySolrRunner Jetty properties: {hostPort=42267, hostContext=/solr}
[junit4] 2> 399149 INFO (jetty-launcher-338-thread-1) [ ] o.a.s.s.SolrDispatchFilter SolrDispatchFilter.init(): sun.misc.Launcher$AppClassLoader@1756db3
[junit4] 2> 399149 INFO (jetty-launcher-338-thread-1) [ ] o.a.s.c.SolrResourceLoader new SolrResourceLoader for directory: '/home/jenkins/workspace/Lucene-Solr-5.x-Linux/solr/build/solr-core/test/J2/temp/solr.cloud.TestConfigSetsAPIExclusivity_2A6DF2E6432EEABA-001/tempDir-001/'
[junit4] 2> 399165 INFO (jetty-launcher-338-thread-1) [ ] o.a.s.c.c.SolrZkClient Using default ZkCredentialsProvider
[junit4] 2> 399165 INFO (jetty-launcher-338-thread-1) [ ] o.a.s.c.c.ConnectionManager Waiting for client to connect to ZooKeeper
[junit4] 2> 399166 INFO (zkCallback-340-thread-1) [ ] o.a.s.c.c.ConnectionManager Watcher org.apache.solr.common.cloud.ConnectionManager@14a24c5 name:ZooKeeperConnection Watcher:127.0.0.1:56447/solr got event WatchedEvent state:SyncConnected type:None path:null path:null type:None
[junit4] 2> 399166 INFO (jetty-launcher-338-thread-1) [ ] o.a.s.c.c.ConnectionManager Client is connected to ZooKeeper
[junit4] 2> 399167 INFO (jetty-launcher-338-thread-1) [ ] o.a.s.c.c.SolrZkClient Using default ZkACLProvider
[junit4] 2> 399167 INFO (jetty-launcher-338-thread-1) [ ] o.a.s.s.SolrDispatchFilter solr.xml found in ZooKeeper. Loading...
[junit4] 2> 399177 INFO (jetty-launcher-338-thread-1) [ ] o.a.s.c.CoresLocator Config-defined core root directory: /home/jenkins/workspace/Lucene-Solr-5.x-Linux/solr/build/solr-core/test/J2/temp/solr.cloud.TestConfigSetsAPIExclusivity_2A6DF2E6432EEABA-001/tempDir-001/.
[junit4] 2> 399177 INFO (jetty-launcher-338-thread-1) [ ] o.a.s.c.CoreContainer New CoreContainer 13314077
[junit4] 2> 399177 INFO (jetty-launcher-338-thread-1) [ ] o.a.s.c.CoreContainer Loading cores into CoreContainer [instanceDir=/home/jenkins/workspace/Lucene-Solr-5.x-Linux/solr/build/solr-core/test/J2/temp/solr.cloud.TestConfigSetsAPIExclusivity_2A6DF2E6432EEABA-001/tempDir-001/]
[junit4] 2> 399177 INFO (jetty-launcher-338-thread-1) [ ] o.a.s.c.CoreContainer loading shared library: /home/jenkins/workspace/Lucene-Solr-5.x-Linux/solr/build/solr-core/test/J2/temp/solr.cloud.TestConfigSetsAPIExclusivity_2A6DF2E6432EEABA-001/tempDir-001/lib
[junit4] 2> 399177 WARN (jetty-launcher-338-thread-1) [ ] o.a.s.c.SolrResourceLoader Can't find (or read) directory to add to classloader: lib (resolved as: /home/jenkins/workspace/Lucene-Solr-5.x-Linux/solr/build/solr-core/test/J2/temp/solr.cloud.TestConfigSetsAPIExclusivity_2A6DF2E6432EEABA-001/tempDir-001/lib).
[junit4] 2> 399183 INFO (jetty-launcher-338-thread-1) [ ] o.a.s.h.c.HttpShardHandlerFactory created with socketTimeout : 90000,urlScheme : ,connTimeout : 15000,maxConnectionsPerHost : 20,maxConnections : 10000,corePoolSize : 0,maximumPoolSize : 2147483647,maxThreadIdleTime : 5,sizeOfQueue : -1,fairnessPolicy : false,useRetries : false,
[junit4] 2> 399184 INFO (jetty-launcher-338-thread-1) [ ] o.a.s.u.UpdateShardHandler Creating UpdateShardHandler HTTP client with params: socketTimeout=340000&connTimeout=45000&retry=true
[junit4] 2> 399185 INFO (jetty-launcher-338-thread-1) [ ] o.a.s.l.LogWatcher SLF4J impl is org.slf4j.impl.Log4jLoggerFactory
[junit4] 2> 399185 INFO (jetty-launcher-338-thread-1) [ ] o.a.s.l.LogWatcher Registering Log Listener [Log4j (org.slf4j.impl.Log4jLoggerFactory)]
[junit4] 2> 399185 INFO (jetty-launcher-338-thread-1) [ ] o.a.s.c.ZkContainer Zookeeper client=127.0.0.1:56447/solr
[junit4] 2> 399185 INFO (jetty-launcher-338-thread-1) [ ] o.a.s.c.ZkController zkHost includes chroot
[junit4] 2> 399185 INFO (jetty-launcher-338-thread-1) [ ] o.a.s.c.c.SolrZkClient Using default ZkCredentialsProvider
[junit4] 2> 399185 INFO (jetty-launcher-338-thread-1) [ ] o.a.s.c.c.ConnectionManager Waiting for client to connect to ZooKeeper
[junit4] 2> 399186 INFO (zkCallback-342-thread-1) [ ] o.a.s.c.c.ConnectionManager Watcher org.apache.solr.common.cloud.ConnectionManager@154853e name:ZooKeeperConnection Watcher:127.0.0.1:56447 got event WatchedEvent state:SyncConnected type:None path:null path:null type:None
[junit4] 2> 399186 INFO (jetty-launcher-338-thread-1) [ ] o.a.s.c.c.ConnectionManager Client is connected to ZooKeeper
[junit4] 2> 399187 INFO (jetty-launcher-338-thread-1) [ ] o.a.s.c.c.SolrZkClient Using default ZkACLProvider
[junit4] 2> 399188 INFO (jetty-launcher-338-thread-1) [n:127.0.0.1:42267_solr ] o.a.s.c.c.ConnectionManager Waiting for client to connect to ZooKeeper
[junit4] 2> 399188 INFO (zkCallback-343-thread-1-processing-n:127.0.0.1:42267_solr) [n:127.0.0.1:42267_solr ] o.a.s.c.c.ConnectionManager Watcher org.apache.solr.common.cloud.ConnectionManager@30c8d8 name:ZooKeeperConnection Watcher:127.0.0.1:56447/solr got event WatchedEvent state:SyncConnected type:None path:null path:null type:None
[junit4] 2> 399188 INFO (jetty-launcher-338-thread-1) [n:127.0.0.1:42267_solr ] o.a.s.c.c.ConnectionManager Client is connected to ZooKeeper
[junit4] 2> 399189 INFO (jetty-launcher-338-thread-1) [n:127.0.0.1:42267_solr ] o.a.s.c.c.SolrZkClient makePath: /overseer/queue
[junit4] 2> 399190 INFO (jetty-launcher-338-thread-1) [n:127.0.0.1:42267_solr ] o.a.s.c.c.SolrZkClient makePath: /overseer/collection-queue-work
[junit4] 2> 399192 INFO (jetty-launcher-338-thread-1) [n:127.0.0.1:42267_solr ] o.a.s.c.c.SolrZkClient makePath: /overseer/collection-map-running
[junit4] 2> 399193 INFO (jetty-launcher-338-thread-1) [n:127.0.0.1:42267_solr ] o.a.s.c.c.SolrZkClient makePath: /overseer/collection-map-completed
[junit4] 2> 399194 INFO (jetty-launcher-338-thread-1) [n:127.0.0.1:42267_solr ] o.a.s.c.c.SolrZkClient makePath: /overseer/collection-map-failure
[junit4] 2> 399195 INFO (jetty-launcher-338-thread-1) [n:127.0.0.1:42267_solr ] o.a.s.c.c.SolrZkClient makePath: /live_nodes
[junit4] 2> 399196 INFO (jetty-launcher-338-thread-1) [n:127.0.0.1:42267_solr ] o.a.s.c.c.SolrZkClient makePath: /collections
[junit4] 2> 399196 INFO (jetty-launcher-338-thread-1) [n:127.0.0.1:42267_solr ] o.a.s.c.c.SolrZkClient makePath: /aliases.json
[junit4] 2> 399197 INFO (jetty-launcher-338-thread-1) [n:127.0.0.1:42267_solr ] o.a.s.c.c.SolrZkClient makePath: /clusterstate.json
[junit4] 2> 399198 INFO (jetty-launcher-338-thread-1) [n:127.0.0.1:42267_solr ] o.a.s.c.c.SolrZkClient makePath: /security.json
[junit4] 2> 399198 INFO (jetty-launcher-338-thread-1) [n:127.0.0.1:42267_solr ] o.a.s.c.ZkController Register node as live in ZooKeeper:/live_nodes/127.0.0.1:42267_solr
[junit4] 2> 399198 INFO (jetty-launcher-338-thread-1) [n:127.0.0.1:42267_solr ] o.a.s.c.c.SolrZkClient makePath: /live_nodes/127.0.0.1:42267_solr
[junit4] 2> 399199 INFO (jetty-launcher-338-thread-1) [n:127.0.0.1:42267_solr ] o.a.s.c.c.SolrZkClient makePath: /overseer_elect
[junit4] 2> 399200 INFO (jetty-launcher-338-thread-1) [n:127.0.0.1:42267_solr ] o.a.s.c.c.SolrZkClient makePath: /overseer_elect/election
[junit4] 2> 399201 INFO (jetty-launcher-338-thread-1) [n:127.0.0.1:42267_solr ] o.a.s.c.Overseer Overseer (id=null) closing
[junit4] 2> 399201 INFO (jetty-launcher-338-thread-1) [n:127.0.0.1:42267_solr ] o.a.s.c.LeaderElector Joined leadership election with path: /overseer_elect/election/94429427546324995-127.0.0.1:42267_solr-n_0000000000
[junit4] 2> 399201 INFO (jetty-launcher-338-thread-1) [n:127.0.0.1:42267_solr ] o.a.s.c.OverseerElectionContext I am going to be the leader 127.0.0.1:42267_solr
[junit4] 2> 399202 INFO (jetty-launcher-338-thread-1) [n:127.0.0.1:42267_solr ] o.a.s.c.c.SolrZkClient makePath: /overseer_elect/leader
[junit4] 2> 399203 INFO (jetty-launcher-338-thread-1) [n:127.0.0.1:42267_solr ] o.a.s.c.Overseer Overseer (id=94429427546324995-127.0.0.1:42267_solr-n_0000000000) starting
[junit4] 2> 399204 INFO (jetty-launcher-338-thread-1) [n:127.0.0.1:42267_solr ] o.a.s.c.c.SolrZkClient makePath: /overseer/queue-work
[junit4] 2> 399207 INFO (jetty-launcher-338-thread-1) [n:127.0.0.1:42267_solr ] o.a.s.c.OverseerAutoReplicaFailoverThread Starting OverseerAutoReplicaFailoverThread autoReplicaFailoverWorkLoopDelay=10000 autoReplicaFailoverWaitAfterExpiration=30000 autoReplicaFailoverBadNodeExpiration=60000
[junit4] 2> 399207 INFO (OverseerCollectionConfigSetProcessor-94429427546324995-127.0.0.1:42267_solr-n_0000000000) [n:127.0.0.1:42267_solr ] o.a.s.c.OverseerTaskProcessor Process current queue of overseer operations
[junit4] 2> 399207 INFO (jetty-launcher-338-thread-1) [n:127.0.0.1:42267_solr ] o.a.s.c.c.ZkStateReader Updating cluster state from ZooKeeper...
[junit4] 2> 399207 INFO (OverseerStateUpdate-94429427546324995-127.0.0.1:42267_solr-n_0000000000) [n:127.0.0.1:42267_solr ] o.a.s.c.Overseer Starting to work on the main queue
[junit4] 2> 399229 INFO (jetty-launcher-338-thread-1) [n:127.0.0.1:42267_solr ] o.a.s.c.CoreContainer Security conf doesn't exist. Skipping setup for authorization module.
[junit4] 2> 399229 INFO (jetty-launcher-338-thread-1) [n:127.0.0.1:42267_solr ] o.a.s.c.CoreContainer No authentication plugin used.
[junit4] 2> 399230 INFO (jetty-launcher-338-thread-1) [n:127.0.0.1:42267_solr ] o.a.s.c.CoresLocator Looking for core definitions underneath /home/jenkins/workspace/Lucene-Solr-5.x-Linux/solr/build/solr-core/test/J2/temp/solr.cloud.TestConfigSetsAPIExclusivity_2A6DF2E6432EEABA-001/tempDir-001/.
[junit4] 2> 399230 INFO (jetty-launcher-338-thread-1) [n:127.0.0.1:42267_solr ] o.a.s.c.CoresLocator Found 0 core definitions
[junit4] 2> 399231 INFO (jetty-launcher-338-thread-1) [n:127.0.0.1:42267_solr ] o.a.s.s.SolrDispatchFilter user.dir=/home/jenkins/workspace/Lucene-Solr-5.x-Linux/solr/build/solr-core/test/J2
[junit4] 2> 399231 INFO (jetty-launcher-338-thread-1) [n:127.0.0.1:42267_solr ] o.a.s.s.SolrDispatchFilter SolrDispatchFilter.init() done
[junit4] 2> 399231 INFO (TEST-TestConfigSetsAPIExclusivity.testAPIExclusivity-seed#[2A6DF2E6432EEABA]) [ ] o.a.s.c.c.SolrZkClient Using default ZkCredentialsProvider
[junit4] 2> 399232 INFO (TEST-TestConfigSetsAPIExclusivity.testAPIExclusivity-seed#[2A6DF2E6432EEABA]) [ ] o.a.s.c.c.ConnectionManager Waiting for client to connect to ZooKeeper
[junit4] 2> 399232 INFO (zkCallback-344-thread-1) [ ] o.a.s.c.c.ConnectionManager Watcher org.apache.solr.common.cloud.ConnectionManager@3f5759 name:ZooKeeperConnection Watcher:127.0.0.1:56447 got event WatchedEvent state:SyncConnected type:None path:null path:null type:None
[junit4] 2> 399232 INFO (TEST-TestConfigSetsAPIExclusivity.testAPIExclusivity-seed#[2A6DF2E6432EEABA]) [ ] o.a.s.c.c.ConnectionManager Client is connected to ZooKeeper
[junit4] 2> 399233 INFO (TEST-TestConfigSetsAPIExclusivity.testAPIExclusivity-seed#[2A6DF2E6432EEABA]) [ ] o.a.s.c.c.SolrZkClient Using default ZkACLProvider
[junit4] 2> 399235 INFO (TEST-TestConfigSetsAPIExclusivity.testAPIExclusivity-seed#[2A6DF2E6432EEABA]) [ ] o.a.s.c.c.SolrZkClient Using default ZkCredentialsProvider
[junit4] 2> 399235 INFO (TEST-TestConfigSetsAPIExclusivity.testAPIExclusivity-seed#[2A6DF2E6432EEABA]) [ ] o.a.s.c.c.ConnectionManager Waiting for client to connect to ZooKeeper
[junit4] 2> 399236 INFO (zkCallback-346-thread-1) [ ] o.a.s.c.c.ConnectionManager Watcher org.apache.solr.common.cloud.ConnectionManager@173e35d name:ZooKeeperConnection Watcher:127.0.0.1:56447/solr got event WatchedEvent state:SyncConnected type:None path:null path:null type:None
[junit4] 2> 399236 INFO (TEST-TestConfigSetsAPIExclusivity.testAPIExclusivity-seed#[2A6DF2E6432EEABA]) [ ] o.a.s.c.c.ConnectionManager Client is connected to ZooKeeper
[junit4] 2> 399237 INFO (TEST-TestConfigSetsAPIExclusivity.testAPIExclusivity-seed#[2A6DF2E6432EEABA]) [ ] o.a.s.c.c.SolrZkClient Using default ZkACLProvider
[junit4] 2> 399238 INFO (TEST-TestConfigSetsAPIExclusivity.testAPIExclusivity-seed#[2A6DF2E6432EEABA]) [ ] o.a.s.c.c.SolrZkClient makePath: /configs/grandBaseConfigSet1/solrconfig.xml
[junit4] 2> 399241 INFO (TEST-TestConfigSetsAPIExclusivity.testAPIExclusivity-seed#[2A6DF2E6432EEABA]) [ ] o.a.s.c.c.SolrZkClient makePath: /configs/grandBaseConfigSet1/schema.xml
[junit4] 2> 399251 INFO (qtp27983095-2385) [n:127.0.0.1:42267_solr ] o.a.s.h.a.ConfigSetsHandler Invoked ConfigSet Action :create with params version=2&name=configSet1&baseConfigSet=baseConfigSet1&action=CREATE&wt=javabin
[junit4] 2> 399251 INFO (qtp27983095-2386) [n:127.0.0.1:42267_solr ] o.a.s.h.a.ConfigSetsHandler Invoked ConfigSet Action :create with params version=2&name=baseConfigSet1&baseConfigSet=grandBaseConfigSet1&action=CREATE&wt=javabin
[junit4] 2> 399251 INFO (qtp27983095-2387) [n:127.0.0.1:42267_solr ] o.a.s.h.a.ConfigSetsHandler Invoked ConfigSet Action :delete with params version=2&name=configSet1&action=DELETE&wt=javabin
[junit4] 2> 399251 INFO (qtp27983095-2416) [n:127.0.0.1:42267_solr ] o.a.s.h.a.ConfigSetsHandler Invoked ConfigSet Action :delete with params version=2&name=baseConfigSet1&action=DELETE&wt=javabin
[junit4] 2> 399255 INFO (OverseerCollectionConfigSetProcessor-94429427546324995-127.0.0.1:42267_solr-n_0000000000) [n:127.0.0.1:42267_solr ] o.a.s.c.OverseerTaskProcessor Overseer ConfigSet Message Handler: Get the message id:/overseer/collection-queue-work/qn-0000000000 message:{
[junit4] 2> "name":"configSet1",
[junit4] 2> "baseConfigSet":"baseConfigSet1",
[junit4] 2> "operation":"configsets:create"}
[junit4] 2> 399259 INFO (OverseerThreadFactory-960-thread-1-processing-n:127.0.0.1:42267_solr) [n:127.0.0.1:42267_solr ] o.a.s.c.OverseerConfigSetMessageHandler OverseerConfigSetMessageHandler.processMessage : create , {
[junit4] 2> "name":"configSet1",
[junit4] 2> "baseConfigSet":"baseConfigSet1",
[junit4] 2> "operation":"configsets:create"}
[junit4] 2> 399261 ERROR (OverseerThreadFactory-960-thread-1-processing-n:127.0.0.1:42267_solr) [n:127.0.0.1:42267_solr ] o.a.s.c.OverseerConfigSetMessageHandler ConfigSet: configSet1 operation: create failed:org.apache.solr.common.SolrException: Base ConfigSet does not exist: baseConfigSet1
[junit4] 2> at org.apache.solr.cloud.OverseerConfigSetMessageHandler.createConfigSet(OverseerConfigSetMessageHandler.java:294)
[junit4] 2> at org.apache.solr.cloud.OverseerConfigSetMessageHandler.processMessage(OverseerConfigSetMessageHandler.java:112)
[junit4] 2> at org.apache.solr.cloud.OverseerTaskProcessor$Runner.run(OverseerTaskProcessor.java:443)
[junit4] 2> at org.apache.solr.common.util.ExecutorUtil$MDCAwareThreadPoolExecutor$1.run(ExecutorUtil.java:210)
[junit4] 2> at java.util.concurrent.ThreadPoolExecutor.runWorker(ThreadPoolExecutor.java:1145)
[junit4] 2> at java.util.concurrent.ThreadPoolExecutor$Worker.run(ThreadPoolExecutor.java:615)
[junit4] 2> at java.lang.Thread.run(Thread.java:745)
[junit4] 2>
[junit4] 2> 399266 INFO (OverseerThreadFactory-960-thread-1-processing-n:127.0.0.1:42267_solr) [n:127.0.0.1:42267_solr ] o.a.s.c.OverseerTaskProcessor Overseer ConfigSet Message Handler: Message id:/overseer/collection-queue-work/qn-0000000000 complete, response:{Operation create caused exception:=org.apache.solr.common.SolrException: Base ConfigSet does not exist: baseConfigSet1,exception={msg=Base ConfigSet does not exist: baseConfigSet1,rspCode=400}}
[junit4] 2> 399267 INFO (zkCallback-343-thread-1-processing-n:127.0.0.1:42267_solr) [n:127.0.0.1:42267_solr ] o.a.s.c.OverseerTaskQueue NodeDataChanged fired on path /overseer/collection-queue-work/qnr-0000000000 state SyncConnected
[junit4] 2> 399268 INFO (OverseerCollectionConfigSetProcessor-94429427546324995-127.0.0.1:42267_solr-n_0000000000) [n:127.0.0.1:42267_solr ] o.a.s.c.OverseerTaskProcessor Overseer ConfigSet Message Handler: Get the message id:/overseer/collection-queue-work/qn-0000000002 message:{
[junit4] 2> "name":"baseConfigSet1",
[junit4] 2> "baseConfigSet":"grandBaseConfigSet1",
[junit4] 2> "operation":"configsets:create"}
[junit4] 2> 399269 INFO (OverseerCollectionConfigSetProcessor-94429427546324995-127.0.0.1:42267_solr-n_0000000000) [n:127.0.0.1:42267_solr ] o.a.s.c.OverseerTaskProcessor Overseer ConfigSet Message Handler: Get the message id:/overseer/collection-queue-work/qn-0000000003 message:{
[junit4] 2> "name":"configSet1",
[junit4] 2> "operation":"configsets:delete"}
[junit4] 2> 399269 INFO (OverseerThreadFactory-960-thread-2-processing-n:127.0.0.1:42267_solr) [n:127.0.0.1:42267_solr ] o.a.s.c.OverseerConfigSetMessageHandler OverseerConfigSetMessageHandler.processMessage : create , {
[junit4] 2> "name":"baseConfigSet1",
[junit4] 2> "baseConfigSet":"grandBaseConfigSet1",
[junit4] 2> "operation":"configsets:create"}
[junit4] 2> 399269 INFO (OverseerThreadFactory-960-thread-3-processing-n:127.0.0.1:42267_solr) [n:127.0.0.1:42267_solr ] o.a.s.c.OverseerConfigSetMessageHandler OverseerConfigSetMessageHandler.processMessage : delete , {
[junit4] 2> "name":"configSet1",
[junit4] 2> "operation":"configsets:delete"}
[junit4] 2> 399269 ERROR (OverseerThreadFactory-960-thread-3-processing-n:127.0.0.1:42267_solr) [n:127.0.0.1:42267_solr ] o.a.s.c.OverseerConfigSetMessageHandler ConfigSet: configSet1 operation: delete failed:org.apache.solr.common.SolrException: ConfigSet does not exist to delete: configSet1
[junit4] 2> at org.apache.solr.cloud.OverseerConfigSetMessageHandler.deleteConfigSet(OverseerConfigSetMessageHandler.java:351)
[junit4] 2> at org.apache.solr.cloud.OverseerConfigSetMessageHandler.deleteConfigSet(OverseerConfigSetMessageHandler.java:345)
[junit4] 2> at org.apache.solr.cloud.OverseerConfigSetMessageHandler.processMessage(OverseerConfigSetMessageHandler.java:115)
[junit4] 2> at org.apache.solr.cloud.OverseerTaskProcessor$Runner.run(OverseerTaskProcessor.java:443)
[junit4] 2> at org.apache.solr.common.util.ExecutorUtil$MDCAwareThreadPoolExecutor$1.run(ExecutorUtil.java:210)
[junit4] 2> at java.util.concurrent.ThreadPoolExecutor.runWorker(ThreadPoolExecutor.java:1145)
[junit4] 2> at java.util.concurrent.ThreadPoolExecutor$Worker.run(ThreadPoolExecutor.java:615)
[junit4] 2> at java.lang.Thread.run(Thread.java:745)
[junit4] 2>
[junit4] 2> 399271 INFO (OverseerThreadFactory-960-thread-2-processing-n:127.0.0.1:42267_solr) [n:127.0.0.1:42267_solr ] o.a.s.c.c.ZkConfigManager Copying zk node /configs/grandBaseConfigSet1/schema.xml to /configs/baseConfigSet1/schema.xml
[junit4] 2> 399272 INFO (OverseerThreadFactory-960-thread-3-processing-n:127.0.0.1:42267_solr) [n:127.0.0.1:42267_solr ] o.a.s.c.OverseerTaskProcessor Overseer ConfigSet Message Handler: Message id:/overseer/collection-queue-work/qn-0000000003 complete, response:{Operation delete caused exception:=org.apache.solr.common.SolrException: ConfigSet does not exist to delete: configSet1,exception={msg=ConfigSet does not exist to delete: configSet1,rspCode=400}}
[junit4] 2> 399272 INFO (qtp27983095-2385) [n:127.0.0.1:42267_solr ] o.a.s.s.SolrDispatchFilter [admin] webapp=null path=/admin/configs params={version=2&name=configSet1&baseConfigSet=baseConfigSet1&action=CREATE&wt=javabin} status=400 QTime=23
[junit4] 2> 399272 INFO (OverseerThreadFactory-960-thread-2-processing-n:127.0.0.1:42267_solr) [n:127.0.0.1:42267_solr ] o.a.s.c.c.SolrZkClient makePath: /configs/baseConfigSet1/schema.xml
[junit4] 2> 399272 INFO (zkCallback-343-thread-1-processing-n:127.0.0.1:42267_solr) [n:127.0.0.1:42267_solr ] o.a.s.c.OverseerTaskQueue NodeDataChanged fired on path /overseer/collection-queue-work/qnr-0000000003 state SyncConnected
[junit4] 2> 399274 INFO (OverseerThreadFactory-960-thread-2-processing-n:127.0.0.1:42267_solr) [n:127.0.0.1:42267_solr ] o.a.s.c.c.ZkConfigManager Copying zk node /configs/grandBaseConfigSet1/solrconfig.xml to /configs/baseConfigSet1/solrconfig.xml
[junit4] 2> 399274 INFO (OverseerThreadFactory-960-thread-2-processing-n:127.0.0.1:42267_solr) [n:127.0.0.1:42267_solr ] o.a.s.c.c.SolrZkClient makePath: /configs/baseConfigSet1/solrconfig.xml
[junit4] 2> 399274 INFO (qtp27983095-2387) [n:127.0.0.1:42267_solr ] o.a.s.s.SolrDispatchFilter [admin] webapp=null path=/admin/configs params={version=2&name=configSet1&action=DELETE&wt=javabin} status=400 QTime=25
[junit4] 2> 399274 INFO (qtp27983095-2418) [n:127.0.0.1:42267_solr ] o.a.s.h.a.ConfigSetsHandler Invoked ConfigSet Action :create with params version=2&name=configSet1&baseConfigSet=baseConfigSet1&action=CREATE&wt=javabin
[junit4] 2> 399276 INFO (qtp27983095-2385) [n:127.0.0.1:42267_solr ] o.a.s.h.a.ConfigSetsHandler Invoked ConfigSet Action :delete with params version=2&name=configSet1&action=DELETE&wt=javabin
[junit4] 2> 399276 INFO (OverseerThreadFactory-960-thread-2-processing-n:127.0.0.1:42267_solr) [n:127.0.0.1:42267_solr ] o.a.s.c.OverseerTaskProcessor Overseer ConfigSet Message Handler: Message id:/overseer/collection-queue-work/qn-0000000002 complete, response:{}
[junit4] 2> 399276 INFO (OverseerCollectionConfigSetProcessor-94429427546324995-127.0.0.1:42267_solr-n_0000000000) [n:127.0.0.1:42267_solr ] o.a.s.c.OverseerTaskProcessor Overseer ConfigSet Message Handler: Get the message id:/overseer/collection-queue-work/qn-0000000006 message:{
[junit4] 2> "name":"baseConfigSet1",
[junit4] 2> "operation":"configsets:delete"}
[junit4] 2> 399277 INFO (OverseerThreadFactory-960-thread-4-processing-n:127.0.0.1:42267_solr) [n:127.0.0.1:42267_solr ] o.a.s.c.OverseerConfigSetMessageHandler OverseerConfigSetMessageHandler.processMessage : delete , {
[junit4] 2> "name":"baseConfigSet1",
[junit4] 2> "operation":"configsets:delete"}
[junit4] 2> 399277 INFO (OverseerThreadFactory-960-thread-4-processing-n:127.0.0.1:42267_solr) [n:127.0.0.1:42267_solr ] o.a.s.c.OverseerConfigSetMessageHandler no existing ConfigSet properties found
[junit4] 2> 399277 INFO (zkCallback-343-thread-1-processing-n:127.0.0.1:42267_solr) [n:127.0.0.1:42267_solr ] o.a.s.c.OverseerTaskQueue NodeDataChanged fired on path /overseer/collection-queue-work/qnr-0000000002 state SyncConnected
[junit4] 2> 399278 INFO (qtp27983095-2386) [n:127.0.0.1:42267_solr ] o.a.s.s.SolrDispatchFilter [admin] webapp=null path=/admin/configs params={version=2&name=baseConfigSet1&baseConfigSet=grandBaseConfigSet1&action=CREATE&wt=javabin} status=0 QTime=28
[junit4] 2> 399279 INFO (OverseerThreadFactory-960-thread-4-processing-n:127.0.0.1:42267_solr) [n:127.0.0.1:42267_solr ] o.a.s.c.OverseerTaskProcessor Overseer ConfigSet Message Handler: Message id:/overseer/collection-queue-work/qn-0000000006 complete, response:{}
[junit4] 2> 399279 INFO (zkCallback-343-thread-1-processing-n:127.0.0.1:42267_solr) [n:127.0.0.1:42267_solr ] o.a.s.c.OverseerTaskQueue NodeDataChanged fired on path /overseer/collection-queue-work/qnr-0000000006 state SyncConnected
[junit4] 2> 399280 INFO (qtp27983095-2387) [n:127.0.0.1:42267_solr ] o.a.s.h.a.ConfigSetsHandler Invoked ConfigSet Action :create with params version=2&name=baseConfigSet1&baseConfigSet=grandBaseConfigSet1&action=CREATE&wt=javabin
[junit4] 2> 399281 INFO (qtp27983095-2416) [n:127.0.0.1:42267_solr ] o.a.s.s.SolrDispatchFilter [admin] webapp=null path=/admin/configs params={version=2&name=baseConfigSet1&action=DELETE&wt=javabin} status=0 QTime=32
[junit4] 2> 399281 INFO (OverseerCollectionConfigSetProcessor-94429427546324995-127.0.0.1:42267_solr-n_0000000000) [n:127.0.0.1:42267_solr ] o.a.s.c.OverseerTaskProcessor Overseer ConfigSet Message Handler: Get the message id:/overseer/collection-queue-work/qn-0000000008 message:{
[junit4] 2> "name":"configSet1",
[junit4] 2> "baseConfigSet":"baseConfigSet1",
[junit4] 2> "operation":"configsets:create"}
[junit4] 2> 399282 INFO (OverseerThreadFactory-960-thread-5-processing-n:127.0.0.1:42267_solr) [n:127.0.0.1:42267_solr ] o.a.s.c.OverseerConfigSetMessageHandler OverseerConfigSetMessageHandler.processMessage : create , {
[junit4] 2> "name":"configSet1",
[junit4] 2> "baseConfigSet":"baseConfigSet1",
[junit4] 2> "operation":"configsets:create"}
[junit4] 2> 399282 ERROR (OverseerThreadFactory-960-thread-5-processing-n:127.0.0.1:42267_solr) [n:127.0.0.1:42267_solr ] o.a.s.c.OverseerConfigSetMessageHandler ConfigSet: configSet1 operation: create failed:org.apache.solr.common.SolrException: Base ConfigSet does not exist: baseConfigSet1
[junit4] 2> at org.apache.solr.cloud.OverseerConfigSetMessageHandler.createConfigSet(OverseerConfigSetMessageHandler.java:294)
[junit4] 2> at org.apache.solr.cloud.OverseerConfigSetMessageHandler.processMessage(OverseerConfigSetMessageHandler.java:112)
[junit4] 2> at org.apache.solr.cloud.OverseerTaskProcessor$Runner.run(OverseerTaskProcessor.java:443)
[junit4] 2> at org.apache.solr.common.util.ExecutorUtil$MDCAwareThreadPoolExecutor$1.run(ExecutorUtil.java:210)
[junit4] 2> at java.util.concurrent.ThreadPoolExecutor.runWorker(ThreadPoolExecutor.java:1145)
[junit4] 2> at java.util.concurrent.ThreadPoolExecutor$Worker.run(ThreadPoolExecutor.java:615)
[junit4] 2> at java.lang.Thread.run(Thread.java:745)
[junit4] 2>
[junit4] 2> 399282 INFO (qtp27983095-2386) [n:127.0.0.1:42267_solr ] o.a.s.h.a.ConfigSetsHandler Invoked ConfigSet Action :delete with params version=2&name=baseConfigSet1&action=DELETE&wt=javabin
[junit4] 2> 399284 INFO (OverseerThreadFactory-960-thread-5-processing-n:127.0.0.1:42267_solr) [n:127.0.0.1:42267_solr ] o.a.s.c.OverseerTaskProcessor Overseer ConfigSet Message Handler: Message id:/overseer/collection-queue-work/qn-0000000008 complete, response:{Operation create caused exception:=org.apache.solr.common.SolrException: Base ConfigSet does not exist: baseConfigSet1,exception={msg=Base ConfigSet does not exist: baseConfigSet1,rspCode=400}}
[junit4] 2> 399292 INFO (zkCallback-343-thread-1-processing-n:127.0.0.1:42267_solr) [n:127.0.0.1:42267_solr ] o.a.s.c.OverseerTaskQueue NodeDataChanged fired on path /overseer/collection-queue-work/qnr-0000000008 state SyncConnected
[junit4] 2> 399293 INFO (OverseerCollectionConfigSetProcessor-94429427546324995-127.0.0.1:42267_solr-n_0000000000) [n:127.0.0.1:42267_solr ] o.a.s.c.OverseerTaskProcessor Overseer ConfigSet Message Handler: Get the message id:/overseer/collection-queue-work/qn-0000000010 message:{
[junit4] 2> "name":"configSet1",
[junit4] 2> "operation":"configsets:delete"}
[junit4] 2> 399293 INFO (OverseerCollectionConfigSetProcessor-94429427546324995-127.0.0.1:42267_solr-n_0000000000) [n:127.0.0.1:42267_solr ] o.a.s.c.OverseerTaskProcessor Overseer ConfigSet Message Handler: Get the message id:/overseer/collection-queue-work/qn-0000000012 message:{
[junit4] 2> "name":"baseConfigSet1",
[junit4] 2> "baseConfigSet":"grandBaseConfigSet1",
[junit4] 2> "operation":"configsets:create"}
[junit4] 2> 399293 INFO (OverseerThreadFactory-960-thread-5-processing-n:127.0.0.1:42267_solr) [n:127.0.0.1:42267_solr ] o.a.s.c.OverseerConfigSetMessageHandler OverseerConfigSetMessageHandler.processMessage : delete , {
[junit4] 2> "name":"configSet1",
[junit4] 2> "operation":"configsets:delete"}
[junit4] 2> 399293 INFO (OverseerThreadFactory-960-thread-4-processing-n:127.0.0.1:42267_solr) [n:127.0.0.1:42267_solr ] o.a.s.c.OverseerConfigSetMessageHandler OverseerConfigSetMessageHandler.processMessage : create , {
[junit4] 2> "name":"baseConfigSet1",
[junit4] 2> "baseConfigSet":"grandBaseConfigSet1",
[junit4] 2> "operation":"configsets:create"}
[junit4] 2> 399294 ERROR (OverseerThreadFactory-960-thread-5-processing-n:127.0.0.1:42267_solr) [n:127.0.0.1:42267_solr ] o.a.s.c.OverseerConfigSetMessageHandler ConfigSet: configSet1 operation: delete failed:org.apache.solr.common.SolrException: ConfigSet does not exist to delete: configSet1
[junit4] 2> at org.apache.solr.cloud.OverseerConfigSetMessageHandler.deleteConfigSet(OverseerConfigSetMessageHandler.java:351)
[junit4] 2> at org.apache.solr.cloud.OverseerConfigSetMessageHandler.deleteConfigSet(OverseerConfigSetMessageHandler.java:345)
[junit4] 2> at org.apache.solr.cloud.OverseerConfigSetMessageHandler.processMessage(OverseerConfigSetMessageHandler.java:115)
[junit4] 2> at org.apache.solr.cloud.OverseerTaskProcessor$Runner.run(OverseerTaskProcessor.java:443)
[junit4] 2> at org.apache.solr.common.util.ExecutorUtil$MDCAwareThreadPoolExecutor$1.run(ExecutorUtil.java:210)
[junit4] 2> at java.util.concurrent.ThreadPoolExecutor.runWorker(ThreadPoolExecutor.java:1145)
[junit4] 2> at java.util.concurrent.ThreadPoolExecutor$Worker.run(ThreadPoolExecutor.java:615)
[junit4] 2> at java.lang.Thread.run(Thread.java:745)
[junit4] 2>
[junit4] 2> 399294 INFO (qtp27983095-2418) [n:127.0.0.1:42267_solr ] o.a.s.s.SolrDispatchFilter [admin] webapp=null path=/admin/configs params={version=2&name=configSet1&baseConfigSet=baseConfigSet1&action=CREATE&wt=javabin} status=400 QTime=20
[junit4] 2> 399295 INFO (OverseerThreadFactory-960-thread-5-processing-n:127.0.0.1:42267_solr) [n:127.0.0.1:42267_solr ] o.a.s.c.OverseerTaskProcessor Overseer ConfigSet Message Handler: Message id:/overseer/collection-queue-work/qn-0000000010 complete, response:{Operation delete caused exception:=org.apache.solr.common.SolrException: ConfigSet does not exist to delete: configSet1,exception={msg=ConfigSet does not exist to delete: configSet1,rspCode=400}}
[junit4] 2> 399295 INFO (OverseerThreadFactory-960-thread-4-processing-n:127.0.0.1:42267_solr) [n:127.0.0.1:42267_solr ] o.a.s.c.c.ZkConfigManager Copying zk node /configs/grandBaseConfigSet1/schema.xml to /configs/baseConfigSet1/schema.xml
[junit4] 2> 399295 INFO (OverseerThreadFactory-960-thread-4-processing-n:127.0.0.1:42267_solr) [n:127.0.0.1:42267_solr ] o.a.s.c.c.SolrZkClient makePath: /configs/baseConfigSet1/schema.xml
[junit4] 2> 399295 INFO (zkCallback-343-thread-1-processing-n:127.0.0.1:42267_solr) [n:127.0.0.1:42267_solr ] o.a.s.c.OverseerTaskQueue NodeDataChanged fired on path /overseer/collection-queue-work/qnr-0000000010 state SyncConnected
[junit4] 2> 399297 INFO (qtp27983095-2416) [n:127.0.0.1:42267_solr ] o.a.s.h.a.ConfigSetsHandler Invoked ConfigSet Action :create with params version=2&name=configSet1&baseConfigSet=baseConfigSet1&action=CREATE&wt=javabin
[junit4] 2> 399297 INFO (OverseerThreadFactory-960-thread-4-processing-n:127.0.0.1:42267_solr) [n:127.0.0.1:42267_solr ] o.a.s.c.c.ZkConfigManager Copying zk node /configs/grandBaseConfigSet1/solrconfig.xml to /configs/baseConfigSet1/solrconfig.xml
[junit4] 2> 399297 INFO (qtp27983095-2385) [n:127.0.0.1:42267_solr ] o.a.s.s.SolrDispatchFilter [admin] webapp=null path=/admin/configs params={version=2&name=configSet1&action=DELETE&wt=javabin} status=400 QTime=21
[junit4] 2> 399297 INFO (OverseerThreadFactory-960-thread-4-processing-n:127.0.0.1:42267_solr) [n:127.0.0.1:42267_solr ] o.a.s.c.c.SolrZkClient makePath: /configs/baseConfigSet1/solrconfig.xml
[junit4] 2> 399299 INFO (OverseerThreadFactory-960-thread-4-processing-n:127.0.0.1:42267_solr) [n:127.0.0.1:42267_solr ] o.a.s.c.OverseerTaskProcessor Overseer ConfigSet Message Handler: Message id:/overseer/collection-queue-work/qn-0000000012 complete, response:{}
[junit4] 2> 399299 INFO (qtp27983095-2418) [n:127.0.0.1:42267_solr ] o.a.s.h.a.ConfigSetsHandler Invoked ConfigSet Action :delete with params version=2&name=configSet1&action=DELETE&wt=javabin
[junit4] 2> 399299 INFO (zkCallback-343-thread-1-processing-n:127.0.0.1:42267_solr) [n:127.0.0.1:42267_solr ] o.a.s.c.OverseerTaskQueue NodeDataChanged fired on path /overseer/collection-queue-work/qnr-0000000012 state SyncConnected
[junit4] 2> 399301 INFO (qtp27983095-2387) [n:127.0.0.1:42267_solr ] o.a.s.s.SolrDispatchFilter [admin] webapp=null path=/admin/configs params={version=2&name=baseConfigSet1&baseConfigSet=grandBaseConfigSet1&action=CREATE&wt=javabin} status=0 QTime=21
[junit4] 2> 399301 INFO (OverseerCollectionConfigSetProcessor-94429427546324995-127.0.0.1:42267_solr-n_0000000000) [n:127.0.0.1:42267_solr ] o.a.s.c.OverseerTaskProcessor Overseer ConfigSet Message Handler: Get the message id:/overseer/collection-queue-work/qn-0000000014 message:{
[junit4] 2> "name":"baseConfigSet1",
[junit4] 2> "operation":"configsets:delete"}
[junit4] 2> 399302 INFO (OverseerThreadFactory-960-thread-4-processing-n:127.0.0.1:42267_solr) [n:127.0.0.1:42267_solr ] o.a.s.c.OverseerConfigSetMessageHandler OverseerConfigSetMessageHandler.processMessage : delete , {
[junit4] 2> "name":"baseConfigSet1",
[junit4] 2> "operation":"configsets:delete"}
[junit4] 2> 399302 INFO (OverseerCollectionConfigSetProcessor-94429427546324995-127.0.0.1:42267_solr-n_0000000000) [n:127.0.0.1:42267_solr ] o.a.s.c.OverseerTaskProcessor Overseer ConfigSet Message Handler: Get the message id:/overseer/collection-queue-work/qn-0000000018 message:{
[junit4] 2> "name":"configSet1",
[junit4] 2> "operation":"configsets:delete"}
[junit4] 2> 399302 INFO (OverseerThreadFactory-960-thread-5-processing-n:127.0.0.1:42267_solr) [n:127.0.0.1:42267_solr ] o.a.s.c.OverseerConfigSetMessageHandler OverseerConfigSetMessageHandler.processMessage : delete , {
[junit4] 2> "name":"configSet1",
[junit4] 2> "operation":"configsets:delete"}
[junit4] 2> 399302 INFO (OverseerThreadFactory-960-thread-4-processing-n:127.0.0.1:42267_solr) [n:127.0.0.1:42267_solr ] o.a.s.c.OverseerConfigSetMessageHandler no existing ConfigSet properties found
[junit4] 2> 399302 ERROR (OverseerThreadFactory-960-thread-5-processing-n:127.0.0.1:42267_solr) [n:127.0.0.1:42267_solr ] o.a.s.c.OverseerConfigSetMessageHandler ConfigSet: configSet1 operation: delete failed:org.apache.solr.common.SolrException: ConfigSet does not exist to delete: configSet1
[junit4] 2> at org.apache.solr.cloud.OverseerConfigSetMessageHandler.deleteConfigSet(OverseerConfigSetMessageHandler.java:351)
[junit4] 2> at org.apache.solr.cloud.OverseerConfigSetMessageHandler.deleteConfigSet(OverseerConfigSetMessageHandler.java:345)
[junit4] 2> at org.apache.solr.cloud.OverseerConfigSetMessageHandler.processMessage(OverseerConfigSetMessageHandler.java:115)
[junit4] 2> at org.apache.solr.cloud.OverseerTaskProcessor$Runner.run(OverseerTaskProcessor.java:443)
[junit4] 2> at org.apache.solr.common.util.ExecutorUtil$MDCAwareThreadPoolExecutor$1.run(ExecutorUtil.java:210)
[junit4] 2> at java.util.concurrent.ThreadPoolExecutor.runWorker(ThreadPoolExecutor.java:1145)
[junit4] 2> at java.util.concurrent.ThreadPoolExecutor$Worker.run(ThreadPoolExecutor.java:615)
[junit4] 2> at java.lang.Thread.run(Thread.java:745)
[junit4] 2>
[junit4] 2> 399303 INFO (qtp27983095-2385) [n:127.0.0.1:42267_solr ] o.a.s.h.a.ConfigSetsHandler Invoked ConfigSet Action :create with params version=2&name=baseConfigSet1&baseConfigSet=grandBaseConfigSet1&action=CREATE&wt=javabin
[junit4] 2> 399303 INFO (OverseerThreadFactory-960-thread-5-processing-n:127.0.0.1:42267_solr) [n:127.0.0.1:42267_solr ] o.a.s.c.OverseerTaskProcessor Overseer ConfigSet Message Handler: Message id:/overseer/collection-queue-work/qn-0000000018 complete, response:{Operation delete caused exception:=org.apache.solr.common.SolrException: ConfigSet does not exist to delete: configSet1,exception={msg=ConfigSet does not exist to delete: configSet1,rspCode=400}}
[junit4] 2> 399308 INFO (zkCallback-343-thread-1-processing-n:127.0.0.1:42267_solr) [n:127.0.0.1:42267_solr ] o.a.s.c.OverseerTaskQueue NodeDataChanged fired on path /overseer/collection-queue-work/qnr-0000000018 state SyncConnected
[junit4] 2> 399308 INFO (OverseerThreadFactory-960-thread-4-processing-n:127.0.0.1:42267_solr) [n:127.0.0.1:42267_solr ] o.a.s.c.OverseerTaskProcessor Overseer ConfigSet Message Handler: Message id:/overseer/collection-queue-work/qn-0000000014 complete, response:{}
[junit4] 2> 399309 INFO (OverseerCollectionConfigSetProcessor-94429427546324995-127.0.0.1:42267_solr-n_0000000000) [n:127.0.0.1:42267_solr ] o.a.s.c.OverseerTaskProcessor Overseer ConfigSet Message Handler: Get the message id:/overseer/collection-queue-work/qn-0000000016 message:{
[junit4] 2> "name":"configSet1",
[junit4] 2> "baseConfigSet":"baseConfigSet1",
[junit4] 2> "operation":"configsets:create"}
[junit4] 2> 399309 INFO (OverseerThreadFactory-960-thread-4-processing-n:127.0.0.1:42267_solr) [n:127.0.0.1:42267_solr ] o.a.s.c.OverseerConfigSetMessageHandler OverseerConfigSetMessageHandler.processMessage : create , {
[junit4] 2> "name":"configSet1",
[junit4] 2> "baseConfigSet":"baseConfigSet1",
[junit4] 2> "operation":"configsets:create"}
[junit4] 2> 399310 ERROR (OverseerThreadFactory-960-thread-4-processing-n:127.0.0.1:42267_solr) [n:127.0.0.1:42267_solr ] o.a.s.c.OverseerConfigSetMessageHandler ConfigSet: configSet1 operation: create failed:org.apache.solr.common.SolrException: Base ConfigSet does not exist: baseConfigSet1
[junit4] 2> at org.apache.solr.cloud.OverseerConfigSetMessageHandler.createConfigSet(OverseerConfigSetMessageHandler.java:294)
[junit4] 2> at org.apache.solr.cloud.OverseerConfigSetMessageHandler.processMessage(OverseerConfigSetMessageHandler.java:112)
[junit4] 2> at org.apache.solr.cloud.OverseerTaskProcessor$Runner.run(OverseerTaskProcessor.java:443)
[junit4] 2> at org.apache.solr.common.util.ExecutorUtil$MDCAwareThreadPoolExecutor$1.run(ExecutorUtil.java:210)
[junit4] 2> at java.util.concurrent.ThreadPoolExecutor.runWorker(ThreadPoolExecutor.java:1145)
[junit4] 2> at java.util.concurrent.ThreadPoolExecutor$Worker.run(ThreadPoolExecutor.java:615)
[junit4] 2> at java.lang.Thread.run(Thread.java:745)
[junit4] 2>
[junit4] 2> 399310 INFO (zkCallback-343-thread-1-processing-n:127.0.0.1:42267_solr) [n:127.0.0.1:42267_solr ] o.a.s.c.OverseerTaskQueue NodeDataChanged fired on path /overseer/collection-queue-work/qnr-0000000014 state SyncConnected
[junit4] 2> 399310 INFO (qtp27983095-2418) [n:127.0.0.1:42267_solr ] o.a.s.s.SolrDispatchFilter [admin] webapp=null path=/admin/configs params={version=2&name=configSet1&action=DELETE&wt=javabin} status=400 QTime=10
[junit4] 2> 399311 INFO (qtp27983095-2386) [n:127.0.0.1:42267_solr ] o.a.s.s.SolrDispatchFilter [admin] webapp=null path=/admin/configs params={version=2&name=baseConfigSet1&action=DELETE&wt=javabin} status=0 QTime=28
[junit4] 2> 399311 INFO (OverseerThreadFactory-960-thread-4-processing-n:127.0.0.1:42267_solr) [n:127.0.0.1:42267_solr ] o.a.s.c.OverseerTaskProcessor Overseer ConfigSet Message Handler: Message id:/overseer/collection-queue-work/qn-0000000016 complete, response:{Operation create caused exception:=org.apache.solr.common.SolrException: Base ConfigSet does not exist: baseConfigSet1,exception={msg=Base ConfigSet does not exist: baseConfigSet1,rspCode=400}}
[junit4] 2> 399312 INFO (zkCallback-343-thread-1-processing-n:127.0.0.1:42267_solr) [n:127.0.0.1:42267_solr ] o.a.s.c.OverseerTaskQueue NodeDataChanged fired on path /overseer/collection-queue-work/qnr-0000000016 state SyncConnected
[junit4] 2> 399312 INFO (qtp27983095-2418) [n:127.0.0.1:42267_solr ] o.a.s.h.a.ConfigSetsHandler Invoked ConfigSet Action :delete with params version=2&name=baseConfigSet1&action=DELETE&wt=javabin
[junit4] 2> 399312 INFO (qtp27983095-2387) [n:127.0.0.1:42267_solr ] o.a.s.h.a.ConfigSetsHandler Invoked ConfigSet Action :delete with params version=2&name=configSet1&action=DELETE&wt=javabin
[junit4] 2> 399314 INFO (OverseerCollectionConfigSetProcessor-94429427546324995-127.0.0.1:42267_solr-n_0000000000) [n:127.0.0.1:42267_solr ] o.a.s.c.OverseerTaskProcessor Overseer ConfigSet Message Handler: Get the message id:/overseer/collection-queue-work/qn-0000000020 message:{
[junit4] 2> "name":"baseConfigSet1",
[junit4] 2> "baseConfigSet":"grandBaseConfigSet1",
[junit4] 2> "operation":"configsets:create"}
[junit4] 2> 399314 INFO (qtp27983095-2416) [n:127.0.0.1:42267_solr ] o.a.s.s.SolrDispatchFilter [admin] webapp=null path=/admin/configs params={version=2&name=configSet1&baseConfigSet=baseConfigSet1&action=CREATE&wt=javabin} status=400 QTime=17
[junit4] 2> 399315 INFO (OverseerThreadFactory-960-thread-4-processing-n:127.0.0.1:42267_solr) [n:127.0.0.1:42267_solr ] o.a.s.c.OverseerConfigSetMessageHandler OverseerConfigSetMessageHandler.processMessage : create , {
[junit4] 2> "name":"baseConfigSet1",
[junit4] 2> "baseConfigSet":"grandBaseConfigSet1",
[junit4] 2> "operation":"configsets:create"}
[junit4] 2> 399315 INFO (OverseerCollectionConfigSetProcessor-94429427546324995-127.0.0.1:42267_solr-n_0000000000) [n:127.0.0.1:42267_solr ] o.a.s.c.OverseerTaskProcessor Overseer ConfigSet Message Handler: Get the message id:/overseer/collection-queue-work/qn-0000000023 message:{
[junit4] 2> "name":"configSet1",
[junit4] 2> "operation":"configsets:delete"}
[junit4] 2> 399315 INFO (OverseerThreadFactory-960-thread-5-processing-n:127.0.0.1:42267_solr) [n:127.0.0.1:42267_solr ] o.a.s.c.OverseerConfigSetMessageHandler OverseerConfigSetMessageHandler.processMessage : delete , {
[junit4] 2> "name":"configSet1",
[junit4] 2> "operation":"configsets:delete"}
[junit4] 2> 399315 ERROR (OverseerThreadFactory-960-thread-5-processing-n:127.0.0.1:42267_solr) [n:127.0.0.1:42267_solr ] o.a.s.c.OverseerConfigSetMessageHandler ConfigSet: configSet1 operation: delete failed:org.apache.solr.common.SolrException: ConfigSet does not exist to delete: configSet1
[junit4] 2> at org.apache.solr.cloud.OverseerConfigSetMessageHandler.deleteConfigSet(OverseerConfigSetMessageHandler.java:351)
[junit4] 2> at org.apache.solr.cloud.OverseerConfigSetMessageHandler.deleteConfigSet(OverseerConfigSetMessageHandler.java:345)
[junit4] 2> at org.apache.solr.cloud.OverseerConfigSetMessageHandler.processMessage(OverseerConfigSetMessageHandler.java:115)
[junit4] 2> at org.apache.solr.cloud.OverseerTaskProcessor$Runner.run(OverseerTaskProcessor.java:443)
[junit4] 2> at org.apache.solr.common.util.ExecutorUtil$MDCAwareThreadPoolExecutor$1.run(ExecutorUtil.java:210)
[junit4] 2> at java.util.concurrent.ThreadPoolExecutor.runWorker(ThreadPoolExecutor.java:1145)
[junit4] 2> at java.util.concurrent.ThreadPoolExecutor$Worker.run(ThreadPoolExecutor.java:615)
[junit4] 2> at java.lang.Thread.run(Thread.java:745)
[junit4] 2>
[junit4] 2> 399316 INFO (OverseerThreadFactory-960-thread-4-processing-n:127.0.0.1:42267_solr) [n:127.0.0.1:42267_solr ] o.a.s.c.c.ZkConfigManager Copying zk node /configs/grandBaseConfigSet1/schema.xml to /configs/baseConfigSet1/schema.xml
[junit4] 2> 399316 INFO (qtp27983095-2386) [n:127.0.0.1:42267_solr ] o.a.s.h.a.ConfigSetsHandler Invoked ConfigSet Action :create with params version=2&name=configSet1&baseConfigSet=baseConfigSet1&action=CREATE&wt=javabin
[junit4] 2> 399316 INFO (OverseerThreadFactory-960-thread-5-processing-n:127.0.0.1:42267_solr) [n:127.0.0.1:42267_solr ] o.a.s.c.OverseerTaskProcessor Overseer ConfigSet Message Handler: Message id:/overseer/collection-queue-work/qn-0000000023 complete, response:{Operation delete caused exception:=org.apache.solr.common.SolrException: ConfigSet does not exist to delete: configSet1,exception={msg=ConfigSet does not exist to delete: configSet1,rspCode=400}}
[junit4] 2> 399317 INFO (OverseerThreadFactory-960-thread-4-processing-n:127.0.0.1:42267_solr) [n:127.0.0.1:42267_solr ] o.a.s.c.c.SolrZkClient makePath: /configs/baseConfigSet1/schema.xml
[junit4] 2> 399317 INFO (zkCallback-343-thread-1-processing-n:127.0.0.1:42267_solr) [n:127.0.0.1:42267_solr ] o.a.s.c.OverseerTaskQueue NodeDataChanged fired on path /overseer/collection-queue-work/qnr-0000000023 state SyncConnected
[junit4] 2> 399318 INFO (OverseerThreadFactory-960-thread-4-processing-n:127.0.0.1:42267_solr) [n:127.0.0.1:42267_solr ] o.a.s.c.c.ZkConfigManager Copying zk node /configs/grandBaseConfigSet1/solrconfig.xml to /configs/baseConfigSet1/solrconfig.xml
[junit4] 2> 399319 INFO (OverseerThreadFactory-960-thread-4-processing-n:127.0.0.1:42267_solr) [n:127.0.0.1:42267_solr ] o.a.s.c.c.SolrZkClient makePath: /configs/baseConfigSet1/solrconfig.xml
[junit4] 2> 399319 INFO (qtp27983095-2387) [n:127.0.0.1:42267_solr ] o.a.s.s.SolrDispatchFilter [admin] webapp=null path=/admin/configs params={version=2&name=configSet1&action=DELETE&wt=javabin} status=400 QTime=6
[junit4] 2> 399320 INFO (OverseerThreadFactory-960-thread-4-processing-n:127.0.0.1:42267_solr) [n:127.0.0.1:42267_solr ] o.a.s.c.OverseerTaskProcessor Overseer ConfigSet Message Handler: Message id:/overseer/collection-queue-work/qn-0000000020 complete, response:{}
[junit4] 2> 399320 INFO (OverseerCollectionConfigSetProcessor-94429427546324995-127.0.0.1:42267_solr-n_0000000000) [n:127.0.0.1:42267_solr ] o.a.s.c.OverseerTaskProcessor Overseer ConfigSet Message Handler: Get the message id:/overseer/collection-queue-work/qn-0000000022 message:{
[junit4] 2> "name":"baseConfigSet1",
[junit4] 2> "operation":"configsets:delete"}
[junit4] 2> 399320 INFO (OverseerThreadFactory-960-thread-4-processing-n:127.0.0.1:42267_solr) [n:127.0.0.1:42267_solr ] o.a.s.c.OverseerConfigSetMessageHandler OverseerConfigSetMessageHandler.processMessage : delete , {
[junit4] 2> "name":"baseConfigSet1",
[junit4] 2> "operation":"configsets:delete"}
[junit4] 2> 399321 INFO (OverseerThreadFactory-960-thread-4-processing-n:127.0.0.1:42267_solr) [n:127.0.0.1:42267_solr ] o.a.s.c.OverseerConfigSetMessageHandler no existing ConfigSet properties found
[junit4] 2> 399321 INFO (qtp27983095-2416) [n:127.0.0.1:42267_solr ] o.a.s.h.a.ConfigSetsHandler Invoked ConfigSet Action :delete with params version=2&name=configSet1&action=DELETE&wt=javabin
[junit4] 2> 399322 INFO (zkCallback-343-thread-1-processing-n:127.0.0.1:42267_solr) [n:127.0.0.1:42267_solr ] o.a.s.c.OverseerTaskQueue NodeDataChanged fired on path /overseer/collection-queue-work/qnr-0000000020 state SyncConnected
[junit4] 2> 399323 INFO (OverseerThreadFactory-960-thread-4-processing-n:127.0.0.1:42267_solr) [n:127.0.0.1:42267_solr ] o.a.s.c.OverseerTaskProcessor Overseer ConfigSet Message Handler: Message id:/overseer/collection-queue-work/qn-0000000022 complete, response:{}
[junit4] 2> 399324 INFO (qtp27983095-2385) [n:127.0.0.1:42267_solr ] o.a.s.s.SolrDispatchFilter [admin] webapp=null path=/admin/configs params={version=2&name=baseConfigSet1&baseConfigSet=grandBaseConfigSet1&action=CREATE&wt=javabin} status=0 QTime=21
[junit4] 2> 399325 INFO (zkCallback-343-thread-1-processing-n:127.0.0.1:42267_solr) [n:127.0.0.1:42267_solr ] o.a.s.c.OverseerTaskQueue NodeDataChanged fired on path /overseer/collection-queue-work/qnr-0000000022 state SyncConnected
[junit4] 2> 399326 INFO (qtp27983095-2418) [n:127.0.0.1:42267_solr ] o.a.s.s.SolrDispatchFilter [admin] webapp=null path=/admin/configs params={version=2&name=baseConfigSet1&action=DELETE&wt=javabin} status=0 QTime=13
[junit4] 2> 399326 INFO (qtp27983095-2387) [n:127.0.0.1:42267_solr ] o.a.s.h.a.ConfigSetsHandler Invoked ConfigSet Action :create with params version=2&name=baseConfigSet1&baseConfigSet=grandBaseConfigSet1&action=CREATE&wt=javabin
[junit4] 2> 399328 INFO (qtp27983095-2385) [n:127.0.0.1:42267_solr ] o.a.s.h.a.ConfigSetsHandler Invoked ConfigSet Action :delete with params version=2&name=baseConfigSet1&action=DELETE&wt=javabin
[junit4] 2> 399328 INFO (OverseerCollectionConfigSetProcessor-94429427546324995-127.0.0.1:42267_solr-n_0000000000) [n:127.0.0.1:42267_solr ] o.a.s.c.OverseerTaskProcessor Overseer ConfigSet Message Handler: Get the message id:/overseer/collection-queue-work/qn-0000000026 message:{
[junit4] 2> "name":"configSet1",
[junit4] 2> "baseConfigSet":"baseConfigSet1",
[junit4] 2> "operation":"configsets:create"}
[junit4] 2> 399328 INFO (OverseerThreadFactory-960-thread-4-processing-n:127.0.0.1:42267_solr) [n:127.0.0.1:42267_solr ] o.a.s.c.OverseerConfigSetMessageHandler OverseerConfigSetMessageHandler.processMessage : create , {
[junit4] 2> "name":"configSet1",
[junit4] 2> "baseConfigSet":"baseConfigSet1",
[junit4] 2> "operation":"configsets:create"}
[junit4] 2> 399329 ERROR (OverseerThreadFactory-960-thread-4-processing-n:127.0.0.1:42267_solr) [n:127.0.0.1:42267_solr ] o.a.s.c.OverseerConfigSetMessageHandler ConfigSet: configSet1 operation: create failed:org.apache.solr.common.SolrException: Base ConfigSet does not exist: baseConfigSet1
[junit4] 2> at org.apache.solr.cloud.OverseerConfigSetMessageHandler.createConfigSet(OverseerConfigSetMessageHandler.java:294)
[junit4] 2> at org.apache.solr.cloud.OverseerConfigSetMessageHandler.processMessage(OverseerConfigSetMessageHandler.java:112)
[junit4] 2> at org.apache.solr.cloud.OverseerTaskProcessor$Runner.run(OverseerTaskProcessor.java:443)
[junit4] 2> at org.apache.solr.common.util.ExecutorUtil$MDCAwareThreadPoolExecutor$1.run(ExecutorUtil.java:210)
[junit4] 2> at java.util.concurrent.ThreadPoolExecutor.runWorker(ThreadPoolExecutor.java:1145)
[junit4] 2> at java.util.concurrent.ThreadPoolExecutor$Worker.run(ThreadPoolExecutor.java:615)
[junit4] 2> at java.lang.Thread.run(Thread.java:745)
[junit4] 2>
[junit4] 2> 399330 INFO (OverseerThreadFactory-960-thread-4-processing-n:127.0.0.1:42267_solr) [n:127.0.0.1:42267_solr ] o.a.s.c.OverseerTaskProcessor Overseer ConfigSet Message Handler: Message id:/overseer/collection-queue-work/qn-0000000026 complete, response:{Operation create caused exception:=org.apache.solr.common.SolrException: Base ConfigSet does not exist: baseConfigSet1,exception={msg=Base ConfigSet does not exist: baseConfigSet1,rspCode=400}}
[junit4] 2> 399330 INFO (zkCallback-343-thread-1-processing-n:127.0.0.1:42267_solr) [n:127.0.0.1:42267_solr ] o.a.s.c.OverseerTaskQueue NodeDataChanged fired on path /overseer/collection-queue-work/qnr-0000000026 state SyncConnected
[junit4] 2> 399331 INFO (OverseerCollectionConfigSetProcessor-94429427546324995-127.0.0.1:42267_solr-n_0000000000) [n:127.0.0.1:42267_solr ] o.a.s.c.OverseerTaskProcessor Overseer ConfigSet Message Handler: Get the message id:/overseer/collection-queue-work/qn-0000000028 message:{
[junit4] 2> "name":"configSet1",
[junit4] 2> "operation":"configsets:delete"}
[junit4] 2> 399331 INFO (OverseerThreadFactory-960-thread-4-processing-n:127.0.0.1:42267_solr) [n:127.0.0.1:42267_solr ] o.a.s.c.OverseerConfigSetMessageHandler OverseerConfigSetMessageHandler.processMessage : delete , {
[junit4] 2> "name":"configSet1",
[junit4] 2> "operation":"configsets:delete"}
[junit4] 2> 399332 ERROR (OverseerThreadFactory-960-thread-4-processing-n:127.0.0.1:42267_solr) [n:127.0.0.1:42267_solr ] o.a.s.c.OverseerConfigSetMessageHandler ConfigSet: configSet1 operation: delete failed:org.apache.solr.common.SolrException: ConfigSet does not exist to delete: configSet1
[junit4] 2> at org.apache.solr.cloud.OverseerConfigSetMessageHandler.deleteConfigSet(OverseerConfigSetMessageHandler.java:351)
[junit4] 2> at org.apache.solr.cloud.OverseerConfigSetMessageHandler.deleteConfigSet(OverseerConfigSetMessageHandler.java:345)
[junit4] 2> at org.apache.solr.cloud.OverseerConfigSetMessageHandler.processMessage(OverseerConfigSetMessageHandler.java:115)
[junit4] 2> at org.apache.solr.cloud.OverseerTaskProcessor$Runner.run(OverseerTaskProcessor.java:443)
[junit4] 2> at org.apache.solr.common.util.ExecutorUtil$MDCAwareThreadPoolExecutor$1.run(ExecutorUtil.java:210)
[junit4] 2> at java.util.concurrent.ThreadPoolExecutor.runWorker(ThreadPoolExecutor.java:1145)
[junit4] 2> at java.util.concurrent.ThreadPoolExecutor$Worker.run(ThreadPoolExecutor.java:615)
[junit4] 2> at java.lang.Thread.run(Thread.java:745)
[junit4] 2>
[junit4] 2> 399332 INFO (qtp27983095-2386) [n:127.0.0.1:42267_solr ] o.a.s.s.SolrDispatchFilter [admin] webapp=null path=/admin/configs params={version=2&name=configSet1&baseConfigSet=baseConfigSet1&action=CREATE&wt=javabin} status=400 QTime=16
[junit4] 2> 399332 INFO (OverseerThreadFactory-960-thread-4-processing-n:127.0.0.1:42267_solr) [n:127.0.0.1:42267_solr ] o.a.s.c.OverseerTaskProcessor Overseer ConfigSet Message Handler: Message id:/overseer/collection-queue-work/qn-0000000028 complete, response:{Operation delete caused exception:=org.apache.solr.common.SolrException: ConfigSet does not exist to delete: configSet1,exception={msg=ConfigSet does not exist to delete: configSet1,rspCode=400}}
[junit4] 2> 399333 INFO (zkCallback-343-thread-1-processing-n:127.0.0.1:42267_solr) [n:127.0.0.1:42267_solr ] o.a.s.c.OverseerTaskQueue NodeDataChanged fired on path /overseer/collection-queue-work/qnr-0000000028 state SyncConnected
[junit4] 2> 399334 INFO (qtp27983095-2418) [n:127.0.0.1:42267_solr ] o.a.s.h.a.ConfigSetsHandler Invoked ConfigSet Action :create with params version=2&name=configSet1&baseConfigSet=baseConfigSet1&action=CREATE&wt=javabin
[junit4] 2> 399335 INFO (OverseerCollectionConfigSetProcessor-94429427546324995-127.0.0.1:42267_solr-n_0000000000) [n:127.0.0.1:42267_solr ] o.a.s.c.OverseerTaskProcessor Overseer ConfigSet Message Handler: Get the message id:/overseer/collection-queue-work/qn-0000000030 message:{
[junit4] 2> "name":"baseConfigSet1",
[junit4] 2> "baseConfigSet":"grandBaseConfigSet1",
[junit4] 2> "operation":"configsets:create"}
[junit4] 2> 399335 INFO (OverseerThreadFactory-960-thread-4-processing-n:127.0.0.1:42267_solr) [n:127.0.0.1:42267_solr ] o.a.s.c.OverseerConfigSetMessageHandler OverseerConfigSetMessageHandler.processMessage : create , {
[junit4] 2> "name":"baseConfigSet1",
[junit4] 2> "baseConfigSet":"grandBaseConfigSet1",
[junit4] 2> "operation":"configsets:create"}
[junit4] 2> 399335 INFO (qtp27983095-2416) [n:127.0.0.1:42267_solr ] o.a.s.s.SolrDispatchFilter [admin] webapp=null path=/admin/configs params={version=2&name=configSet1&action=DELETE&wt=javabin} status=400 QTime=14
[junit4] 2> 399337 INFO (OverseerThreadFactory-960-thread-4-processing-n:127.0.0.1:42267_solr) [n:127.0.0.1:42267_solr ] o.a.s.c.c.ZkConfigManager Copying zk node /configs/grandBaseConfigSet1/schema.xml to /configs/baseConfigSet1/schema.xml
[junit4] 2> 399337 INFO (OverseerThreadFactory-960-thread-4-processing-n:127.0.0.1:42267_solr) [n:127.0.0.1:42267_solr ] o.a.s.c.c.SolrZkClient makePath: /configs/baseConfigSet1/schema.xml
[junit4] 2> 399337 INFO (qtp27983095-2386) [n:127.0.0.1:42267_solr ] o.a.s.h.a.ConfigSetsHandler Invoked ConfigSet Action :delete with params version=2&name=configSet1&action=DELETE&wt=javabin
[junit4] 2> 399338 INFO (OverseerThreadFactory-960-thread-4-processing-n:127.0.0.1:42267_solr) [n:127.0.0.1:42267_solr ] o.a.s.c.c.ZkConfigManager Copying zk node /configs/grandBaseConfigSet1/solrconfig.xml to /configs/baseConfigSet1/solrconfig.xml
[junit4] 2> 399339 INFO (OverseerThreadFactory-960-thread-4-processing-n:127.0.0.1:42267_solr) [n:127.0.0.1:42267_solr ] o.a.s.c.c.SolrZkClient makePath: /configs/baseConfigSet1/solrconfig.xml
[junit4] 2> 399340 INFO (OverseerThreadFactory-960-thread-4-processing-n:127.0.0.1:42267_solr) [n:127.0.0.1:42267_solr ] o.a.s.c.OverseerTaskProcessor Overseer ConfigSet Message Handler: Message id:/overseer/collection-queue-work/qn-0000000030 complete, response:{}
[junit4] 2> 399340 INFO (OverseerCollectionConfigSetProcessor-94429427546324995-127.0.0.1:42267_solr-n_0000000000) [n:127.0.0.1:42267_solr ] o.a.s.c.OverseerTaskProcessor Overseer ConfigSet Message Handler: Get the message id:/overseer/collection-queue-work/qn-0000000032 message:{
[junit4] 2> "name":"baseConfigSet1",
[junit4] 2> "operation":"configsets:delete"}
[junit4] 2> 399340 INFO (OverseerThreadFactory-960-thread-4-processing-n:127.0.0.1:42267_solr) [n:127.0.0.1:42267_solr ] o.a.s.c.OverseerConfigSetMessageHandler OverseerConfigSetMessageHandler.processMessage : delete , {
[junit4] 2> "name":"baseConfigSet1",
[junit4] 2> "operation":"configsets:delete"}
[junit4] 2> 399340 INFO (OverseerThreadFactory-960-thread-4-processing-n:127.0.0.1:42267_solr) [n:127.0.0.1:42267_solr ] o.a.s.c.OverseerConfigSetMessageHandler no existing ConfigSet properties found
[junit4] 2> 399341 INFO (zkCallback-343-thread-1-processing-n:127.0.0.1:42267_solr) [n:127.0.0.1:42267_solr ] o.a.s.c.OverseerTaskQueue NodeDataChanged fired on path /overseer/collection-queue-work/qnr-0000000030 state SyncConnected
[junit4] 2> 399341 INFO (qtp27983095-2387) [n:127.0.0.1:42267_solr ] o.a.s.s.SolrDispatchFilter [admin] webapp=null path=/admin/configs params={version=2&name=baseConfigSet1&baseConfigSet=grandBaseConfigSet1&action=CREATE&wt=javabin} status=0 QTime=15
[junit4] 2> 399342 INFO (OverseerThreadFactory-960-thread-4-processing-n:127.0.0.1:42267_solr) [n:127.0.0.1:42267_solr ] o.a.s.c.OverseerTaskProcessor Overseer ConfigSet Message Handler: Message id:/overseer/collection-queue-work/qn-0000000032 complete, response:{}
[junit4] 2> 399342 INFO (zkCallback-343-thread-1-processing-n:127.0.0.1:42267_solr) [n:127.0.0.1:42267_solr ] o.a.s.c.OverseerTaskQueue NodeDataChanged fired on path /overseer/collection-queue-work/qnr-0000000032 state SyncConnected
[junit4] 2> 399343 INFO (qtp27983095-2385) [n:127.0.0.1:42267_solr ] o.a.s.s.SolrDispatchFilter [admin] webapp=null path=/admin/configs params={version=2&name=baseConfigSet1&action=DELETE&wt=javabin} status=0 QTime=15
[junit4] 2> 399343 INFO (qtp27983095-2416) [n:127.0.0.1:42267_solr ] o.a.s.h.a.ConfigSetsHandler Invoked ConfigSet Action :create with params version=2&name=baseConfigSet1&baseConfigSet=grandBaseConfigSet1&action=CREATE&wt=javabin
[junit4] 2> 399344 INFO (OverseerCollectionConfigSetProcessor-94429427546324995-127.0.0.1:42267_solr-n_0000000000) [n:127.0.0.1:42267_solr ] o.a.s.c.OverseerTaskProcessor Overseer ConfigSet Message Handler: Get the message id:/overseer/collection-queue-work/qn-0000000034 message:{
[junit4] 2> "name":"configSet1",
[junit4] 2> "baseConfigSet":"baseConfigSet1",
[junit4] 2> "operation":"configsets:create"}
[junit4] 2> 399344 INFO (OverseerThreadFactory-960-thread-4-processing-n:127.0.0.1:42267_solr) [n:127.0.0.1:42267_solr ] o.a.s.c.OverseerConfigSetMessageHandler OverseerConfigSetMessageHandler.processMessage : create , {
[junit4] 2> "name":"configSet1",
[junit4] 2> "baseConfigSet":"baseConfigSet1",
[junit4] 2> "operation":"configsets:create"}
[junit4] 2> 399344 ERROR (OverseerThreadFactory-960-thread-4-processing-n:127.0.0.1:42267_solr) [n:127.0.0.1:42267_solr ] o.a.s.c.OverseerConfigSetMessageHandler ConfigSet: configSet1 operation: create failed:org.apache.solr.common.SolrException: Base ConfigSet does not exist: baseConfigSet1
[junit4] 2> at org.apache.solr.cloud.OverseerConfigSetMessageHandler.createConfigSet(OverseerConfigSetMessageHandler.java:294)
[junit4] 2> at org.apache.solr.cloud.OverseerConfigSetMessageHandler.processMessage(OverseerConfigSetMessageHandler.java:112)
[junit4] 2> at org.apache.solr.cloud.OverseerTaskProcessor$Runner.run(OverseerTaskProcessor.java:443)
[junit4] 2> at org.apache.solr.common.util.ExecutorUtil$MDCAwareThreadPoolExecutor$1.run(ExecutorUtil.java:210)
[junit4] 2> at java.util.concurrent.ThreadPoolExecutor.runWorker(ThreadPoolExecutor.java:1145)
[junit4] 2> at java.util.concurrent.ThreadPoolExecutor$Worker.run(ThreadPoolExecutor.java:615)
[junit4] 2> at java.lang.Thread.run(Thread.java:745)
[junit4] 2>
[junit4] 2> 399345 INFO (qtp27983095-2387) [n:127.0.0.1:42267_solr ] o.a.s.h.a.ConfigSetsHandler Invoked ConfigSet Action :delete with params version=2&name=baseConfigSet1&action=DELETE&wt=javabin
[junit4] 2> 399345 INFO (OverseerThreadFactory-960-thread-4-processing-n:127.0.0.1:42267_solr) [n:127.0.0.1:42267_solr ] o.a.s.c.OverseerTaskProcessor Overseer ConfigSet Message Handler: Message id:/overseer/collection-queue-work/qn-0000000034 complete, response:{Operation create caused exception:=org.apache.solr.common.SolrException: Base ConfigSet does not exist: baseConfigSet1,exception={msg=Base ConfigSet does not exist: baseConfigSet1,rspCode=400}}
[junit4] 2> 399346 INFO (zkCallback-343-thread-1-processing-n:127.0.0.1:42267_solr) [n:127.0.0.1:42267_solr ] o.a.s.c.OverseerTaskQueue NodeDataChanged fired on path /overseer/collection-queue-work/qnr-0000000034 state SyncConnected
[junit4] 2> 399347 INFO (OverseerCollectionConfigSetProcessor-94429427546324995-127.0.0.1:42267_solr-n_0000000000) [n:127.0.0.1:42267_solr ] o.a.s.c.OverseerTaskProcessor Overseer ConfigSet Message Handler: Get the message id:/overseer/collection-queue-work/qn-0000000036 message:{
[junit4] 2> "name":"configSet1",
[junit4] 2> "operation":"configsets:delete"}
[junit4] 2> 399348 INFO (qtp27983095-2418) [n:127.0.0.1:42267_solr ] o.a.s.s.SolrDispatchFilter [admin] webapp=null path=/admin/configs params={version=2&name=configSet1&baseConfigSet=baseConfigSet1&action=CREATE&wt=javabin} status=400 QTime=13
[junit4] 2> 399348 INFO (OverseerThreadFactory-960-thread-4-processing-n:127.0.0.1:42267_solr) [n:127.0.0.1:42267_solr ] o.a.s.c.OverseerConfigSetMessageHandler OverseerConfigSetMessageHandler.processMessage : delete , {
[junit4] 2> "name":"configSet1",
[junit4] 2> "operation":"configsets:delete"}
[junit4] 2> 399349 ERROR (OverseerThreadFactory-960-thread-4-processing-n:127.0.0.1:42267_solr) [n:127.0.0.1:42267_solr ] o.a.s.c.OverseerConfigSetMessageHandler ConfigSet: configSet1 operation: delete failed:org.apache.solr.common.SolrException: ConfigSet does not exist to delete: configSet1
[junit4] 2> at org.apache.solr.cloud.OverseerConfigSetMessageHandler.deleteConfigSet(OverseerConfigSetMessageHandler.java:351)
[junit4] 2> at org.apache.solr.cloud.OverseerConfigSetMessageHandler.deleteConfigSet(OverseerConfigSetMessageHandler.java:345)
[junit4] 2> at org.apache.solr.cloud.OverseerConfigSetMessageHandler.processMessage(OverseerConfigSetMessageHandler.java:115)
[junit4] 2> at org.apache.solr.cloud.OverseerTaskProcessor$Runner.run(OverseerTaskProcessor.java:443)
[junit4] 2> at org.apache.solr.common.util.ExecutorUtil$MDCAwareThreadPoolExecutor$1.run(ExecutorUtil.java:210)
[junit4] 2> at java.util.concurrent.ThreadPoolExecutor.runWorker(ThreadPoolExecutor.java:1145)
[junit4] 2> at java.util.concurrent.ThreadPoolExecutor$Worker.run(ThreadPoolExecutor.java:615)
[junit4] 2> at java.lang.Thread.run(Thread.java:745)
[junit4] 2>
[junit4] 2> 399350 INFO (OverseerThreadFactory-960-thread-4-processing-n:127.0.0.1:42267_solr) [n:127.0.0.1:42267_solr ] o.a.s.c.OverseerTaskProcessor Overseer ConfigSet Message Handler: Message id:/overseer/collection-queue-work/qn-0000000036 complete, response:{Operation delete caused exception:=org.apache.solr.common.SolrException: ConfigSet does not exist to delete: configSet1,exception={msg=ConfigSet does not exist to delete: configSet1,rspCode=400}}
[junit4] 2> 399350 INFO (qtp27983095-2385) [n:127.0.0.1:42267_solr ] o.a.s.h.a.ConfigSetsHandler Invoked ConfigSet Action :create with params version=2&name=configSet1&baseConfigSet=baseConfigSet1&action=CREATE&wt=javabin
[junit4] 2> 399350 INFO (zkCallback-343-thread-1-processing-n:127.0.0.1:42267_solr) [n:127.0.0.1:42267_solr ] o.a.s.c.OverseerTaskQueue NodeDataChanged fired on path /overseer/collection-queue-work/qnr-0000000036 state SyncConnected
[junit4] 2> 399352 INFO (qtp27983095-2386) [n:127.0.0.1:42267_solr ] o.a.s.s.SolrDispatchFilter [admin] webapp=null path=/admin/configs params={version=2&name=configSet1&action=DELETE&wt=javabin} status=400 QTime=14
[junit4] 2> 399353 INFO (OverseerCollectionConfigSetProcessor-94429427546324995-127.0.0.1:42267_solr-n_0000000000) [n:127.0.0.1:42267_solr ] o.a.s.c.OverseerTaskProcessor Overseer ConfigSet Message Handler: Get the message id:/overseer/collection-queue-work/qn-0000000038 message:{
[junit4] 2> "name":"baseConfigSet1",
[junit4] 2> "baseConfigSet":"grandBaseConfigSet1",
[junit4] 2> "operation":"configsets:create"}
[junit4] 2> 399353 INFO (OverseerThreadFactory-960-thread-4-processing-n:127.0.0.1:42267_solr) [n:127.0.0.1:42267_solr ] o.a.s.c.OverseerConfigSetMessageHandler OverseerConfigSetMessageHandler.processMessage : create , {
[junit4] 2> "name":"baseConfigSet1",
[junit4] 2> "baseConfigSet":"grandBaseConfigSet1",
[junit4] 2> "operation":"configsets:create"}
[junit4] 2> 399354 INFO (OverseerThreadFactory-960-thread-4-processing-n:127.0.0.1:42267_solr) [n:127.0.0.1:42267_solr ] o.a.s.c.c.ZkConfigManager Copying zk node /configs/grandBaseConfigSet1/schema.xml to /configs/baseConfigSet1/schema.xml
[junit4] 2> 399354 INFO (qtp27983095-2418) [n:127.0.0.1:42267_solr ] o.a.s.h.a.ConfigSetsHandler Invoked ConfigSet Action :delete with params version=2&name=configSet1&action=DELETE&wt=javabin
[junit4] 2> 399354 INFO (OverseerThreadFactory-960-thread-4-processing-n:127.0.0.1:42267_solr) [n:127.0.0.1:42267_solr ] o.a.s.c.c.SolrZkClient makePath: /configs/baseConfigSet1/schema.xml
[junit4] 2> 399356 INFO (OverseerThreadFactory-960-thread-4-processing-n:127.0.0.1:42267_solr) [n:127.0.0.1:42267_solr ] o.a.s.c.c.ZkConfigManager Copying zk node /configs/grandBaseConfigSet1/solrconfig.xml to /configs/baseConfigSet1/solrconfig.xml
[junit4] 2> 399356 INFO (OverseerThreadFactory-960-thread-4-processing-n:127.0.0.1:42267_solr) [n:127.0.0.1:42267_solr ] o.a.s.c.c.SolrZkClient makePath: /configs/baseConfigSet1/solrconfig.xml
[junit4] 2> 399357 INFO (OverseerThreadFactory-960-thread-4-processing-n:127.0.0.1:42267_solr) [n:127.0.0.1:42267_solr ] o.a.s.c.OverseerTaskProcessor Overseer ConfigSet Message Handler: Message id:/overseer/collection-queue-work/qn-0000000038 complete, response:{}
[junit4] 2> 399358 INFO (zkCallback-343-thread-1-processing-n:127.0.0.1:42267_solr) [n:127.0.0.1:42267_solr ] o.a.s.c.OverseerTaskQueue NodeDataChanged fired on path /overseer/collection-queue-work/qnr-0000000038 state SyncConnected
[junit4] 2> 399358 INFO (qtp27983095-2416) [n:127.0.0.1:42267_solr ] o.a.s.s.SolrDispatchFilter [admin] webapp=null path=/admin/configs params={version=2&name=baseConfigSet1&baseConfigSet=grandBaseConfigSet1&action=CREATE&wt=javabin} status=0 QTime=15
[junit4] 2> 399359 INFO (OverseerCollectionConfigSetProcessor-94429427546324995-127.0.0.1:42267_solr-n_0000000000) [n:127.0.0.1:42267_solr ] o.a.s.c.OverseerTaskProcessor Overseer ConfigSet Message Handler: Get the message id:/overseer/collection-queue-work/qn-0000000040 message:{
[junit4] 2> "name":"baseConfigSet1",
[junit4] 2> "operation":"configsets:delete"}
[junit4] 2> 399360 INFO (OverseerThreadFactory-960-thread-4-processing-n:127.0.0.1:42267_solr) [n:127.0.0.1:42267_solr ] o.a.s.c.OverseerConfigSetMessageHandler OverseerConfigSetMessageHandler.processMessage : delete , {
[junit4] 2> "name":"baseConfigSet1",
[junit4] 2> "operation":"configsets:delete"}
[junit4] 2> 399360 INFO (OverseerThreadFactory-960-thread-4-processing-n:127.0.0.1:42267_solr) [n:127.0.0.1:42267_solr ] o.a.s.c.OverseerConfigSetMessageHandler no existing ConfigSet properties found
[junit4] 2> 399360 INFO (qtp27983095-2386) [n:127.0.0.1:42267_solr ] o.a.s.h.a.ConfigSetsHandler Invoked ConfigSet Action :create with params version=2&name=baseConfigSet1&baseConfigSet=grandBaseConfigSet1&action=CREATE&wt=javabin
[junit4] 2> 399362 INFO (OverseerThreadFactory-960-thread-4-processing-n:127.0.0.1:42267_solr) [n:127.0.0.1:42267_solr ] o.a.s.c.OverseerTaskProcessor Overseer ConfigSet Message Handler: Message id:/overseer/collection-queue-work/qn-0000000040 complete, response:{}
[junit4] 2> 399362 INFO (OverseerCollectionConfigSetProcessor-94429427546324995-127.0.0.1:42267_solr-n_0000000000) [n:127.0.0.1:42267_solr ] o.a.s.c.OverseerTaskProcessor Overseer ConfigSet Message Handler: Get the message id:/overseer/collection-queue-work/qn-0000000042 message:{
[junit4] 2> "name":"configSet1",
[junit4] 2> "baseConfigSet":"baseConfigSet1",
[junit4] 2> "operation":"configsets:create"}
[junit4] 2> 399362 INFO (OverseerThreadFactory-960-thread-4-processing-n:127.0.0.1:42267_solr) [n:127.0.0.1:42267_solr ] o.a.s.c.OverseerConfigSetMessageHandler OverseerConfigSetMessageHandler.processMessage : create , {
[junit4] 2> "name":"configSet1",
[junit4] 2> "baseConfigSet":"baseConfigSet1",
[junit4] 2> "operation":"configsets:create"}
[junit4] 2> 399363 ERROR (OverseerThreadFactory-960-thread-4-processing-n:127.0.0.1:42267_solr) [n:127.0.0.1:42267_solr ] o.a.s.c.OverseerConfigSetMessageHandler ConfigSet: configSet1 operation: create failed:org.apache.solr.common.SolrException: Base ConfigSet does not exist: baseConfigSet1
[junit4] 2> at org.apache.solr.cloud.OverseerConfigSetMessageHandler.createConfigSet(OverseerConfigSetMessageHandler.java:294)
[junit4] 2> at org.apache.solr.cloud.OverseerConfigSetMessageHandler.processMessage(OverseerConfigSetMessageHandler.java:112)
[junit4] 2> at org.apache.solr.cloud.OverseerTaskProcessor$Runner.run(OverseerTaskProcessor.java:443)
[junit4] 2> at org.apache.solr.common.util.ExecutorUtil$MDCAwareThreadPoolExecutor$1.run(ExecutorUtil.java:210)
[junit4] 2> at java.util.concurrent.ThreadPoolExecutor.runWorker(ThreadPoolExecutor.java:1145)
[junit4] 2> at java.util.concurrent.ThreadPoolExecutor$Worker.run(ThreadPoolExecutor.java:615)
[junit4] 2> at java.lang.Thread.run(Thread.java:745)
[junit4] 2>
[junit4] 2> 399363 INFO (zkCallback-343-thread-1-processing-n:127.0.0.1:42267_solr) [n:127.0.0.1:42267_solr ] o.a.s.c.OverseerTaskQueue NodeDataChanged fired on path /overseer/collection-queue-work/qnr-0000000040 state SyncConnected
[junit4] 2> 399364 INFO (OverseerThreadFactory-960-thread-4-processing-n:127.0.0.1:42267_solr) [n:127.0.0.1:42267_solr ] o.a.s.c.OverseerTaskProcessor Overseer ConfigSet Message Handler: Message id:/overseer/collection-queue-work/qn-0000000042 complete, response:{Operation create caused exception:=org.apache.solr.common.SolrException: Base ConfigSet does not exist: baseConfigSet1,exception={msg=Base ConfigSet does not exist: baseConfigSet1,rspCode=400}}
[junit4] 2> 399364 INFO (qtp27983095-2387) [n:127.0.0.1:42267_solr ] o.a.s.s.SolrDispatchFilter [admin] webapp=null path=/admin/configs params={version=2&name=baseConfigSet1&action=DELETE&wt=javabin} status=0 QTime=19
[junit4] 2> 399365 INFO (zkCallback-343-thread-1-processing-n:127.0.0.1:42267_solr) [n:127.0.0.1:42267_solr ] o.a.s.c.OverseerTaskQueue NodeDataChanged fired on path /overseer/collection-queue-work/qnr-0000000042 state SyncConnected
[junit4] 2> 399366 INFO (OverseerCollectionConfigSetProcessor-94429427546324995-127.0.0.1:42267_solr-n_0000000000) [n:127.0.0.1:42267_solr ] o.a.s.c.OverseerTaskProcessor Overseer ConfigSet Message Handler: Get the message id:/overseer/collection-queue-work/qn-0000000044 message:{
[junit4] 2> "name":"configSet1",
[junit4] 2> "operation":"configsets:delete"}
[junit4] 2> 399366 INFO (OverseerThreadFactory-960-thread-4-processing-n:127.0.0.1:42267_solr) [n:127.0.0.1:42267_solr ] o.a.s.c.OverseerConfigSetMessageHandler OverseerConfigSetMessageHandler.processMessage : delete , {
[junit4] 2> "name":"configSet1",
[junit4] 2> "operation":"configsets:delete"}
[junit4] 2> 399366 INFO (OverseerCollectionConfigSetProcessor-94429427546324995-127.0.0.1:42267_solr-n_0000000000) [n:127.0.0.1:42267_solr ] o.a.s.c.OverseerTaskProcessor Overseer ConfigSet Message Handler: Get the message id:/overseer/collection-queue-work/qn-0000000046 message:{
[junit4] 2> "name":"baseConfigSet1",
[junit4] 2> "baseConfigSet":"grandBaseConfigSet1",
[junit4] 2> "operation":"configsets:create"}
[junit4] 2> 399366 INFO (qtp27983095-2416) [n:127.0.0.1:42267_solr ] o.a.s.h.a.ConfigSetsHandler Invoked ConfigSet Action :delete with params version=2&name=baseConfigSet1&action=DELETE&wt=javabin
[junit4] 2> 399366 INFO (OverseerThreadFactory-960-thread-5-processing-n:127.0.0.1:42267_solr) [n:127.0.0.1:42267_solr ] o.a.s.c.OverseerConfigSetMessageHandler OverseerConfigSetMessageHandler.processMessage : create , {
[junit4] 2> "name":"baseConfigSet1",
[junit4] 2> "baseConfigSet":"grandBaseConfigSet1",
[junit4] 2> "operation":"configsets:create"}
[junit4] 2> 399366 INFO (qtp27983095-2385) [n:127.0.0.1:42267_solr ] o.a.s.s.SolrDispatchFilter [admin] webapp=null path=/admin/configs params={version=2&name=configSet1&baseConfigSet=baseConfigSet1&action=CREATE&wt=javabin} status=400 QTime=16
[junit4] 2> 399366 ERROR (OverseerThreadFactory-960-thread-4-processing-n:127.0.0.1:42267_solr) [n:127.0.0.1:42267_solr ] o.a.s.c.OverseerConfigSetMessageHandler ConfigSet: configSet1 operation: delete failed:org.apache.solr.common.SolrException: ConfigSet does not exist to delete: configSet1
[junit4] 2> at org.apache.solr.cloud.OverseerConfigSetMessageHandler.deleteConfigSet(OverseerConfigSetMessageHandler.java:351)
[junit4] 2> at org.apache.solr.cloud.OverseerConfigSetMessageHandler.deleteConfigSet(OverseerConfigSetMessageHandler.java:345)
[junit4] 2> at org.apache.solr.cloud.OverseerConfigSetMessageHandler.processMessage(OverseerConfigSetMessageHandler.java:115)
[junit4] 2> at org.apache.solr.cloud.OverseerTaskProcessor$Runner.run(OverseerTaskProcessor.java:443)
[junit4] 2> at org.apache.solr.common.util.ExecutorUtil$MDCAwareThreadPoolExecutor$1.run(ExecutorUtil.java:210)
[junit4] 2> at java.util.concurrent.ThreadPoolExecutor.runWorker(ThreadPoolExecutor.java:1145)
[junit4] 2> at java.util.concurrent.ThreadPoolExecutor$Worker.run(ThreadPoolExecutor.java:615)
[junit4] 2> at java.lang.Thread.run(Thread.java:745)
[junit4] 2>
[junit4] 2> 399368 INFO (OverseerThreadFactory-960-thread-4-processing-n:127.0.0.1:42267_solr) [n:127.0.0.1:42267_solr ] o.a.s.c.OverseerTaskProcessor Overseer ConfigSet Message Handler: Message id:/overseer/collection-queue-work/qn-0000000044 complete, response:{Operation delete caused exception:=org.apache.solr.common.SolrException: ConfigSet does not exist to delete: configSet1,exception={msg=ConfigSet does not exist to delete: configSet1,rspCode=400}}
[junit4] 2> 399368 INFO (OverseerThreadFactory-960-thread-5-processing-n:127.0.0.1:42267_solr) [n:127.0.0.1:42267_solr ] o.a.s.c.c.ZkConfigManager Copying zk node /configs/grandBaseConfigSet1/schema.xml to /configs/baseConfigSet1/schema.xml
[junit4] 2> 399368 INFO (zkCallback-343-thread-1-processing-n:127.0.0.1:42267_solr) [n:127.0.0.1:42267_solr ] o.a.s.c.OverseerTaskQueue NodeDataChanged fired on path /overseer/collection-queue-work/qnr-0000000044 state SyncConnected
[junit4] 2> 399368 INFO (qtp27983095-2387) [n:127.0.0.1:42267_solr ] o.a.s.h.a.ConfigSetsHandler Invoked ConfigSet Action :create with params version=2&name=configSet1&baseConfigSet=baseConfigSet1&action=CREATE&wt=javabin
[junit4] 2> 399368 INFO (OverseerThreadFactory-960-thread-5-processing-n:127.0.0.1:42267_solr) [n:127.0.0.1:42267_solr ] o.a.s.c.c.SolrZkClient makePath: /configs/baseConfigSet1/schema.xml
[junit4] 2> 399370 INFO (qtp27983095-2418) [n:127.0.0.1:42267_solr ] o.a.s.s.SolrDispatchFilter [admin] webapp=null path=/admin/configs params={version=2&name=configSet1&action=DELETE&wt=javabin} status=400 QTime=15
[junit4] 2> 399371 INFO (OverseerThreadFactory-960-thread-5-processing-n:127.0.0.1:42267_solr) [n:127.0.0.1:42267_solr ] o.a.s.c.c.ZkConfigManager Copying zk node /configs/grandBaseConfigSet1/solrconfig.xml to /configs/baseConfigSet1/solrconfig.xml
[junit4] 2> 399372 INFO (OverseerThreadFactory-960-thread-5-processing-n:127.0.0.1:42267_solr) [n:127.0.0.1:42267_solr ] o.a.s.c.c.SolrZkClient makePath: /configs/baseConfigSet1/solrconfig.xml
[junit4] 2> 399372 INFO (qtp27983095-2385) [n:127.0.0.1:42267_solr ] o.a.s.h.a.ConfigSetsHandler Invoked ConfigSet Action :delete with params version=2&name=configSet1&action=DELETE&wt=javabin
[junit4] 2> 399373 INFO (OverseerThreadFactory-960-thread-5-processing-n:127.0.0.1:42267_solr) [n:127.0.0.1:42267_solr ] o.a.s.c.OverseerTaskProcessor Overseer ConfigSet Message Handler: Message id:/overseer/collection-queue-work/qn-0000000046 complete, response:{}
[junit4] 2> 399374 INFO (zkCallback-343-thread-1-processing-n:127.0.0.1:42267_solr) [n:127.0.0.1:42267_solr ] o.a.s.c.OverseerTaskQueue NodeDataChanged fired on path /overseer/collection-queue-work/qnr-0000000046 state SyncConnected
[junit4] 2> 399375 INFO (qtp27983095-2386) [n:127.0.0.1:42267_solr ] o.a.s.s.SolrDispatchFilter [admin] webapp=null path=/admin/configs params={version=2&name=baseConfigSet1&baseConfigSet=grandBaseConfigSet1&action=CREATE&wt=javabin} status=0 QTime=14
[junit4] 2> 399376 INFO (OverseerCollectionConfigSetProcessor-94429427546324995-127.0.0.1:42267_solr-n_0000000000) [n:127.0.0.1:42267_solr ] o.a.s.c.OverseerTaskProcessor Overseer ConfigSet Message Handler: Get the message id:/overseer/collection-queue-work/qn-0000000048 message:{
[junit4] 2> "name":"baseConfigSet1",
[junit4] 2> "operation":"configsets:delete"}
[junit4] 2> 399376 INFO (OverseerThreadFactory-960-thread-5-processing-n:127.0.0.1:42267_solr) [n:127.0.0.1:42267_solr ] o.a.s.c.OverseerConfigSetMessageHandler OverseerConfigSetMessageHandler.processMessage : delete , {
[junit4] 2> "name":"baseConfigSet1",
[junit4] 2> "operation":"configsets:delete"}
[junit4] 2> 399376 INFO (OverseerCollectionConfigSetProcessor-94429427546324995-127.0.0.1:42267_solr-n_0000000000) [n:127.0.0.1:42267_solr ] o.a.s.c.OverseerTaskProcessor Overseer ConfigSet Message Handler: Get the message id:/overseer/collection-queue-work/qn-0000000052 message:{
[junit4] 2> "name":"configSet1",
[junit4] 2> "operation":"configsets:delete"}
[junit4] 2> 399376 INFO (OverseerThreadFactory-960-thread-4-processing-n:127.0.0.1:42267_solr) [n:127.0.0.1:42267_solr ] o.a.s.c.OverseerConfigSetMessageHandler OverseerConfigSetMessageHandler.processMessage : delete , {
[junit4] 2> "name":"configSet1",
[junit4] 2> "operation":"configsets:delete"}
[junit4] 2> 399376 INFO (OverseerThreadFactory-960-thread-5-processing-n:127.0.0.1:42267_solr) [n:127.0.0.1:42267_solr ] o.a.s.c.OverseerConfigSetMessageHandler no existing ConfigSet properties found
[junit4] 2> 399376 ERROR (OverseerThreadFactory-960-thread-4-processing-n:127.0.0.1:42267_solr) [n:127.0.0.1:42267_solr ] o.a.s.c.OverseerConfigSetMessageHandler ConfigSet: configSet1 operation: delete failed:org.apache.solr.common.SolrException: ConfigSet does not exist to delete: configSet1
[junit4] 2> at org.apache.solr.cloud.OverseerConfigSetMessageHandler.deleteConfigSet(OverseerConfigSetMessageHandler.java:351)
[junit4] 2> at org.apache.solr.cloud.OverseerConfigSetMessageHandler.deleteConfigSet(OverseerConfigSetMessageHandler.java:345)
[junit4] 2> at org.apache.solr.cloud.OverseerConfigSetMessageHandler.processMessage(OverseerConfigSetMessageHandler.java:115)
[junit4] 2> at org.apache.solr.cloud.OverseerTaskProcessor$Runner.run(OverseerTaskProcessor.java:443)
[junit4] 2> at org.apache.solr.common.util.ExecutorUtil$MDCAwareThreadPoolExecutor$1.run(ExecutorUtil.java:210)
[junit4] 2> at java.util.concurrent.ThreadPoolExecutor.runWorker(ThreadPoolExecutor.java:1145)
[junit4] 2> at java.util.concurrent.ThreadPoolExecutor$Worker.run(ThreadPoolExecutor.java:615)
[junit4] 2> at java.lang.Thread.run(Thread.java:745)
[junit4] 2>
[junit4] 2> 399377 INFO (qtp27983095-2418) [n:127.0.0.1:42267_solr ] o.a.s.h.a.ConfigSetsHandler Invoked ConfigSet Action :create with params version=2&name=baseConfigSet1&baseConfigSet=grandBaseConfigSet1&action=CREATE&wt=javabin
[junit4] 2> 399377 INFO (OverseerThreadFactory-960-thread-4-processing-n:127.0.0.1:42267_solr) [n:127.0.0.1:42267_solr ] o.a.s.c.OverseerTaskProce
[...truncated too long message...]
Connection$2.run(AbstractConnection.java:540)
[junit4] 2> at org.eclipse.jetty.util.thread.QueuedThreadPool.runJob(QueuedThreadPool.java:635)
[junit4] 2> at org.eclipse.jetty.util.thread.QueuedThreadPool$3.run(QueuedThreadPool.java:555)
[junit4] 2> at java.lang.Thread.run(Thread.java:745)
[junit4] 2>
[junit4] 2> 699529 INFO (qtp27983095-2418) [n:127.0.0.1:42267_solr ] o.a.s.h.a.ConfigSetsHandler Invoked ConfigSet Action :delete with params version=2&name=configSet1&action=DELETE&wt=javabin
[junit4] 2> 699530 INFO (OverseerCollectionConfigSetProcessor-94429427546324995-127.0.0.1:42267_solr-n_0000000000) [n:127.0.0.1:42267_solr ] o.a.s.c.OverseerTaskProcessor Overseer ConfigSet Message Handler: Get the message id:/overseer/collection-queue-work/qn-0000000158 message:{
[junit4] 2> "name":"configSet1",
[junit4] 2> "operation":"configsets:delete"}
[junit4] 2> 699530 INFO (OverseerThreadFactory-960-thread-4-processing-n:127.0.0.1:42267_solr) [n:127.0.0.1:42267_solr ] o.a.s.c.OverseerConfigSetMessageHandler OverseerConfigSetMessageHandler.processMessage : delete , {
[junit4] 2> "name":"configSet1",
[junit4] 2> "operation":"configsets:delete"}
[junit4] 2> 699531 ERROR (OverseerThreadFactory-960-thread-4-processing-n:127.0.0.1:42267_solr) [n:127.0.0.1:42267_solr ] o.a.s.c.OverseerConfigSetMessageHandler ConfigSet: configSet1 operation: delete failed:org.apache.solr.common.SolrException: ConfigSet does not exist to delete: configSet1
[junit4] 2> at org.apache.solr.cloud.OverseerConfigSetMessageHandler.deleteConfigSet(OverseerConfigSetMessageHandler.java:351)
[junit4] 2> at org.apache.solr.cloud.OverseerConfigSetMessageHandler.deleteConfigSet(OverseerConfigSetMessageHandler.java:345)
[junit4] 2> at org.apache.solr.cloud.OverseerConfigSetMessageHandler.processMessage(OverseerConfigSetMessageHandler.java:115)
[junit4] 2> at org.apache.solr.cloud.OverseerTaskProcessor$Runner.run(OverseerTaskProcessor.java:443)
[junit4] 2> at org.apache.solr.common.util.ExecutorUtil$MDCAwareThreadPoolExecutor$1.run(ExecutorUtil.java:210)
[junit4] 2> at java.util.concurrent.ThreadPoolExecutor.runWorker(ThreadPoolExecutor.java:1145)
[junit4] 2> at java.util.concurrent.ThreadPoolExecutor$Worker.run(ThreadPoolExecutor.java:615)
[junit4] 2> at java.lang.Thread.run(Thread.java:745)
[junit4] 2>
[junit4] 2> 699532 INFO (OverseerThreadFactory-960-thread-4-processing-n:127.0.0.1:42267_solr) [n:127.0.0.1:42267_solr ] o.a.s.c.OverseerTaskProcessor Overseer ConfigSet Message Handler: Message id:/overseer/collection-queue-work/qn-0000000158 complete, response:{Operation delete caused exception:=org.apache.solr.common.SolrException: ConfigSet does not exist to delete: configSet1,exception={msg=ConfigSet does not exist to delete: configSet1,rspCode=400}}
[junit4] 2> 699532 INFO (zkCallback-343-thread-3-processing-n:127.0.0.1:42267_solr) [n:127.0.0.1:42267_solr ] o.a.s.c.OverseerTaskQueue NodeDataChanged fired on path /overseer/collection-queue-work/qnr-0000000158 state SyncConnected
[junit4] 2> 699534 INFO (qtp27983095-2418) [n:127.0.0.1:42267_solr ] o.a.s.s.SolrDispatchFilter [admin] webapp=null path=/admin/configs params={version=2&name=configSet1&action=DELETE&wt=javabin} status=400 QTime=5
[junit4] 2> 699536 INFO (jetty-launcher-338-thread-2) [ ] o.e.j.s.ServerConnector Stopped ServerConnector@6f49a3{HTTP/1.1}{127.0.0.1:0}
[junit4] 2> 699537 INFO (jetty-launcher-338-thread-2) [ ] o.a.s.c.CoreContainer Shutting down CoreContainer instance=13314077
[junit4] 2> 699537 INFO (jetty-launcher-338-thread-2) [ ] o.a.s.c.Overseer Overseer (id=94429427546324995-127.0.0.1:42267_solr-n_0000000000) closing
[junit4] 2> 699538 INFO (OverseerStateUpdate-94429427546324995-127.0.0.1:42267_solr-n_0000000000) [n:127.0.0.1:42267_solr ] o.a.s.c.Overseer Overseer Loop exiting : 127.0.0.1:42267_solr
[junit4] 2> 699539 INFO (jetty-launcher-338-thread-2) [ ] o.e.j.s.h.ContextHandler Stopped o.e.j.s.ServletContextHandler@5d40aa{/solr,null,UNAVAILABLE}
[junit4] 2> 699540 ERROR (jetty-launcher-338-thread-1-EventThread) [n:127.0.0.1:42267_solr ] o.a.z.ClientCnxn Error while calling watcher
[junit4] 2> java.util.concurrent.RejectedExecutionException: Task org.apache.solr.common.util.ExecutorUtil$MDCAwareThreadPoolExecutor$1@1971895 rejected from org.apache.solr.common.util.ExecutorUtil$MDCAwareThreadPoolExecutor@cf1041[Terminated, pool size = 0, active threads = 0, queued tasks = 0, completed tasks = 119]
[junit4] 2> at java.util.concurrent.ThreadPoolExecutor$AbortPolicy.rejectedExecution(ThreadPoolExecutor.java:2048)
[junit4] 2> at java.util.concurrent.ThreadPoolExecutor.reject(ThreadPoolExecutor.java:821)
[junit4] 2> at java.util.concurrent.ThreadPoolExecutor.execute(ThreadPoolExecutor.java:1372)
[junit4] 2> at org.apache.solr.common.util.ExecutorUtil$MDCAwareThreadPoolExecutor.execute(ExecutorUtil.java:193)
[junit4] 2> at java.util.concurrent.AbstractExecutorService.submit(AbstractExecutorService.java:110)
[junit4] 2> at org.apache.solr.common.cloud.SolrZkClient$3.process(SolrZkClient.java:261)
[junit4] 2> at org.apache.zookeeper.ClientCnxn$EventThread.processEvent(ClientCnxn.java:522)
[junit4] 2> at org.apache.zookeeper.ClientCnxn$EventThread.run(ClientCnxn.java:498)
[junit4] 2> 699544 INFO (TEST-TestConfigSetsAPIExclusivity.testAPIExclusivity-seed#[2A6DF2E6432EEABA]) [ ] o.a.s.c.ZkTestServer connecting to 127.0.0.1:56447 56447
[junit4] 2> 699570 INFO (Thread-726) [ ] o.a.s.c.ZkTestServer connecting to 127.0.0.1:56447 56447
[junit4] 2> 699571 INFO (TEST-TestConfigSetsAPIExclusivity.testAPIExclusivity-seed#[2A6DF2E6432EEABA]) [ ] o.a.s.SolrTestCaseJ4 ###Ending testAPIExclusivity
[junit4] 2> NOTE: reproduce with: ant test -Dtestcase=TestConfigSetsAPIExclusivity -Dtests.method=testAPIExclusivity -Dtests.seed=2A6DF2E6432EEABA -Dtests.multiplier=3 -Dtests.slow=true -Dtests.locale=ru -Dtests.timezone=America/Recife -Dtests.asserts=true -Dtests.file.encoding=UTF-8
[junit4] FAILURE 301s J2 | TestConfigSetsAPIExclusivity.testAPIExclusivity <<<
[junit4] > Throwable #1: java.lang.AssertionError: Unexpected exception: org.apache.solr.client.solrj.impl.HttpSolrClient$RemoteSolrException: Error from server at http://127.0.0.1:42267/solr: delete the configset time out:300s expected:<0> but was:<1>
[junit4] > at __randomizedtesting.SeedInfo.seed([2A6DF2E6432EEABA:5718EB1D1A8A53F3]:0)
[junit4] > at org.apache.solr.cloud.TestConfigSetsAPIExclusivity.testAPIExclusivity(TestConfigSetsAPIExclusivity.java:95)
[junit4] > at java.lang.Thread.run(Thread.java:745)
[junit4] 2> 699577 INFO (SUITE-TestConfigSetsAPIExclusivity-seed#[2A6DF2E6432EEABA]-worker) [ ] o.a.s.SolrTestCaseJ4 ###deleteCore
[junit4] 2> NOTE: leaving temporary files on disk at: /home/jenkins/workspace/Lucene-Solr-5.x-Linux/solr/build/solr-core/test/J2/temp/solr.cloud.TestConfigSetsAPIExclusivity_2A6DF2E6432EEABA-001
[junit4] 2> Aug 29, 2015 8:10:16 PM com.carrotsearch.randomizedtesting.ThreadLeakControl checkThreadLeaks
[junit4] 2> WARNING: Will linger awaiting termination of 2 leaked thread(s).
[junit4] 2> NOTE: test params are: codec=Lucene53, sim=RandomSimilarityProvider(queryNorm=false,coord=yes): {}, locale=ru, timezone=America/Recife
[junit4] 2> NOTE: Linux 3.19.0-26-generic i386/Oracle Corporation 1.7.0_80 (32-bit)/cpus=12,threads=1,free=64278968,total=208527360
[junit4] 2> NOTE: All tests run in this JVM: [OverseerTest, TestSolrQueryParser, DistribDocExpirationUpdateProcessorTest, RecoveryAfterSoftCommitTest, BinaryUpdateRequestHandlerTest, SuggesterTSTTest, DocValuesMultiTest, TestPHPSerializedResponseWriter, TestCopyFieldCollectionResource, PrimitiveFieldTypeTest, ShowFileRequestHandlerTest, TestNRTOpen, SearchHandlerTest, ZkNodePropsTest, BadComponentTest, TestIndexingPerformance, FieldMutatingUpdateProcessorTest, BasicDistributedZk2Test, DirectUpdateHandlerTest, HdfsDirectoryTest, TestStressRecovery, TestSearchPerf, RegexBoostProcessorTest, TestCollationField, SampleTest, TestCSVResponseWriter, TestJmxIntegration, HLLUtilTest, UnloadDistributedZkTest, TestShortCircuitedRequests, TestElisionMultitermQuery, TestTolerantSearch, TestSearcherReuse, RecoveryZkTest, HardAutoCommitTest, CoreAdminHandlerTest, TestSolrIndexConfig, DistributedFacetPivotSmallAdvancedTest, TestCustomSort, StatelessScriptUpdateProcessorFactoryTest, TestReRankQParserPlugin, TestRTimerTree, TestConfigSetsAPIExclusivity]
[junit4] Completed [184/536] on J2 in 300.81s, 1 test, 1 failure <<< FAILURES!
[...truncated 1087 lines...]
BUILD FAILED
/home/jenkins/workspace/Lucene-Solr-5.x-Linux/build.xml:785: The following error occurred while executing this line:
/home/jenkins/workspace/Lucene-Solr-5.x-Linux/build.xml:729: The following error occurred while executing this line:
/home/jenkins/workspace/Lucene-Solr-5.x-Linux/build.xml:59: The following error occurred while executing this line:
/home/jenkins/workspace/Lucene-Solr-5.x-Linux/solr/build.xml:233: The following error occurred while executing this line:
/home/jenkins/workspace/Lucene-Solr-5.x-Linux/solr/common-build.xml:524: The following error occurred while executing this line:
/home/jenkins/workspace/Lucene-Solr-5.x-Linux/lucene/common-build.xml:1452: The following error occurred while executing this line:
/home/jenkins/workspace/Lucene-Solr-5.x-Linux/lucene/common-build.xml:1006: There were test failures: 536 suites, 2128 tests, 1 failure, 70 ignored (34 assumptions)
Total time: 52 minutes 28 seconds
Build step 'Invoke Ant' marked build as failure
Archiving artifacts
[WARNINGS] Skipping publisher since build result is FAILURE
Recording test results
Email was triggered for: Failure - Any
Sending email for trigger: Failure - Any
[JENKINS] Lucene-Solr-5.x-Linux (32bit/jdk1.7.0_80) - Build # 13765
- Still Failing!
Posted by Policeman Jenkins Server <je...@thetaphi.de>.
Build: http://jenkins.thetaphi.de/job/Lucene-Solr-5.x-Linux/13765/
Java: 32bit/jdk1.7.0_80 -client -XX:+UseG1GC
All tests passed
Build Log:
[...truncated 55158 lines...]
BUILD FAILED
/home/jenkins/workspace/Lucene-Solr-5.x-Linux/build.xml:785: The following error occurred while executing this line:
/home/jenkins/workspace/Lucene-Solr-5.x-Linux/build.xml:665: The following error occurred while executing this line:
/home/jenkins/workspace/Lucene-Solr-5.x-Linux/build.xml:648: The following files are missing svn:eol-style (or binary svn:mime-type):
* ./solr/webapp/web/css/angular/dashboard.css
* ./solr/webapp/web/js/angular/controllers/collection-overview.js
* ./solr/webapp/web/partials/collection_overview.html
Total time: 64 minutes 52 seconds
Build step 'Invoke Ant' marked build as failure
Archiving artifacts
[WARNINGS] Skipping publisher since build result is FAILURE
Recording test results
Email was triggered for: Failure - Any
Sending email for trigger: Failure - Any
[JENKINS] Lucene-Solr-5.x-Linux (32bit/jdk1.8.0_60) - Build # 13764
- Still Failing!
Posted by Policeman Jenkins Server <je...@thetaphi.de>.
Build: http://jenkins.thetaphi.de/job/Lucene-Solr-5.x-Linux/13764/
Java: 32bit/jdk1.8.0_60 -server -XX:+UseG1GC
All tests passed
Build Log:
[...truncated 55073 lines...]
BUILD FAILED
/home/jenkins/workspace/Lucene-Solr-5.x-Linux/build.xml:785: The following error occurred while executing this line:
/home/jenkins/workspace/Lucene-Solr-5.x-Linux/build.xml:665: The following error occurred while executing this line:
/home/jenkins/workspace/Lucene-Solr-5.x-Linux/build.xml:648: The following files are missing svn:eol-style (or binary svn:mime-type):
* ./solr/webapp/web/css/angular/dashboard.css
* ./solr/webapp/web/js/angular/controllers/collection-overview.js
* ./solr/webapp/web/partials/collection_overview.html
Total time: 58 minutes 34 seconds
Build step 'Invoke Ant' marked build as failure
Archiving artifacts
[WARNINGS] Skipping publisher since build result is FAILURE
Recording test results
Email was triggered for: Failure - Any
Sending email for trigger: Failure - Any