You are viewing a plain text version of this content. The canonical link for it is here.
Posted to builds@beam.apache.org by Apache Jenkins Server <je...@builds.apache.org> on 2020/02/18 23:07:19 UTC

Build failed in Jenkins: beam_PostCommit_Python37 #1660

See <https://builds.apache.org/job/beam_PostCommit_Python37/1660/display/redirect?page=changes>

Changes:

[chlarsen] Removed compile time generation of test Thrift class.


------------------------------------------
[...truncated 2.82 MB...]
test_copy (apache_beam.io.gcp.gcsio_integration_test.GcsIOIntegrationTest) ... ERROR
test_copy_batch (apache_beam.io.gcp.gcsio_integration_test.GcsIOIntegrationTest) ... ok
test_copy_batch_kms (apache_beam.io.gcp.gcsio_integration_test.GcsIOIntegrationTest) ... ok
test_copy_batch_rewrite_token (apache_beam.io.gcp.gcsio_integration_test.GcsIOIntegrationTest) ... ok
test_copy_kms (apache_beam.io.gcp.gcsio_integration_test.GcsIOIntegrationTest) ... ERROR
test_copy_rewrite_token (apache_beam.io.gcp.gcsio_integration_test.GcsIOIntegrationTest) ... ok
test_iobase_source (apache_beam.io.gcp.bigquery_read_it_test.ReadTests) ... ok
test_native_source (apache_beam.io.gcp.bigquery_read_it_test.ReadTests) ... ok
test_bqfl_streaming (apache_beam.io.gcp.bigquery_file_loads_test.BigQueryFileLoadsIT) ... SKIP: TestStream is not supported on TestDataflowRunner
test_multiple_destinations_transform (apache_beam.io.gcp.bigquery_file_loads_test.BigQueryFileLoadsIT) ... ok
test_one_job_fails_all_jobs_fail (apache_beam.io.gcp.bigquery_file_loads_test.BigQueryFileLoadsIT) ... ok
test_transform_on_gcs (apache_beam.io.fileio_test.MatchIntegrationTest) ... ok
test_parquetio_it (apache_beam.io.parquetio_it_test.TestParquetIT) ... ok
test_file_loads (apache_beam.io.gcp.bigquery_test.PubSubBigQueryIT) ... SKIP: https://issuetracker.google.com/issues/118375066
test_streaming_inserts (apache_beam.io.gcp.bigquery_test.PubSubBigQueryIT) ... ok
test_basic_execution (apache_beam.testing.test_stream_it_test.TestStreamIntegrationTests) ... SKIP: The "TestDataflowRunner", does not support the TestStream transform. Supported runners: ['DirectRunner', 'SwitchingDirectRunner']
Tests that the TestStream supports emitting to multiple PCollections. ... SKIP: The "TestDataflowRunner", does not support the TestStream transform. Supported runners: ['DirectRunner', 'SwitchingDirectRunner']
Tests that the TestStream can independently control output watermarks. ... SKIP: The "TestDataflowRunner", does not support the TestStream transform. Supported runners: ['DirectRunner', 'SwitchingDirectRunner']
Runs streaming Dataflow job and verifies that user metrics are reported ... ok
test_streaming_data_only (apache_beam.io.gcp.pubsub_integration_test.PubSubIntegrationTest) ... ok
test_streaming_with_attributes (apache_beam.io.gcp.pubsub_integration_test.PubSubIntegrationTest) ... ok
test_datastore_write_limit (apache_beam.io.gcp.datastore.v1new.datastore_write_it_test.DatastoreWriteIT) ... ok
test_metrics_fnapi_it (apache_beam.runners.dataflow.dataflow_exercise_metrics_pipeline_test.ExerciseMetricsPipelineTest) ... ok
test_metrics_it (apache_beam.runners.dataflow.dataflow_exercise_metrics_pipeline_test.ExerciseMetricsPipelineTest) ... ok
test_job_python_from_python_it (apache_beam.transforms.external_test_it.ExternalTransformIT) ... ok
test_big_query_write (apache_beam.io.gcp.bigquery_write_it_test.BigQueryWriteIntegrationTests) ... ok
test_big_query_write_new_types (apache_beam.io.gcp.bigquery_write_it_test.BigQueryWriteIntegrationTests) ... ok
test_big_query_write_schema_autodetect (apache_beam.io.gcp.bigquery_write_it_test.BigQueryWriteIntegrationTests) ... SKIP: DataflowRunner does not support schema autodetection
test_big_query_write_without_schema (apache_beam.io.gcp.bigquery_write_it_test.BigQueryWriteIntegrationTests) ... ok
test_big_query_legacy_sql (apache_beam.io.gcp.big_query_query_to_table_it_test.BigQueryQueryToTableIT) ... ok
test_big_query_new_types (apache_beam.io.gcp.big_query_query_to_table_it_test.BigQueryQueryToTableIT) ... ok
test_big_query_new_types_native (apache_beam.io.gcp.big_query_query_to_table_it_test.BigQueryQueryToTableIT) ... ok
test_big_query_standard_sql (apache_beam.io.gcp.big_query_query_to_table_it_test.BigQueryQueryToTableIT) ... ok
test_big_query_standard_sql_kms_key_native (apache_beam.io.gcp.big_query_query_to_table_it_test.BigQueryQueryToTableIT) ... ok

======================================================================
ERROR: test_copy (apache_beam.io.gcp.gcsio_integration_test.GcsIOIntegrationTest)
----------------------------------------------------------------------
Traceback (most recent call last):
  File "<https://builds.apache.org/job/beam_PostCommit_Python37/ws/src/sdks/python/apache_beam/io/gcp/gcsio_integration_test.py",> line 83, in tearDown
    FileSystems.delete([self.gcs_tempdir + '/'])
  File "<https://builds.apache.org/job/beam_PostCommit_Python37/ws/src/sdks/python/apache_beam/io/filesystems.py",> line 343, in delete
    return filesystem.delete(paths)
  File "<https://builds.apache.org/job/beam_PostCommit_Python37/ws/src/sdks/python/apache_beam/io/gcp/gcsfilesystem.py",> line 348, in delete
    raise BeamIOError("Delete operation failed", exceptions)
apache_beam.io.filesystem.BeamIOError: Delete operation failed with exceptions {'gs://temp-storage-for-end-to-end-tests/temp-it/gcs_it-7a0e1ebf-a6a0-45b6-a75c-af3e95c121bc/': HttpError('HttpError accessing <https://www.googleapis.com/batch/storage/v1>: response: <{\'Content-Type\': \'application/json; charset=UTF-8\', \'Date\': \'Tue, 18 Feb 2020 22:48:18 GMT\', \'Expires\': \'Tue, 18 Feb 2020 22:48:18 GMT\', \'Cache-Control\': \'private, max-age=0\', \'Content-Length\': \'609\', \'status\': \'429\'}>, content <{\n "error": {\n  "errors": [\n   {\n    "domain": "usageLimits",\n    "reason": "rateLimitExceeded",\n    "message": "The rate of change requests to the object temp-storage-for-end-to-end-tests/temp-it/gcs_it-7a0e1ebf-a6a0-45b6-a75c-af3e95c121bc/test_copy exceeds the rate limit. Please reduce the rate of create, update, and delete requests."\n   }\n  ],\n  "code": 429,\n  "message": "The rate of change requests to the object temp-storage-for-end-to-end-tests/temp-it/gcs_it-7a0e1ebf-a6a0-45b6-a75c-af3e95c121bc/test_copy exceeds the rate limit. Please reduce the rate of create, update, and delete requests."\n }\n}\n>')}
-------------------- >> begin captured logging << --------------------
apache_beam.options.pipeline_options: WARNING: --region not set; will default to us-central1. Future releases of Beam will require the user to set --region explicitly, or else have a default set via the gcloud tool. https://cloud.google.com/compute/docs/regions-zones
apache_beam.io.gcp.gcsio: DEBUG: Rewrite done: gs://dataflow-samples/shakespeare/kinglear.txt to gs://temp-storage-for-end-to-end-tests/temp-it/gcs_it-7a0e1ebf-a6a0-45b6-a75c-af3e95c121bc/test_copy
apache_beam.io.filesystem: DEBUG: Listing files in 'gs://temp-storage-for-end-to-end-tests/temp-it/gcs_it-7a0e1ebf-a6a0-45b6-a75c-af3e95c121bc/'
apache_beam.io.filesystem: DEBUG: translate_pattern: 'gs://temp-storage-for-end-to-end-tests/temp-it/gcs_it-7a0e1ebf-a6a0-45b6-a75c-af3e95c121bc/*' -> 'gs://temp\\-storage\\-for\\-end\\-to\\-end\\-tests/temp\\-it/gcs_it\\-7a0e1ebf\\-a6a0\\-45b6\\-a75c\\-af3e95c121bc/[^/\\\\]*'
apache_beam.io.gcp.gcsio: INFO: Starting the size estimation of the input
apache_beam.io.gcp.gcsio: INFO: Finished listing 1 files in 0.030767440795898438 seconds.
--------------------- >> end captured logging << ---------------------
<https://builds.apache.org/job/beam_PostCommit_Python37/ws/src/sdks/python/apache_beam/io/gcp/bigquery.py>:1466: BeamDeprecationWarning: options is deprecated since First stable release. References to <pipeline>.options will not be supported
Worker logs: https://console.cloud.google.com/dataflow/jobsDetail/locations/us-central1/jobs/2020-02-18_14_21_31-218036098106491380?project=apache-beam-testing
  experiments = p.options.view_as(DebugOptions).experiments or []
<https://builds.apache.org/job/beam_PostCommit_Python37/ws/src/sdks/python/apache_beam/io/gcp/bigquery.py>:1466: BeamDeprecationWarning: options is deprecated since First stable release. References to <pipeline>.options will not be supported
Worker logs: https://console.cloud.google.com/dataflow/jobsDetail/locations/us-central1/jobs/2020-02-18_14_35_26-11059480832744849335?project=apache-beam-testing
  experiments = p.options.view_as(DebugOptions).experiments or []
Worker logs: https://console.cloud.google.com/dataflow/jobsDetail/locations/us-central1/jobs/2020-02-18_14_43_58-9029829533430046937?project=apache-beam-testing
<https://builds.apache.org/job/beam_PostCommit_Python37/ws/src/sdks/python/apache_beam/io/gcp/bigquery_file_loads.py>:818: BeamDeprecationWarning: options is deprecated since First stable release. References to <pipeline>.options will not be supported
  temp_location = p.options.view_as(GoogleCloudOptions).temp_location
Worker logs: https://console.cloud.google.com/dataflow/jobsDetail/locations/us-central1/jobs/2020-02-18_14_50_53-17513766114971341586?project=apache-beam-testing
Worker logs: https://console.cloud.google.com/dataflow/jobsDetail/locations/us-central1/jobs/2020-02-18_14_56_51-2804879134383700142?project=apache-beam-testing
<https://builds.apache.org/job/beam_PostCommit_Python37/ws/src/sdks/python/apache_beam/io/gcp/bigquery.py>:1466: BeamDeprecationWarning: options is deprecated since First stable release. References to <pipeline>.options will not be supported
  experiments = p.options.view_as(DebugOptions).experiments or []
<https://builds.apache.org/job/beam_PostCommit_Python37/ws/src/sdks/python/apache_beam/io/gcp/bigquery_file_loads.py>:818: BeamDeprecationWarning: options is deprecated since First stable release. References to <pipeline>.options will not be supported
  temp_location = p.options.view_as(GoogleCloudOptions).temp_location
Worker logs: https://console.cloud.google.com/dataflow/jobsDetail/locations/us-central1/jobs/2020-02-18_14_21_26-12821928226207191883?project=apache-beam-testing
Worker logs: https://console.cloud.google.com/dataflow/jobsDetail/locations/us-central1/jobs/2020-02-18_14_38_11-14443342370264982987?project=apache-beam-testing
Worker logs: https://console.cloud.google.com/dataflow/jobsDetail/locations/us-central1/jobs/2020-02-18_14_45_18-13799722459983904834?project=apache-beam-testing
<https://builds.apache.org/job/beam_PostCommit_Python37/ws/src/sdks/python/apache_beam/runners/dataflow/dataflow_runner.py>:787: BeamDeprecationWarning: BigQuerySink is deprecated since 2.11.0. Use WriteToBigQuery instead.
  kms_key=transform.kms_key))
<https://builds.apache.org/job/beam_PostCommit_Python37/ws/src/sdks/python/apache_beam/io/gcp/bigquery_test.py>:823: BeamDeprecationWarning: options is deprecated since First stable release. References to <pipeline>.options will not be supported
  streaming = self.test_pipeline.options.view_as(StandardOptions).streaming
<https://builds.apache.org/job/beam_PostCommit_Python37/ws/src/sdks/python/apache_beam/io/gcp/bigquery.py>:1466: BeamDeprecationWarning: options is deprecated since First stable release. References to <pipeline>.options will not be supported
  experiments = p.options.view_as(DebugOptions).experiments or []
<https://builds.apache.org/job/beam_PostCommit_Python37/ws/src/sdks/python/apache_beam/io/gcp/bigquery.py>:1463: BeamDeprecationWarning: options is deprecated since First stable release. References to <pipeline>.options will not be supported
  self.table_reference.projectId = pcoll.pipeline.options.view_as(
Worker logs: https://console.cloud.google.com/dataflow/jobsDetail/locations/us-central1/jobs/2020-02-18_14_21_29-5300669934957248538?project=apache-beam-testing
Worker logs: https://console.cloud.google.com/dataflow/jobsDetail/locations/us-central1/jobs/2020-02-18_14_34_40-16264060808136691893?project=apache-beam-testing
Worker logs: https://console.cloud.google.com/dataflow/jobsDetail/locations/us-central1/jobs/2020-02-18_14_41_25-1846198630874337701?project=apache-beam-testing
<https://builds.apache.org/job/beam_PostCommit_Python37/ws/src/sdks/python/apache_beam/io/gcp/bigquery.py>:1466: BeamDeprecationWarning: options is deprecated since First stable release. References to <pipeline>.options will not be supported
Worker logs: https://console.cloud.google.com/dataflow/jobsDetail/locations/us-central1/jobs/2020-02-18_14_47_48-10243610396703953200?project=apache-beam-testing
  experiments = p.options.view_as(DebugOptions).experiments or []
Worker logs: https://console.cloud.google.com/dataflow/jobsDetail/locations/us-central1/jobs/2020-02-18_14_54_38-8958688440329210650?project=apache-beam-testing
<https://builds.apache.org/job/beam_PostCommit_Python37/ws/src/sdks/python/apache_beam/io/gcp/big_query_query_to_table_pipeline.py>:87: FutureWarning: _ReadFromBigQuery is experimental.
  kms_key=kms_key)
<https://builds.apache.org/job/beam_PostCommit_Python37/ws/src/sdks/python/apache_beam/io/gcp/bigquery.py>:1655: BeamDeprecationWarning: options is deprecated since First stable release. References to <pipeline>.options will not be supported
  temp_location = pcoll.pipeline.options.view_as(
<https://builds.apache.org/job/beam_PostCommit_Python37/ws/src/sdks/python/apache_beam/runners/dataflow/dataflow_runner.py>:787: BeamDeprecationWarning: BigQuerySink is deprecated since 2.11.0. Use WriteToBigQuery instead.
  kms_key=transform.kms_key))
Worker logs: https://console.cloud.google.com/dataflow/jobsDetail/locations/us-central1/jobs/2020-02-18_15_01_22-11436518468549354387?project=apache-beam-testing
<https://builds.apache.org/job/beam_PostCommit_Python37/ws/src/sdks/python/apache_beam/io/gcp/big_query_query_to_table_pipeline.py>:87: FutureWarning: _ReadFromBigQuery is experimental.
  kms_key=kms_key)
<https://builds.apache.org/job/beam_PostCommit_Python37/ws/src/sdks/python/apache_beam/io/gcp/bigquery.py>:1655: BeamDeprecationWarning: options is deprecated since First stable release. References to <pipeline>.options will not be supported
  temp_location = pcoll.pipeline.options.view_as(
<https://builds.apache.org/job/beam_PostCommit_Python37/ws/src/sdks/python/apache_beam/runners/dataflow/dataflow_runner.py>:787: BeamDeprecationWarning: BigQuerySink is deprecated since 2.11.0. Use WriteToBigQuery instead.
  kms_key=transform.kms_key))
<https://builds.apache.org/job/beam_PostCommit_Python37/ws/src/sdks/python/apache_beam/io/gcp/big_query_query_to_table_pipeline.py>:95: BeamDeprecationWarning: BigQuerySink is deprecated since 2.11.0. Use WriteToBigQuery instead.
  kms_key=kms_key))
<https://builds.apache.org/job/beam_PostCommit_Python37/ws/src/sdks/python/apache_beam/io/gcp/big_query_query_to_table_pipeline.py>:87: FutureWarning: _ReadFromBigQuery is experimental.
  kms_key=kms_key)
<https://builds.apache.org/job/beam_PostCommit_Python37/ws/src/sdks/python/apache_beam/io/gcp/bigquery.py>:1655: BeamDeprecationWarning: options is deprecated since First stable release. References to <pipeline>.options will not be supported
  temp_location = pcoll.pipeline.options.view_as(
<https://builds.apache.org/job/beam_PostCommit_Python37/ws/src/sdks/python/apache_beam/runners/dataflow/dataflow_runner.py>:787: BeamDeprecationWarning: BigQuerySink is deprecated since 2.11.0. Use WriteToBigQuery instead.
  kms_key=transform.kms_key))
<https://builds.apache.org/job/beam_PostCommit_Python37/ws/src/sdks/python/apache_beam/io/gcp/big_query_query_to_table_pipeline.py>:95: BeamDeprecationWarning: BigQuerySink is deprecated since 2.11.0. Use WriteToBigQuery instead.
  kms_key=kms_key))
Worker logs: https://console.cloud.google.com/dataflow/jobsDetail/locations/us-central1/jobs/2020-02-18_14_21_26-15954166861216956223?project=apache-beam-testing
<https://builds.apache.org/job/beam_PostCommit_Python37/ws/src/sdks/python/apache_beam/io/gcp/bigquery_read_it_test.py>:162: FutureWarning: _ReadFromBigQuery is experimental.
  query=self.query, use_standard_sql=True, project=self.project))
Worker logs: https://console.cloud.google.com/dataflow/jobsDetail/locations/us-central1/jobs/2020-02-18_14_37_36-14052922681777793192?project=apache-beam-testing
<https://builds.apache.org/job/beam_PostCommit_Python37/ws/src/sdks/python/apache_beam/io/gcp/bigquery.py>:1655: BeamDeprecationWarning: options is deprecated since First stable release. References to <pipeline>.options will not be supported
Worker logs: https://console.cloud.google.com/dataflow/jobsDetail/locations/us-central1/jobs/2020-02-18_14_44_24-8510606968285540801?project=apache-beam-testing
Worker logs: https://console.cloud.google.com/dataflow/jobsDetail/locations/us-central1/jobs/2020-02-18_14_50_53-99745145242139194?project=apache-beam-testing
Worker logs: https://console.cloud.google.com/dataflow/jobsDetail/locations/us-central1/jobs/2020-02-18_14_58_25-14351636009381669814?project=apache-beam-testing
  temp_location = pcoll.pipeline.options.view_as(
Worker logs: https://console.cloud.google.com/dataflow/jobsDetail/locations/us-central1/jobs/2020-02-18_14_21_25-11782007315778662796?project=apache-beam-testing
Worker logs: https://console.cloud.google.com/dataflow/jobsDetail/locations/us-central1/jobs/2020-02-18_14_27_48-7292856303762571190?project=apache-beam-testing
Worker logs: https://console.cloud.google.com/dataflow/jobsDetail/locations/us-central1/jobs/2020-02-18_14_35_37-18182169807884069820?project=apache-beam-testing
Worker logs: https://console.cloud.google.com/dataflow/jobsDetail/locations/us-central1/jobs/2020-02-18_14_42_20-6798710853935829208?project=apache-beam-testing
<https://builds.apache.org/job/beam_PostCommit_Python37/ws/src/sdks/python/apache_beam/runners/dataflow/dataflow_runner.py>:787: BeamDeprecationWarning: BigQuerySink is deprecated since 2.11.0. Use WriteToBigQuery instead.
  kms_key=transform.kms_key))
Worker logs: https://console.cloud.google.com/dataflow/jobsDetail/locations/us-central1/jobs/2020-02-18_14_48_51-16146694163109364758?project=apache-beam-testing
<https://builds.apache.org/job/beam_PostCommit_Python37/ws/src/sdks/python/apache_beam/io/gcp/bigquery_io_read_pipeline.py>:84: FutureWarning: _ReadFromBigQuery is experimental.
Worker logs: https://console.cloud.google.com/dataflow/jobsDetail/locations/us-central1/jobs/2020-02-18_14_55_51-17522413588923224992?project=apache-beam-testing
  (options.view_as(GoogleCloudOptions).project, known_args.input_table))
<https://builds.apache.org/job/beam_PostCommit_Python37/ws/src/sdks/python/apache_beam/io/gcp/bigquery.py>:1655: BeamDeprecationWarning: options is deprecated since First stable release. References to <pipeline>.options will not be supported
  temp_location = pcoll.pipeline.options.view_as(
<https://builds.apache.org/job/beam_PostCommit_Python37/ws/src/sdks/python/apache_beam/io/gcp/bigquery_io_read_pipeline.py>:84: FutureWarning: _ReadFromBigQuery is experimental.
  (options.view_as(GoogleCloudOptions).project, known_args.input_table))
<https://builds.apache.org/job/beam_PostCommit_Python37/ws/src/sdks/python/apache_beam/io/gcp/bigquery.py>:1655: BeamDeprecationWarning: options is deprecated since First stable release. References to <pipeline>.options will not be supported
  temp_location = pcoll.pipeline.options.view_as(
Worker logs: https://console.cloud.google.com/dataflow/jobsDetail/locations/us-central1/jobs/2020-02-18_14_21_26-15524921570980018880?project=apache-beam-testing
<https://builds.apache.org/job/beam_PostCommit_Python37/ws/src/sdks/python/apache_beam/io/gcp/bigquery_read_it_test.py>:275: FutureWarning: _ReadFromBigQuery is experimental.
  query=self.query, use_standard_sql=True, project=self.project))
<https://builds.apache.org/job/beam_PostCommit_Python37/ws/src/sdks/python/apache_beam/io/gcp/bigquery.py>:1655: BeamDeprecationWarning: options is deprecated since First stable release. References to <pipeline>.options will not be supported
  temp_location = pcoll.pipeline.options.view_as(
Worker logs: https://console.cloud.google.com/dataflow/jobsDetail/locations/us-central1/jobs/2020-02-18_14_28_45-2698635056411510685?project=apache-beam-testing
<https://builds.apache.org/job/beam_PostCommit_Python37/ws/src/sdks/python/apache_beam/io/fileio_test.py>:303: FutureWarning: MatchAll is experimental.
Worker logs: https://console.cloud.google.com/dataflow/jobsDetail/locations/us-central1/jobs/2020-02-18_14_35_49-16569160945709761253?project=apache-beam-testing
  | 'GetPath' >> beam.Map(lambda metadata: metadata.path))
<https://builds.apache.org/job/beam_PostCommit_Python37/ws/src/sdks/python/apache_beam/io/fileio_test.py>:316: FutureWarning: MatchAll is experimental.
  | 'Checksums' >> beam.Map(compute_hash))
Worker logs: https://console.cloud.google.com/dataflow/jobsDetail/locations/us-central1/jobs/2020-02-18_14_42_20-12359855486994105753?project=apache-beam-testing
Worker logs: https://console.cloud.google.com/dataflow/jobsDetail/locations/us-central1/jobs/2020-02-18_14_48_58-7147914953717143985?project=apache-beam-testing
<https://builds.apache.org/job/beam_PostCommit_Python37/ws/src/sdks/python/apache_beam/io/fileio_test.py>:316: FutureWarning: ReadMatches is experimental.
Worker logs: https://console.cloud.google.com/dataflow/jobsDetail/locations/us-central1/jobs/2020-02-18_14_55_39-10845952882618635176?project=apache-beam-testing
  | 'Checksums' >> beam.Map(compute_hash))
Worker logs: https://console.cloud.google.com/dataflow/jobsDetail/locations/us-central1/jobs/2020-02-18_14_21_27-3687307261001240055?project=apache-beam-testing
Worker logs: https://console.cloud.google.com/dataflow/jobsDetail/locations/us-central1/jobs/2020-02-18_14_30_00-9003035296274560454?project=apache-beam-testing
Worker logs: https://console.cloud.google.com/dataflow/jobsDetail/locations/us-central1/jobs/2020-02-18_14_39_05-12498386246101173388?project=apache-beam-testing
<https://builds.apache.org/job/beam_PostCommit_Python37/ws/src/sdks/python/apache_beam/io/avroio.py>:205: UserWarning: Due to a known issue in avro-python3 package, it is recommended to use fastavro with Beam Avro IO on Python 3 until BEAM-6522 is addressed.
  "Due to a known issue in avro-python3 package, it is "
Worker logs: https://console.cloud.google.com/dataflow/jobsDetail/locations/us-central1/jobs/2020-02-18_14_46_08-14915726210543708231?project=apache-beam-testing
<https://builds.apache.org/job/beam_PostCommit_Python37/ws/src/sdks/python/apache_beam/io/gcp/bigquery.py>:1466: BeamDeprecationWarning: options is deprecated since First stable release. References to <pipeline>.options will not be supported
Worker logs: https://console.cloud.google.com/dataflow/jobsDetail/locations/us-central1/jobs/2020-02-18_14_53_17-1570998519107955022?project=apache-beam-testing
Worker logs: https://console.cloud.google.com/dataflow/jobsDetail/locations/us-central1/jobs/2020-02-18_14_59_37-17890905150113955108?project=apache-beam-testing
  experiments = p.options.view_as(DebugOptions).experiments or []
<https://builds.apache.org/job/beam_PostCommit_Python37/ws/src/sdks/python/apache_beam/io/gcp/bigquery_file_loads.py>:818: BeamDeprecationWarning: options is deprecated since First stable release. References to <pipeline>.options will not be supported
  temp_location = p.options.view_as(GoogleCloudOptions).temp_location
<https://builds.apache.org/job/beam_PostCommit_Python37/ws/src/sdks/python/apache_beam/runners/dataflow/dataflow_runner.py>:787: BeamDeprecationWarning: BigQuerySink is deprecated since 2.11.0. Use WriteToBigQuery instead.
  kms_key=transform.kms_key))
<https://builds.apache.org/job/beam_PostCommit_Python37/ws/src/sdks/python/apache_beam/runners/dataflow/dataflow_runner.py>:787: BeamDeprecationWarning: BigQuerySink is deprecated since 2.11.0. Use WriteToBigQuery instead.
  kms_key=transform.kms_key))
<https://builds.apache.org/job/beam_PostCommit_Python37/ws/src/sdks/python/apache_beam/runners/dataflow/dataflow_runner.py>:787: BeamDeprecationWarning: BigQuerySink is deprecated since 2.11.0. Use WriteToBigQuery instead.
  kms_key=transform.kms_key))
Worker logs: https://console.cloud.google.com/dataflow/jobsDetail/locations/us-central1/jobs/2020-02-18_14_21_27-2720908912189439188?project=apache-beam-testing
Worker logs: https://console.cloud.google.com/dataflow/jobsDetail/locations/us-central1/jobs/2020-02-18_14_29_52-16792112410449828894?project=apache-beam-testing
Worker logs: https://console.cloud.google.com/dataflow/jobsDetail/locations/us-central1/jobs/2020-02-18_14_36_05-10621062819995358866?project=apache-beam-testing
Worker logs: https://console.cloud.google.com/dataflow/jobsDetail/locations/us-central1/jobs/2020-02-18_14_42_51-14690729500438506113?project=apache-beam-testing
Worker logs: https://console.cloud.google.com/dataflow/jobsDetail/locations/us-central1/jobs/2020-02-18_14_49_37-7905324131559121676?project=apache-beam-testing
Worker logs: https://console.cloud.google.com/dataflow/jobsDetail/locations/us-central1/jobs/2020-02-18_14_56_25-5575038865396299657?project=apache-beam-testing

======================================================================
ERROR: test_copy_kms (apache_beam.io.gcp.gcsio_integration_test.GcsIOIntegrationTest)
----------------------------------------------------------------------
Traceback (most recent call last):
  File "<https://builds.apache.org/job/beam_PostCommit_Python37/ws/src/sdks/python/apache_beam/io/gcp/gcsio_integration_test.py",> line 83, in tearDown
    FileSystems.delete([self.gcs_tempdir + '/'])
  File "<https://builds.apache.org/job/beam_PostCommit_Python37/ws/src/sdks/python/apache_beam/io/filesystems.py",> line 343, in delete
    return filesystem.delete(paths)
  File "<https://builds.apache.org/job/beam_PostCommit_Python37/ws/src/sdks/python/apache_beam/io/gcp/gcsfilesystem.py",> line 348, in delete
    raise BeamIOError("Delete operation failed", exceptions)
apache_beam.io.filesystem.BeamIOError: Delete operation failed with exceptions {'gs://temp-storage-for-end-to-end-tests/temp-it/gcs_it-bc3ef8a9-9169-4df5-837e-5634f2d46577/': HttpError('HttpError accessing <https://www.googleapis.com/batch/storage/v1>: response: <{\'Content-Type\': \'application/json; charset=UTF-8\', \'Date\': \'Tue, 18 Feb 2020 22:48:38 GMT\', \'Expires\': \'Tue, 18 Feb 2020 22:48:38 GMT\', \'Cache-Control\': \'private, max-age=0\', \'Content-Length\': \'617\', \'status\': \'429\'}>, content <{\n "error": {\n  "errors": [\n   {\n    "domain": "usageLimits",\n    "reason": "rateLimitExceeded",\n    "message": "The rate of change requests to the object temp-storage-for-end-to-end-tests/temp-it/gcs_it-bc3ef8a9-9169-4df5-837e-5634f2d46577/test_copy_kms exceeds the rate limit. Please reduce the rate of create, update, and delete requests."\n   }\n  ],\n  "code": 429,\n  "message": "The rate of change requests to the object temp-storage-for-end-to-end-tests/temp-it/gcs_it-bc3ef8a9-9169-4df5-837e-5634f2d46577/test_copy_kms exceeds the rate limit. Please reduce the rate of create, update, and delete requests."\n }\n}\n>')}
-------------------- >> begin captured logging << --------------------
apache_beam.options.pipeline_options: WARNING: --region not set; will default to us-central1. Future releases of Beam will require the user to set --region explicitly, or else have a default set via the gcloud tool. https://cloud.google.com/compute/docs/regions-zones
apache_beam.io.gcp.gcsio: DEBUG: Rewrite done: gs://dataflow-samples/shakespeare/kinglear.txt to gs://temp-storage-for-end-to-end-tests/temp-it/gcs_it-bc3ef8a9-9169-4df5-837e-5634f2d46577/test_copy_kms
apache_beam.io.filesystem: DEBUG: Listing files in 'gs://temp-storage-for-end-to-end-tests/temp-it/gcs_it-bc3ef8a9-9169-4df5-837e-5634f2d46577/'
apache_beam.io.filesystem: DEBUG: translate_pattern: 'gs://temp-storage-for-end-to-end-tests/temp-it/gcs_it-bc3ef8a9-9169-4df5-837e-5634f2d46577/*' -> 'gs://temp\\-storage\\-for\\-end\\-to\\-end\\-tests/temp\\-it/gcs_it\\-bc3ef8a9\\-9169\\-4df5\\-837e\\-5634f2d46577/[^/\\\\]*'
apache_beam.io.gcp.gcsio: INFO: Starting the size estimation of the input
apache_beam.io.gcp.gcsio: INFO: Finished listing 1 files in 0.030060291290283203 seconds.
--------------------- >> end captured logging << ---------------------

----------------------------------------------------------------------
XML: nosetests-postCommitIT-df-py37.xml
----------------------------------------------------------------------
XML: <https://builds.apache.org/job/beam_PostCommit_Python37/ws/src/sdks/python/nosetests.xml>
----------------------------------------------------------------------
Ran 52 tests in 2772.284s

FAILED (SKIP=8, errors=2)

> Task :sdks:python:test-suites:dataflow:py37:postCommitIT FAILED

FAILURE: Build completed with 2 failures.

1: Task failed with an exception.
-----------
* Where:
Build file '<https://builds.apache.org/job/beam_PostCommit_Python37/ws/src/sdks/python/test-suites/direct/py37/build.gradle'> line: 51

* What went wrong:
Execution failed for task ':sdks:python:test-suites:direct:py37:postCommitIT'.
> Process 'command 'sh'' finished with non-zero exit value 1

* Try:
Run with --stacktrace option to get the stack trace. Run with --info or --debug option to get more log output. Run with --scan to get full insights.
==============================================================================

2: Task failed with an exception.
-----------
* Where:
Build file '<https://builds.apache.org/job/beam_PostCommit_Python37/ws/src/sdks/python/test-suites/dataflow/py37/build.gradle'> line: 89

* What went wrong:
Execution failed for task ':sdks:python:test-suites:dataflow:py37:postCommitIT'.
> Process 'command 'sh'' finished with non-zero exit value 1

* Try:
Run with --stacktrace option to get the stack trace. Run with --info or --debug option to get more log output. Run with --scan to get full insights.
==============================================================================

* Get more help at https://help.gradle.org

Deprecated Gradle features were used in this build, making it incompatible with Gradle 6.0.
Use '--warning-mode all' to show the individual deprecation warnings.
See https://docs.gradle.org/5.2.1/userguide/command_line_interface.html#sec:command_line_warnings

BUILD FAILED in 47m 34s
85 actionable tasks: 64 executed, 21 from cache

Publishing build scan...
https://gradle.com/s/y2wxzda3h5eba

Build step 'Invoke Gradle script' changed build result to FAILURE
Build step 'Invoke Gradle script' marked build as failure

---------------------------------------------------------------------
To unsubscribe, e-mail: builds-unsubscribe@beam.apache.org
For additional commands, e-mail: builds-help@beam.apache.org


Jenkins build is back to normal : beam_PostCommit_Python37 #1663

Posted by Apache Jenkins Server <je...@builds.apache.org>.
See <https://builds.apache.org/job/beam_PostCommit_Python37/1663/display/redirect>


---------------------------------------------------------------------
To unsubscribe, e-mail: builds-unsubscribe@beam.apache.org
For additional commands, e-mail: builds-help@beam.apache.org


Build failed in Jenkins: beam_PostCommit_Python37 #1662

Posted by Apache Jenkins Server <je...@builds.apache.org>.
See <https://builds.apache.org/job/beam_PostCommit_Python37/1662/display/redirect?page=changes>

Changes:

[robertwb] Add capabilities and requirements to beam protos.

[github] [BEAM-1080] Skip tests that required GCP credentials

[github] [BEAM-7246] Added Google Spanner Write Transform (#10712)

[github] Apply suggestions from code review

[github] [BEAM-1833] Fixes BEAM-1833


------------------------------------------
[...truncated 2.75 MB...]
	details = "Socket closed"
	debug_error_string = "{"created":"@1582072147.580423676","description":"Error received from peer ipv4:127.0.0.1:38009","file":"src/core/lib/surface/call.cc","file_line":1056,"grpc_message":"Socket closed","grpc_status":14}"
>

Exception in thread read_state:
Traceback (most recent call last):
  File "/usr/lib/python3.7/threading.py", line 917, in _bootstrap_inner
    self.run()
  File "/usr/lib/python3.7/threading.py", line 865, in run
    self._target(*self._args, **self._kwargs)
  File "<https://builds.apache.org/job/beam_PostCommit_Python37/ws/src/build/gradleenv/2022703441/lib/python3.7/site-packages/apache_beam/runners/worker/sdk_worker.py",> line 675, in pull_responses
    for response in responses:
  File "<https://builds.apache.org/job/beam_PostCommit_Python37/ws/src/build/gradleenv/2022703441/lib/python3.7/site-packages/grpc/_channel.py",> line 416, in __next__
    return self._next()
  File "<https://builds.apache.org/job/beam_PostCommit_Python37/ws/src/build/gradleenv/2022703441/lib/python3.7/site-packages/grpc/_channel.py",> line 706, in _next
    raise self
grpc._channel._MultiThreadedRendezvous: <_MultiThreadedRendezvous of RPC that terminated with:
	status = StatusCode.UNAVAILABLE
	details = "Socket closed"
	debug_error_string = "{"created":"@1582072147.580440072","description":"Error received from peer ipv4:127.0.0.1:46715","file":"src/core/lib/surface/call.cc","file_line":1056,"grpc_message":"Socket closed","grpc_status":14}"
>


> Task :sdks:python:test-suites:dataflow:py37:postCommitIT
<https://builds.apache.org/job/beam_PostCommit_Python37/ws/src/sdks/python/apache_beam/io/gcp/bigquery.py>:1466: BeamDeprecationWarning: options is deprecated since First stable release. References to <pipeline>.options will not be supported
Worker logs: https://console.cloud.google.com/dataflow/jobsDetail/locations/us-central1/jobs/2020-02-18_16_12_45-552581428694680026?project=apache-beam-testing
  experiments = p.options.view_as(DebugOptions).experiments or []
Worker logs: https://console.cloud.google.com/dataflow/jobsDetail/locations/us-central1/jobs/2020-02-18_16_26_41-1356451010707982886?project=apache-beam-testing
<https://builds.apache.org/job/beam_PostCommit_Python37/ws/src/sdks/python/apache_beam/io/gcp/bigquery.py>:1466: BeamDeprecationWarning: options is deprecated since First stable release. References to <pipeline>.options will not be supported
  experiments = p.options.view_as(DebugOptions).experiments or []
Worker logs: https://console.cloud.google.com/dataflow/jobsDetail/locations/us-central1/jobs/2020-02-18_16_35_05-3677565940710940814?project=apache-beam-testing
<https://builds.apache.org/job/beam_PostCommit_Python37/ws/src/sdks/python/apache_beam/io/gcp/bigquery_file_loads.py>:818: BeamDeprecationWarning: options is deprecated since First stable release. References to <pipeline>.options will not be supported
  temp_location = p.options.view_as(GoogleCloudOptions).temp_location
Worker logs: https://console.cloud.google.com/dataflow/jobsDetail/locations/us-central1/jobs/2020-02-18_16_42_19-30601895571920926?project=apache-beam-testing
<https://builds.apache.org/job/beam_PostCommit_Python37/ws/src/sdks/python/apache_beam/io/gcp/bigquery.py>:1466: BeamDeprecationWarning: options is deprecated since First stable release. References to <pipeline>.options will not be supported
  experiments = p.options.view_as(DebugOptions).experiments or []
Worker logs: https://console.cloud.google.com/dataflow/jobsDetail/locations/us-central1/jobs/2020-02-18_16_49_45-9735643017510541660?project=apache-beam-testing
<https://builds.apache.org/job/beam_PostCommit_Python37/ws/src/sdks/python/apache_beam/io/gcp/bigquery_file_loads.py>:818: BeamDeprecationWarning: options is deprecated since First stable release. References to <pipeline>.options will not be supported
  temp_location = p.options.view_as(GoogleCloudOptions).temp_location
Worker logs: https://console.cloud.google.com/dataflow/jobsDetail/locations/us-central1/jobs/2020-02-18_16_12_45-12744301372103795095?project=apache-beam-testing
<https://builds.apache.org/job/beam_PostCommit_Python37/ws/src/sdks/python/apache_beam/runners/dataflow/dataflow_runner.py>:787: BeamDeprecationWarning: BigQuerySink is deprecated since 2.11.0. Use WriteToBigQuery instead.
  kms_key=transform.kms_key))
Worker logs: https://console.cloud.google.com/dataflow/jobsDetail/locations/us-central1/jobs/2020-02-18_16_29_43-485446699779452227?project=apache-beam-testing
Worker logs: https://console.cloud.google.com/dataflow/jobsDetail/locations/us-central1/jobs/2020-02-18_16_37_01-13248594446487446828?project=apache-beam-testing
Worker logs: https://console.cloud.google.com/dataflow/jobsDetail/locations/us-central1/jobs/2020-02-18_16_43_07-15155071500293912229?project=apache-beam-testing
<https://builds.apache.org/job/beam_PostCommit_Python37/ws/src/sdks/python/apache_beam/io/gcp/bigquery_read_it_test.py>:162: FutureWarning: _ReadFromBigQuery is experimental.
  query=self.query, use_standard_sql=True, project=self.project))
Worker logs: https://console.cloud.google.com/dataflow/jobsDetail/locations/us-central1/jobs/2020-02-18_16_49_38-5754397327420129309?project=apache-beam-testing
<https://builds.apache.org/job/beam_PostCommit_Python37/ws/src/sdks/python/apache_beam/io/gcp/bigquery.py>:1655: BeamDeprecationWarning: options is deprecated since First stable release. References to <pipeline>.options will not be supported
  temp_location = pcoll.pipeline.options.view_as(
Worker logs: https://console.cloud.google.com/dataflow/jobsDetail/locations/us-central1/jobs/2020-02-18_16_12_44-1128702771841193374?project=apache-beam-testing
Worker logs: https://console.cloud.google.com/dataflow/jobsDetail/locations/us-central1/jobs/2020-02-18_16_24_31-1743046204625255018?project=apache-beam-testing
<https://builds.apache.org/job/beam_PostCommit_Python37/ws/src/sdks/python/apache_beam/io/gcp/bigquery.py>:1466: BeamDeprecationWarning: options is deprecated since First stable release. References to <pipeline>.options will not be supported
Worker logs: https://console.cloud.google.com/dataflow/jobsDetail/locations/us-central1/jobs/2020-02-18_16_31_12-15517563358082858733?project=apache-beam-testing
Worker logs: https://console.cloud.google.com/dataflow/jobsDetail/locations/us-central1/jobs/2020-02-18_16_38_06-12920743179953810752?project=apache-beam-testing
  experiments = p.options.view_as(DebugOptions).experiments or []
Worker logs: https://console.cloud.google.com/dataflow/jobsDetail/locations/us-central1/jobs/2020-02-18_16_44_32-17414820760746967860?project=apache-beam-testing
<https://builds.apache.org/job/beam_PostCommit_Python37/ws/src/sdks/python/apache_beam/io/gcp/big_query_query_to_table_pipeline.py>:87: FutureWarning: _ReadFromBigQuery is experimental.
Worker logs: https://console.cloud.google.com/dataflow/jobsDetail/locations/us-central1/jobs/2020-02-18_16_51_16-16684912333213555411?project=apache-beam-testing
  kms_key=kms_key)
<https://builds.apache.org/job/beam_PostCommit_Python37/ws/src/sdks/python/apache_beam/io/gcp/bigquery.py>:1655: BeamDeprecationWarning: options is deprecated since First stable release. References to <pipeline>.options will not be supported
  temp_location = pcoll.pipeline.options.view_as(
<https://builds.apache.org/job/beam_PostCommit_Python37/ws/src/sdks/python/apache_beam/runners/dataflow/dataflow_runner.py>:787: BeamDeprecationWarning: BigQuerySink is deprecated since 2.11.0. Use WriteToBigQuery instead.
  kms_key=transform.kms_key))
<https://builds.apache.org/job/beam_PostCommit_Python37/ws/src/sdks/python/apache_beam/io/gcp/big_query_query_to_table_pipeline.py>:87: FutureWarning: _ReadFromBigQuery is experimental.
  kms_key=kms_key)
<https://builds.apache.org/job/beam_PostCommit_Python37/ws/src/sdks/python/apache_beam/io/gcp/bigquery.py>:1655: BeamDeprecationWarning: options is deprecated since First stable release. References to <pipeline>.options will not be supported
  temp_location = pcoll.pipeline.options.view_as(
<https://builds.apache.org/job/beam_PostCommit_Python37/ws/src/sdks/python/apache_beam/runners/dataflow/dataflow_runner.py>:787: BeamDeprecationWarning: BigQuerySink is deprecated since 2.11.0. Use WriteToBigQuery instead.
  kms_key=transform.kms_key))
<https://builds.apache.org/job/beam_PostCommit_Python37/ws/src/sdks/python/apache_beam/io/gcp/big_query_query_to_table_pipeline.py>:95: BeamDeprecationWarning: BigQuerySink is deprecated since 2.11.0. Use WriteToBigQuery instead.
  kms_key=kms_key))
<https://builds.apache.org/job/beam_PostCommit_Python37/ws/src/sdks/python/apache_beam/io/gcp/big_query_query_to_table_pipeline.py>:87: FutureWarning: _ReadFromBigQuery is experimental.
  kms_key=kms_key)
<https://builds.apache.org/job/beam_PostCommit_Python37/ws/src/sdks/python/apache_beam/io/gcp/bigquery.py>:1655: BeamDeprecationWarning: options is deprecated since First stable release. References to <pipeline>.options will not be supported
  temp_location = pcoll.pipeline.options.view_as(
<https://builds.apache.org/job/beam_PostCommit_Python37/ws/src/sdks/python/apache_beam/runners/dataflow/dataflow_runner.py>:787: BeamDeprecationWarning: BigQuerySink is deprecated since 2.11.0. Use WriteToBigQuery instead.
  kms_key=transform.kms_key))
<https://builds.apache.org/job/beam_PostCommit_Python37/ws/src/sdks/python/apache_beam/io/gcp/big_query_query_to_table_pipeline.py>:95: BeamDeprecationWarning: BigQuerySink is deprecated since 2.11.0. Use WriteToBigQuery instead.
  kms_key=kms_key))
Worker logs: https://console.cloud.google.com/dataflow/jobsDetail/locations/us-central1/jobs/2020-02-18_16_12_43-7530007757994220936?project=apache-beam-testing
Worker logs: https://console.cloud.google.com/dataflow/jobsDetail/locations/us-central1/jobs/2020-02-18_16_30_05-6943126486599646589?project=apache-beam-testing
<https://builds.apache.org/job/beam_PostCommit_Python37/ws/src/sdks/python/apache_beam/io/gcp/bigquery_test.py>:823: BeamDeprecationWarning: options is deprecated since First stable release. References to <pipeline>.options will not be supported
  streaming = self.test_pipeline.options.view_as(StandardOptions).streaming
Worker logs: https://console.cloud.google.com/dataflow/jobsDetail/locations/us-central1/jobs/2020-02-18_16_37_00-18383254960405757937?project=apache-beam-testing
<https://builds.apache.org/job/beam_PostCommit_Python37/ws/src/sdks/python/apache_beam/io/gcp/bigquery.py>:1466: BeamDeprecationWarning: options is deprecated since First stable release. References to <pipeline>.options will not be supported
  experiments = p.options.view_as(DebugOptions).experiments or []
<https://builds.apache.org/job/beam_PostCommit_Python37/ws/src/sdks/python/apache_beam/io/gcp/bigquery.py>:1463: BeamDeprecationWarning: options is deprecated since First stable release. References to <pipeline>.options will not be supported
  self.table_reference.projectId = pcoll.pipeline.options.view_as(
Worker logs: https://console.cloud.google.com/dataflow/jobsDetail/locations/us-central1/jobs/2020-02-18_16_12_42-1697421427581588459?project=apache-beam-testing
<https://builds.apache.org/job/beam_PostCommit_Python37/ws/src/sdks/python/apache_beam/io/gcp/bigquery_read_it_test.py>:275: FutureWarning: _ReadFromBigQuery is experimental.
  query=self.query, use_standard_sql=True, project=self.project))
Worker logs: https://console.cloud.google.com/dataflow/jobsDetail/locations/us-central1/jobs/2020-02-18_16_19_52-17277464740957502143?project=apache-beam-testing
Worker logs: https://console.cloud.google.com/dataflow/jobsDetail/locations/us-central1/jobs/2020-02-18_16_27_55-4280958039172240306?project=apache-beam-testing
Worker logs: https://console.cloud.google.com/dataflow/jobsDetail/locations/us-central1/jobs/2020-02-18_16_35_04-4476003189114974743?project=apache-beam-testing
<https://builds.apache.org/job/beam_PostCommit_Python37/ws/src/sdks/python/apache_beam/io/gcp/bigquery.py>:1655: BeamDeprecationWarning: options is deprecated since First stable release. References to <pipeline>.options will not be supported
  temp_location = pcoll.pipeline.options.view_as(
Worker logs: https://console.cloud.google.com/dataflow/jobsDetail/locations/us-central1/jobs/2020-02-18_16_41_43-3685253131386026041?project=apache-beam-testing
Worker logs: https://console.cloud.google.com/dataflow/jobsDetail/locations/us-central1/jobs/2020-02-18_16_48_21-4899784227464104150?project=apache-beam-testing
Worker logs: https://console.cloud.google.com/dataflow/jobsDetail/locations/us-central1/jobs/2020-02-18_16_12_43-4661700113741697052?project=apache-beam-testing
Worker logs: https://console.cloud.google.com/dataflow/jobsDetail/locations/us-central1/jobs/2020-02-18_16_20_11-6031307625831021074?project=apache-beam-testing
Worker logs: https://console.cloud.google.com/dataflow/jobsDetail/locations/us-central1/jobs/2020-02-18_16_27_42-4575140903651459810?project=apache-beam-testing
Worker logs: https://console.cloud.google.com/dataflow/jobsDetail/locations/us-central1/jobs/2020-02-18_16_34_41-4403391771654424158?project=apache-beam-testing
<https://builds.apache.org/job/beam_PostCommit_Python37/ws/src/sdks/python/apache_beam/runners/dataflow/dataflow_runner.py>:787: BeamDeprecationWarning: BigQuerySink is deprecated since 2.11.0. Use WriteToBigQuery instead.
  kms_key=transform.kms_key))
Worker logs: https://console.cloud.google.com/dataflow/jobsDetail/locations/us-central1/jobs/2020-02-18_16_41_49-5970746491641970922?project=apache-beam-testing
<https://builds.apache.org/job/beam_PostCommit_Python37/ws/src/sdks/python/apache_beam/io/gcp/bigquery_io_read_pipeline.py>:84: FutureWarning: _ReadFromBigQuery is experimental.
  (options.view_as(GoogleCloudOptions).project, known_args.input_table))
Worker logs: https://console.cloud.google.com/dataflow/jobsDetail/locations/us-central1/jobs/2020-02-18_16_49_07-12554786738742965553?project=apache-beam-testing
<https://builds.apache.org/job/beam_PostCommit_Python37/ws/src/sdks/python/apache_beam/io/gcp/bigquery.py>:1655: BeamDeprecationWarning: options is deprecated since First stable release. References to <pipeline>.options will not be supported
  temp_location = pcoll.pipeline.options.view_as(
<https://builds.apache.org/job/beam_PostCommit_Python37/ws/src/sdks/python/apache_beam/io/gcp/bigquery_io_read_pipeline.py>:84: FutureWarning: _ReadFromBigQuery is experimental.
  (options.view_as(GoogleCloudOptions).project, known_args.input_table))
<https://builds.apache.org/job/beam_PostCommit_Python37/ws/src/sdks/python/apache_beam/io/gcp/bigquery.py>:1655: BeamDeprecationWarning: options is deprecated since First stable release. References to <pipeline>.options will not be supported
  temp_location = pcoll.pipeline.options.view_as(
<https://builds.apache.org/job/beam_PostCommit_Python37/ws/src/sdks/python/apache_beam/io/fileio_test.py>:303: FutureWarning: MatchAll is experimental.
  | 'GetPath' >> beam.Map(lambda metadata: metadata.path))
<https://builds.apache.org/job/beam_PostCommit_Python37/ws/src/sdks/python/apache_beam/io/fileio_test.py>:316: FutureWarning: MatchAll is experimental.
  | 'Checksums' >> beam.Map(compute_hash))
<https://builds.apache.org/job/beam_PostCommit_Python37/ws/src/sdks/python/apache_beam/io/fileio_test.py>:316: FutureWarning: ReadMatches is experimental.
  | 'Checksums' >> beam.Map(compute_hash))
Worker logs: https://console.cloud.google.com/dataflow/jobsDetail/locations/us-central1/jobs/2020-02-18_16_12_42-13031462518382809198?project=apache-beam-testing
Worker logs: https://console.cloud.google.com/dataflow/jobsDetail/locations/us-central1/jobs/2020-02-18_16_20_58-10437051488776529856?project=apache-beam-testing
<https://builds.apache.org/job/beam_PostCommit_Python37/ws/src/sdks/python/apache_beam/io/avroio.py>:205: UserWarning: Due to a known issue in avro-python3 package, it is recommended to use fastavro with Beam Avro IO on Python 3 until BEAM-6522 is addressed.
  "Due to a known issue in avro-python3 package, it is "
<https://builds.apache.org/job/beam_PostCommit_Python37/ws/src/sdks/python/apache_beam/io/gcp/bigquery.py>:1466: BeamDeprecationWarning: options is deprecated since First stable release. References to <pipeline>.options will not be supported
  experiments = p.options.view_as(DebugOptions).experiments or []
Worker logs: https://console.cloud.google.com/dataflow/jobsDetail/locations/us-central1/jobs/2020-02-18_16_30_14-528098700466816170?project=apache-beam-testing
Worker logs: https://console.cloud.google.com/dataflow/jobsDetail/locations/us-central1/jobs/2020-02-18_16_37_04-11925710241042730746?project=apache-beam-testing
Worker logs: https://console.cloud.google.com/dataflow/jobsDetail/locations/us-central1/jobs/2020-02-18_16_43_38-15559491002498538895?project=apache-beam-testing
Worker logs: https://console.cloud.google.com/dataflow/jobsDetail/locations/us-central1/jobs/2020-02-18_16_50_12-6701779633779375434?project=apache-beam-testing
<https://builds.apache.org/job/beam_PostCommit_Python37/ws/src/sdks/python/apache_beam/io/gcp/bigquery_file_loads.py>:818: BeamDeprecationWarning: options is deprecated since First stable release. References to <pipeline>.options will not be supported
  temp_location = p.options.view_as(GoogleCloudOptions).temp_location
<https://builds.apache.org/job/beam_PostCommit_Python37/ws/src/sdks/python/apache_beam/runners/dataflow/dataflow_runner.py>:787: BeamDeprecationWarning: BigQuerySink is deprecated since 2.11.0. Use WriteToBigQuery instead.
  kms_key=transform.kms_key))
<https://builds.apache.org/job/beam_PostCommit_Python37/ws/src/sdks/python/apache_beam/runners/dataflow/dataflow_runner.py>:787: BeamDeprecationWarning: BigQuerySink is deprecated since 2.11.0. Use WriteToBigQuery instead.
  kms_key=transform.kms_key))
<https://builds.apache.org/job/beam_PostCommit_Python37/ws/src/sdks/python/apache_beam/runners/dataflow/dataflow_runner.py>:787: BeamDeprecationWarning: BigQuerySink is deprecated since 2.11.0. Use WriteToBigQuery instead.
  kms_key=transform.kms_key))
Worker logs: https://console.cloud.google.com/dataflow/jobsDetail/locations/us-central1/jobs/2020-02-18_16_12_43-15029754208135892154?project=apache-beam-testing
Worker logs: https://console.cloud.google.com/dataflow/jobsDetail/locations/us-central1/jobs/2020-02-18_16_21_26-11318044800366755535?project=apache-beam-testing
Worker logs: https://console.cloud.google.com/dataflow/jobsDetail/locations/us-central1/jobs/2020-02-18_16_27_45-8289401678515696961?project=apache-beam-testing
Worker logs: https://console.cloud.google.com/dataflow/jobsDetail/locations/us-central1/jobs/2020-02-18_16_34_30-4501420284087785990?project=apache-beam-testing
Worker logs: https://console.cloud.google.com/dataflow/jobsDetail/locations/us-central1/jobs/2020-02-18_16_41_28-13766480491215537868?project=apache-beam-testing
Worker logs: https://console.cloud.google.com/dataflow/jobsDetail/locations/us-central1/jobs/2020-02-18_16_47_50-15898168911450911874?project=apache-beam-testing
test_datastore_wordcount_it (apache_beam.examples.cookbook.datastore_wordcount_it_test.DatastoreWordCountIT) ... SKIP: This test still needs to be fixed on Python 3TODO: BEAM-4543
test_autocomplete_it (apache_beam.examples.complete.autocomplete_test.AutocompleteTest) ... ok
test_bigquery_tornadoes_it (apache_beam.examples.cookbook.bigquery_tornadoes_it_test.BigqueryTornadoesIT) ... ok
test_streaming_wordcount_it (apache_beam.examples.streaming_wordcount_it_test.StreamingWordCountIT) ... ok
test_leader_board_it (apache_beam.examples.complete.game.leader_board_it_test.LeaderBoardIT) ... ok
test_game_stats_it (apache_beam.examples.complete.game.game_stats_it_test.GameStatsIT) ... ok
test_wordcount_it (apache_beam.examples.wordcount_it_test.WordCountIT) ... ok
test_wordcount_fnapi_it (apache_beam.examples.wordcount_it_test.WordCountIT) ... ok
test_hourly_team_score_it (apache_beam.examples.complete.game.hourly_team_score_it_test.HourlyTeamScoreIT) ... ok
test_user_score_it (apache_beam.examples.complete.game.user_score_it_test.UserScoreIT) ... ok
test_avro_it (apache_beam.examples.fastavro_it_test.FastavroIT) ... ok
test_multiple_destinations_transform (apache_beam.io.gcp.bigquery_test.BigQueryStreamingInsertTransformIntegrationTests) ... ok
test_value_provider_transform (apache_beam.io.gcp.bigquery_test.BigQueryStreamingInsertTransformIntegrationTests) ... ok
test_bigquery_read_1M_python (apache_beam.io.gcp.bigquery_io_read_it_test.BigqueryIOReadIT) ... ok
test_bigquery_read_custom_1M_python (apache_beam.io.gcp.bigquery_io_read_it_test.BigqueryIOReadIT) ... ok
test_datastore_write_limit (apache_beam.io.gcp.datastore_write_it_test.DatastoreWriteIT) ... SKIP: This test still needs to be fixed on Python 3TODO: BEAM-4543
test_iobase_source (apache_beam.io.gcp.bigquery_read_it_test.ReadNewTypesTests) ... ok
test_native_source (apache_beam.io.gcp.bigquery_read_it_test.ReadNewTypesTests) ... ok
test_copy (apache_beam.io.gcp.gcsio_integration_test.GcsIOIntegrationTest) ... ok
test_copy_batch (apache_beam.io.gcp.gcsio_integration_test.GcsIOIntegrationTest) ... ok
test_copy_batch_kms (apache_beam.io.gcp.gcsio_integration_test.GcsIOIntegrationTest) ... ok
test_copy_batch_rewrite_token (apache_beam.io.gcp.gcsio_integration_test.GcsIOIntegrationTest) ... ok
test_copy_kms (apache_beam.io.gcp.gcsio_integration_test.GcsIOIntegrationTest) ... ok
test_copy_rewrite_token (apache_beam.io.gcp.gcsio_integration_test.GcsIOIntegrationTest) ... ok
test_bqfl_streaming (apache_beam.io.gcp.bigquery_file_loads_test.BigQueryFileLoadsIT) ... SKIP: TestStream is not supported on TestDataflowRunner
test_multiple_destinations_transform (apache_beam.io.gcp.bigquery_file_loads_test.BigQueryFileLoadsIT) ... ok
test_one_job_fails_all_jobs_fail (apache_beam.io.gcp.bigquery_file_loads_test.BigQueryFileLoadsIT) ... ok
test_iobase_source (apache_beam.io.gcp.bigquery_read_it_test.ReadTests) ... ok
test_native_source (apache_beam.io.gcp.bigquery_read_it_test.ReadTests) ... ok
test_transform_on_gcs (apache_beam.io.fileio_test.MatchIntegrationTest) ... ok
test_parquetio_it (apache_beam.io.parquetio_it_test.TestParquetIT) ... ok
test_file_loads (apache_beam.io.gcp.bigquery_test.PubSubBigQueryIT) ... SKIP: https://issuetracker.google.com/issues/118375066
test_streaming_inserts (apache_beam.io.gcp.bigquery_test.PubSubBigQueryIT) ... ok
test_basic_execution (apache_beam.testing.test_stream_it_test.TestStreamIntegrationTests) ... SKIP: The "TestDataflowRunner", does not support the TestStream transform. Supported runners: ['DirectRunner', 'SwitchingDirectRunner']
Tests that the TestStream supports emitting to multiple PCollections. ... SKIP: The "TestDataflowRunner", does not support the TestStream transform. Supported runners: ['DirectRunner', 'SwitchingDirectRunner']
Tests that the TestStream can independently control output watermarks. ... SKIP: The "TestDataflowRunner", does not support the TestStream transform. Supported runners: ['DirectRunner', 'SwitchingDirectRunner']
test_datastore_write_limit (apache_beam.io.gcp.datastore.v1new.datastore_write_it_test.DatastoreWriteIT) ... ok
test_streaming_data_only (apache_beam.io.gcp.pubsub_integration_test.PubSubIntegrationTest) ... ok
test_streaming_with_attributes (apache_beam.io.gcp.pubsub_integration_test.PubSubIntegrationTest) ... ok
test_job_python_from_python_it (apache_beam.transforms.external_test_it.ExternalTransformIT) ... ok
Runs streaming Dataflow job and verifies that user metrics are reported ... ok
test_big_query_write (apache_beam.io.gcp.bigquery_write_it_test.BigQueryWriteIntegrationTests) ... ok
test_big_query_write_new_types (apache_beam.io.gcp.bigquery_write_it_test.BigQueryWriteIntegrationTests) ... ok
test_big_query_write_schema_autodetect (apache_beam.io.gcp.bigquery_write_it_test.BigQueryWriteIntegrationTests) ... SKIP: DataflowRunner does not support schema autodetection
test_big_query_write_without_schema (apache_beam.io.gcp.bigquery_write_it_test.BigQueryWriteIntegrationTests) ... ok
test_big_query_legacy_sql (apache_beam.io.gcp.big_query_query_to_table_it_test.BigQueryQueryToTableIT) ... ok
test_big_query_new_types (apache_beam.io.gcp.big_query_query_to_table_it_test.BigQueryQueryToTableIT) ... ok
test_big_query_new_types_native (apache_beam.io.gcp.big_query_query_to_table_it_test.BigQueryQueryToTableIT) ... ok
test_big_query_standard_sql (apache_beam.io.gcp.big_query_query_to_table_it_test.BigQueryQueryToTableIT) ... ok
test_big_query_standard_sql_kms_key_native (apache_beam.io.gcp.big_query_query_to_table_it_test.BigQueryQueryToTableIT) ... ok
test_metrics_fnapi_it (apache_beam.runners.dataflow.dataflow_exercise_metrics_pipeline_test.ExerciseMetricsPipelineTest) ... ok
test_metrics_it (apache_beam.runners.dataflow.dataflow_exercise_metrics_pipeline_test.ExerciseMetricsPipelineTest) ... ok

----------------------------------------------------------------------
XML: nosetests-postCommitIT-df-py37.xml
----------------------------------------------------------------------
XML: <https://builds.apache.org/job/beam_PostCommit_Python37/ws/src/sdks/python/nosetests.xml>
----------------------------------------------------------------------
Ran 52 tests in 2691.212s

OK (SKIP=8)

FAILURE: Build completed with 2 failures.

1: Task failed with an exception.
-----------
* Where:
Build file '<https://builds.apache.org/job/beam_PostCommit_Python37/ws/src/sdks/python/test-suites/portable/py37/build.gradle'> line: 62

* What went wrong:
Execution failed for task ':sdks:python:test-suites:portable:py37:postCommitPy37IT'.
> Process 'command 'sh'' finished with non-zero exit value 1

* Try:
Run with --stacktrace option to get the stack trace. Run with --info or --debug option to get more log output. Run with --scan to get full insights.
==============================================================================

2: Task failed with an exception.
-----------
* Where:
Build file '<https://builds.apache.org/job/beam_PostCommit_Python37/ws/src/sdks/python/test-suites/direct/py37/build.gradle'> line: 51

* What went wrong:
Execution failed for task ':sdks:python:test-suites:direct:py37:postCommitIT'.
> Process 'command 'sh'' finished with non-zero exit value 1

* Try:
Run with --stacktrace option to get the stack trace. Run with --info or --debug option to get more log output. Run with --scan to get full insights.
==============================================================================

* Get more help at https://help.gradle.org

Deprecated Gradle features were used in this build, making it incompatible with Gradle 6.0.
Use '--warning-mode all' to show the individual deprecation warnings.
See https://docs.gradle.org/5.2.1/userguide/command_line_interface.html#sec:command_line_warnings

BUILD FAILED in 46m 24s
85 actionable tasks: 66 executed, 19 from cache

Publishing build scan...
https://gradle.com/s/4dpsx7nucorge

Build step 'Invoke Gradle script' changed build result to FAILURE
Build step 'Invoke Gradle script' marked build as failure

---------------------------------------------------------------------
To unsubscribe, e-mail: builds-unsubscribe@beam.apache.org
For additional commands, e-mail: builds-help@beam.apache.org


Build failed in Jenkins: beam_PostCommit_Python37 #1661

Posted by Apache Jenkins Server <je...@builds.apache.org>.
See <https://builds.apache.org/job/beam_PostCommit_Python37/1661/display/redirect?page=changes>

Changes:

[github] Exclude tests that are not passing under currect Avro IO requirements.


------------------------------------------
[...truncated 2.71 MB...]
test_autocomplete_it (apache_beam.examples.complete.autocomplete_test.AutocompleteTest) ... ok
test_streaming_wordcount_it (apache_beam.examples.streaming_wordcount_it_test.StreamingWordCountIT) ... ok
test_leader_board_it (apache_beam.examples.complete.game.leader_board_it_test.LeaderBoardIT) ... ok
test_wordcount_fnapi_it (apache_beam.examples.wordcount_it_test.WordCountIT) ... ok
test_game_stats_it (apache_beam.examples.complete.game.game_stats_it_test.GameStatsIT) ... ok
test_wordcount_it (apache_beam.examples.wordcount_it_test.WordCountIT) ... ok
test_user_score_it (apache_beam.examples.complete.game.user_score_it_test.UserScoreIT) ... ok
test_avro_it (apache_beam.examples.fastavro_it_test.FastavroIT) ... ok
test_hourly_team_score_it (apache_beam.examples.complete.game.hourly_team_score_it_test.HourlyTeamScoreIT) ... ok
test_multiple_destinations_transform (apache_beam.io.gcp.bigquery_test.BigQueryStreamingInsertTransformIntegrationTests) ... ok
test_iobase_source (apache_beam.io.gcp.bigquery_read_it_test.ReadNewTypesTests) ... ok
test_native_source (apache_beam.io.gcp.bigquery_read_it_test.ReadNewTypesTests) ... ok
test_bigquery_read_1M_python (apache_beam.io.gcp.bigquery_io_read_it_test.BigqueryIOReadIT) ... ok
test_bigquery_read_custom_1M_python (apache_beam.io.gcp.bigquery_io_read_it_test.BigqueryIOReadIT) ... ok
test_datastore_write_limit (apache_beam.io.gcp.datastore_write_it_test.DatastoreWriteIT) ... SKIP: This test still needs to be fixed on Python 3TODO: BEAM-4543
test_copy (apache_beam.io.gcp.gcsio_integration_test.GcsIOIntegrationTest) ... ERROR
test_copy_batch (apache_beam.io.gcp.gcsio_integration_test.GcsIOIntegrationTest) ... ok
test_copy_batch_kms (apache_beam.io.gcp.gcsio_integration_test.GcsIOIntegrationTest) ... ok
test_copy_batch_rewrite_token (apache_beam.io.gcp.gcsio_integration_test.GcsIOIntegrationTest) ... ok
test_copy_kms (apache_beam.io.gcp.gcsio_integration_test.GcsIOIntegrationTest) ... ERROR
test_copy_rewrite_token (apache_beam.io.gcp.gcsio_integration_test.GcsIOIntegrationTest) ... ok
test_bqfl_streaming (apache_beam.io.gcp.bigquery_file_loads_test.BigQueryFileLoadsIT) ... SKIP: TestStream is not supported on TestDataflowRunner
test_multiple_destinations_transform (apache_beam.io.gcp.bigquery_file_loads_test.BigQueryFileLoadsIT) ... ok
test_one_job_fails_all_jobs_fail (apache_beam.io.gcp.bigquery_file_loads_test.BigQueryFileLoadsIT) ... ok
test_value_provider_transform (apache_beam.io.gcp.bigquery_test.BigQueryStreamingInsertTransformIntegrationTests) ... ok
test_iobase_source (apache_beam.io.gcp.bigquery_read_it_test.ReadTests) ... ok
test_native_source (apache_beam.io.gcp.bigquery_read_it_test.ReadTests) ... ok
test_transform_on_gcs (apache_beam.io.fileio_test.MatchIntegrationTest) ... ok
test_parquetio_it (apache_beam.io.parquetio_it_test.TestParquetIT) ... ok
test_datastore_write_limit (apache_beam.io.gcp.datastore.v1new.datastore_write_it_test.DatastoreWriteIT) ... ok
test_basic_execution (apache_beam.testing.test_stream_it_test.TestStreamIntegrationTests) ... SKIP: The "TestDataflowRunner", does not support the TestStream transform. Supported runners: ['DirectRunner', 'SwitchingDirectRunner']
Tests that the TestStream supports emitting to multiple PCollections. ... SKIP: The "TestDataflowRunner", does not support the TestStream transform. Supported runners: ['DirectRunner', 'SwitchingDirectRunner']
Tests that the TestStream can independently control output watermarks. ... SKIP: The "TestDataflowRunner", does not support the TestStream transform. Supported runners: ['DirectRunner', 'SwitchingDirectRunner']
test_file_loads (apache_beam.io.gcp.bigquery_test.PubSubBigQueryIT) ... SKIP: https://issuetracker.google.com/issues/118375066
test_streaming_inserts (apache_beam.io.gcp.bigquery_test.PubSubBigQueryIT) ... ok
test_streaming_data_only (apache_beam.io.gcp.pubsub_integration_test.PubSubIntegrationTest) ... ok
test_streaming_with_attributes (apache_beam.io.gcp.pubsub_integration_test.PubSubIntegrationTest) ... ok
test_job_python_from_python_it (apache_beam.transforms.external_test_it.ExternalTransformIT) ... ok
test_metrics_fnapi_it (apache_beam.runners.dataflow.dataflow_exercise_metrics_pipeline_test.ExerciseMetricsPipelineTest) ... ok
test_metrics_it (apache_beam.runners.dataflow.dataflow_exercise_metrics_pipeline_test.ExerciseMetricsPipelineTest) ... ok
Runs streaming Dataflow job and verifies that user metrics are reported ... ok
test_big_query_legacy_sql (apache_beam.io.gcp.big_query_query_to_table_it_test.BigQueryQueryToTableIT) ... ok
test_big_query_new_types (apache_beam.io.gcp.big_query_query_to_table_it_test.BigQueryQueryToTableIT) ... ok
test_big_query_new_types_native (apache_beam.io.gcp.big_query_query_to_table_it_test.BigQueryQueryToTableIT) ... ok
test_big_query_standard_sql (apache_beam.io.gcp.big_query_query_to_table_it_test.BigQueryQueryToTableIT) ... ok
test_big_query_standard_sql_kms_key_native (apache_beam.io.gcp.big_query_query_to_table_it_test.BigQueryQueryToTableIT) ... ok
test_big_query_write (apache_beam.io.gcp.bigquery_write_it_test.BigQueryWriteIntegrationTests) ... ok
test_big_query_write_new_types (apache_beam.io.gcp.bigquery_write_it_test.BigQueryWriteIntegrationTests) ... ok
test_big_query_write_schema_autodetect (apache_beam.io.gcp.bigquery_write_it_test.BigQueryWriteIntegrationTests) ... SKIP: DataflowRunner does not support schema autodetection
test_big_query_write_without_schema (apache_beam.io.gcp.bigquery_write_it_test.BigQueryWriteIntegrationTests) ... ok

======================================================================
ERROR: test_copy (apache_beam.io.gcp.gcsio_integration_test.GcsIOIntegrationTest)
----------------------------------------------------------------------
Traceback (most recent call last):
  File "<https://builds.apache.org/job/beam_PostCommit_Python37/ws/src/sdks/python/apache_beam/io/gcp/gcsio_integration_test.py",> line 83, in tearDown
    FileSystems.delete([self.gcs_tempdir + '/'])
  File "<https://builds.apache.org/job/beam_PostCommit_Python37/ws/src/sdks/python/apache_beam/io/filesystems.py",> line 343, in delete
    return filesystem.delete(paths)
  File "<https://builds.apache.org/job/beam_PostCommit_Python37/ws/src/sdks/python/apache_beam/io/gcp/gcsfilesystem.py",> line 348, in delete
    raise BeamIOError("Delete operation failed", exceptions)
apache_beam.io.filesystem.BeamIOError: Delete operation failed with exceptions {'gs://temp-storage-for-end-to-end-tests/temp-it/gcs_it-b9588bc9-2ae7-49e4-a8a2-76e216d4bf09/': HttpError('HttpError accessing <https://www.googleapis.com/batch/storage/v1>: response: <{\'Content-Type\': \'application/json; charset=UTF-8\', \'Date\': \'Tue, 18 Feb 2020 23:37:17 GMT\', \'Expires\': \'Tue, 18 Feb 2020 23:37:17 GMT\', \'Cache-Control\': \'private, max-age=0\', \'Content-Length\': \'609\', \'status\': \'429\'}>, content <{\n "error": {\n  "errors": [\n   {\n    "domain": "usageLimits",\n    "reason": "rateLimitExceeded",\n    "message": "The rate of change requests to the object temp-storage-for-end-to-end-tests/temp-it/gcs_it-b9588bc9-2ae7-49e4-a8a2-76e216d4bf09/test_copy exceeds the rate limit. Please reduce the rate of create, update, and delete requests."\n   }\n  ],\n  "code": 429,\n  "message": "The rate of change requests to the object temp-storage-for-end-to-end-tests/temp-it/gcs_it-b9588bc9-2ae7-49e4-a8a2-76e216d4bf09/test_copy exceeds the rate limit. Please reduce the rate of create, update, and delete requests."\n }\n}\n>')}
-------------------- >> begin captured logging << --------------------
apache_beam.options.pipeline_options: WARNING: --region not set; will default to us-central1. Future releases of Beam will require the user to set --region explicitly, or else have a default set via the gcloud tool. https://cloud.google.com/compute/docs/regions-zones
apache_beam.io.gcp.gcsio: DEBUG: Rewrite done: gs://dataflow-samples/shakespeare/kinglear.txt to gs://temp-storage-for-end-to-end-tests/temp-it/gcs_it-b9588bc9-2ae7-49e4-a8a2-76e216d4bf09/test_copy
apache_beam.io.filesystem: DEBUG: Listing files in 'gs://temp-storage-for-end-to-end-tests/temp-it/gcs_it-b9588bc9-2ae7-49e4-a8a2-76e216d4bf09/'
apache_beam.io.filesystem: DEBUG: translate_pattern: 'gs://temp-storage-for-end-to-end-tests/temp-it/gcs_it-b9588bc9-2ae7-49e4-a8a2-76e216d4bf09/*' -> 'gs://temp\\-storage\\-for\\-end\\-to\\-end\\-tests/temp\\-it/gcs_it\\-b9588bc9\\-2ae7\\-49e4\\-a8a2\\-76e216d4bf09/[^/\\\\]*'
apache_beam.io.gcp.gcsio: INFO: Starting the size estimation of the input
apache_beam.io.gcp.gcsio: INFO: Finished listing 1 files in 0.034110069274902344 seconds.
--------------------- >> end captured logging << ---------------------
Worker logs: https://console.cloud.google.com/dataflow/jobsDetail/locations/us-central1/jobs/2020-02-18_15_09_58-13949038198496193778?project=apache-beam-testing
<https://builds.apache.org/job/beam_PostCommit_Python37/ws/src/sdks/python/apache_beam/io/gcp/bigquery.py>:1466: BeamDeprecationWarning: options is deprecated since First stable release. References to <pipeline>.options will not be supported
  experiments = p.options.view_as(DebugOptions).experiments or []
Worker logs: https://console.cloud.google.com/dataflow/jobsDetail/locations/us-central1/jobs/2020-02-18_15_23_55-10111885751985093562?project=apache-beam-testing
Worker logs: https://console.cloud.google.com/dataflow/jobsDetail/locations/us-central1/jobs/2020-02-18_15_30_44-13920771544233637726?project=apache-beam-testing
<https://builds.apache.org/job/beam_PostCommit_Python37/ws/src/sdks/python/apache_beam/io/gcp/bigquery_io_read_pipeline.py>:84: FutureWarning: _ReadFromBigQuery is experimental.
  (options.view_as(GoogleCloudOptions).project, known_args.input_table))
Worker logs: https://console.cloud.google.com/dataflow/jobsDetail/locations/us-central1/jobs/2020-02-18_15_38_01-8107352567646672264?project=apache-beam-testing
<https://builds.apache.org/job/beam_PostCommit_Python37/ws/src/sdks/python/apache_beam/io/gcp/bigquery.py>:1655: BeamDeprecationWarning: options is deprecated since First stable release. References to <pipeline>.options will not be supported
  temp_location = pcoll.pipeline.options.view_as(
Worker logs: https://console.cloud.google.com/dataflow/jobsDetail/locations/us-central1/jobs/2020-02-18_15_44_37-17225772456367502213?project=apache-beam-testing
<https://builds.apache.org/job/beam_PostCommit_Python37/ws/src/sdks/python/apache_beam/io/gcp/bigquery_io_read_pipeline.py>:84: FutureWarning: _ReadFromBigQuery is experimental.
  (options.view_as(GoogleCloudOptions).project, known_args.input_table))
<https://builds.apache.org/job/beam_PostCommit_Python37/ws/src/sdks/python/apache_beam/io/gcp/bigquery.py>:1655: BeamDeprecationWarning: options is deprecated since First stable release. References to <pipeline>.options will not be supported
  temp_location = pcoll.pipeline.options.view_as(
Worker logs: https://console.cloud.google.com/dataflow/jobsDetail/locations/us-central1/jobs/2020-02-18_15_09_54-16093902512364283173?project=apache-beam-testing
<https://builds.apache.org/job/beam_PostCommit_Python37/ws/src/sdks/python/apache_beam/runners/dataflow/dataflow_runner.py>:787: BeamDeprecationWarning: BigQuerySink is deprecated since 2.11.0. Use WriteToBigQuery instead.
Worker logs: https://console.cloud.google.com/dataflow/jobsDetail/locations/us-central1/jobs/2020-02-18_15_30_42-8933779936248533163?project=apache-beam-testing
Worker logs: https://console.cloud.google.com/dataflow/jobsDetail/locations/us-central1/jobs/2020-02-18_15_38_32-4323545904284472420?project=apache-beam-testing
Worker logs: https://console.cloud.google.com/dataflow/jobsDetail/locations/us-central1/jobs/2020-02-18_15_45_50-6199966687466296779?project=apache-beam-testing
  kms_key=transform.kms_key))
<https://builds.apache.org/job/beam_PostCommit_Python37/ws/src/sdks/python/apache_beam/io/gcp/bigquery.py>:1466: BeamDeprecationWarning: options is deprecated since First stable release. References to <pipeline>.options will not be supported
  experiments = p.options.view_as(DebugOptions).experiments or []
<https://builds.apache.org/job/beam_PostCommit_Python37/ws/src/sdks/python/apache_beam/io/gcp/bigquery_file_loads.py>:818: BeamDeprecationWarning: options is deprecated since First stable release. References to <pipeline>.options will not be supported
  temp_location = p.options.view_as(GoogleCloudOptions).temp_location
Worker logs: https://console.cloud.google.com/dataflow/jobsDetail/locations/us-central1/jobs/2020-02-18_15_09_56-3505816539842442126?project=apache-beam-testing
Worker logs: https://console.cloud.google.com/dataflow/jobsDetail/locations/us-central1/jobs/2020-02-18_15_21_52-4512130841222167773?project=apache-beam-testing
Worker logs: https://console.cloud.google.com/dataflow/jobsDetail/locations/us-central1/jobs/2020-02-18_15_28_34-5499990502156965754?project=apache-beam-testing
Worker logs: https://console.cloud.google.com/dataflow/jobsDetail/locations/us-central1/jobs/2020-02-18_15_35_25-11942314524321025151?project=apache-beam-testing
Worker logs: https://console.cloud.google.com/dataflow/jobsDetail/locations/us-central1/jobs/2020-02-18_15_41_35-8836605774591055918?project=apache-beam-testing
Worker logs: https://console.cloud.google.com/dataflow/jobsDetail/locations/us-central1/jobs/2020-02-18_15_47_44-13954321351542593095?project=apache-beam-testing
<https://builds.apache.org/job/beam_PostCommit_Python37/ws/src/sdks/python/apache_beam/io/gcp/bigquery.py>:1466: BeamDeprecationWarning: options is deprecated since First stable release. References to <pipeline>.options will not be supported
  experiments = p.options.view_as(DebugOptions).experiments or []
<https://builds.apache.org/job/beam_PostCommit_Python37/ws/src/sdks/python/apache_beam/io/gcp/big_query_query_to_table_pipeline.py>:87: FutureWarning: _ReadFromBigQuery is experimental.
  kms_key=kms_key)
<https://builds.apache.org/job/beam_PostCommit_Python37/ws/src/sdks/python/apache_beam/io/gcp/bigquery.py>:1655: BeamDeprecationWarning: options is deprecated since First stable release. References to <pipeline>.options will not be supported
  temp_location = pcoll.pipeline.options.view_as(
<https://builds.apache.org/job/beam_PostCommit_Python37/ws/src/sdks/python/apache_beam/runners/dataflow/dataflow_runner.py>:787: BeamDeprecationWarning: BigQuerySink is deprecated since 2.11.0. Use WriteToBigQuery instead.
  kms_key=transform.kms_key))
<https://builds.apache.org/job/beam_PostCommit_Python37/ws/src/sdks/python/apache_beam/io/gcp/big_query_query_to_table_pipeline.py>:87: FutureWarning: _ReadFromBigQuery is experimental.
  kms_key=kms_key)
<https://builds.apache.org/job/beam_PostCommit_Python37/ws/src/sdks/python/apache_beam/io/gcp/bigquery.py>:1655: BeamDeprecationWarning: options is deprecated since First stable release. References to <pipeline>.options will not be supported
  temp_location = pcoll.pipeline.options.view_as(
<https://builds.apache.org/job/beam_PostCommit_Python37/ws/src/sdks/python/apache_beam/runners/dataflow/dataflow_runner.py>:787: BeamDeprecationWarning: BigQuerySink is deprecated since 2.11.0. Use WriteToBigQuery instead.
  kms_key=transform.kms_key))
<https://builds.apache.org/job/beam_PostCommit_Python37/ws/src/sdks/python/apache_beam/io/gcp/big_query_query_to_table_pipeline.py>:95: BeamDeprecationWarning: BigQuerySink is deprecated since 2.11.0. Use WriteToBigQuery instead.
  kms_key=kms_key))
<https://builds.apache.org/job/beam_PostCommit_Python37/ws/src/sdks/python/apache_beam/io/gcp/big_query_query_to_table_pipeline.py>:87: FutureWarning: _ReadFromBigQuery is experimental.
  kms_key=kms_key)
<https://builds.apache.org/job/beam_PostCommit_Python37/ws/src/sdks/python/apache_beam/io/gcp/bigquery.py>:1655: BeamDeprecationWarning: options is deprecated since First stable release. References to <pipeline>.options will not be supported
  temp_location = pcoll.pipeline.options.view_as(
<https://builds.apache.org/job/beam_PostCommit_Python37/ws/src/sdks/python/apache_beam/runners/dataflow/dataflow_runner.py>:787: BeamDeprecationWarning: BigQuerySink is deprecated since 2.11.0. Use WriteToBigQuery instead.
  kms_key=transform.kms_key))
<https://builds.apache.org/job/beam_PostCommit_Python37/ws/src/sdks/python/apache_beam/io/gcp/big_query_query_to_table_pipeline.py>:95: BeamDeprecationWarning: BigQuerySink is deprecated since 2.11.0. Use WriteToBigQuery instead.
  kms_key=kms_key))
Worker logs: https://console.cloud.google.com/dataflow/jobsDetail/locations/us-central1/jobs/2020-02-18_15_09_54-5410075552544234725?project=apache-beam-testing
Worker logs: https://console.cloud.google.com/dataflow/jobsDetail/locations/us-central1/jobs/2020-02-18_15_27_05-9269984069861540856?project=apache-beam-testing
<https://builds.apache.org/job/beam_PostCommit_Python37/ws/src/sdks/python/apache_beam/io/gcp/bigquery_read_it_test.py>:162: FutureWarning: _ReadFromBigQuery is experimental.
Worker logs: https://console.cloud.google.com/dataflow/jobsDetail/locations/us-central1/jobs/2020-02-18_15_33_42-17243884008874585273?project=apache-beam-testing
  query=self.query, use_standard_sql=True, project=self.project))
Worker logs: https://console.cloud.google.com/dataflow/jobsDetail/locations/us-central1/jobs/2020-02-18_15_39_41-1279260991403914703?project=apache-beam-testing
<https://builds.apache.org/job/beam_PostCommit_Python37/ws/src/sdks/python/apache_beam/io/gcp/bigquery.py>:1655: BeamDeprecationWarning: options is deprecated since First stable release. References to <pipeline>.options will not be supported
Worker logs: https://console.cloud.google.com/dataflow/jobsDetail/locations/us-central1/jobs/2020-02-18_15_45_58-8260349426963205061?project=apache-beam-testing
  temp_location = pcoll.pipeline.options.view_as(
Worker logs: https://console.cloud.google.com/dataflow/jobsDetail/locations/us-central1/jobs/2020-02-18_15_09_54-14035204194730177011?project=apache-beam-testing
Worker logs: https://console.cloud.google.com/dataflow/jobsDetail/locations/us-central1/jobs/2020-02-18_15_17_01-14592569800484577137?project=apache-beam-testing
Worker logs: https://console.cloud.google.com/dataflow/jobsDetail/locations/us-central1/jobs/2020-02-18_15_24_21-1732146052011135606?project=apache-beam-testing
Worker logs: https://console.cloud.google.com/dataflow/jobsDetail/locations/us-central1/jobs/2020-02-18_15_30_50-6880352463616105986?project=apache-beam-testing
Worker logs: https://console.cloud.google.com/dataflow/jobsDetail/locations/us-central1/jobs/2020-02-18_15_37_07-7087452746959612369?project=apache-beam-testing
Worker logs: https://console.cloud.google.com/dataflow/jobsDetail/locations/us-central1/jobs/2020-02-18_15_43_36-11429384307619554881?project=apache-beam-testing
Worker logs: https://console.cloud.google.com/dataflow/jobsDetail/locations/us-central1/jobs/2020-02-18_15_49_58-10181283750835606374?project=apache-beam-testing
<https://builds.apache.org/job/beam_PostCommit_Python37/ws/src/sdks/python/apache_beam/io/gcp/bigquery_read_it_test.py>:275: FutureWarning: _ReadFromBigQuery is experimental.
  query=self.query, use_standard_sql=True, project=self.project))
<https://builds.apache.org/job/beam_PostCommit_Python37/ws/src/sdks/python/apache_beam/io/gcp/bigquery.py>:1655: BeamDeprecationWarning: options is deprecated since First stable release. References to <pipeline>.options will not be supported
  temp_location = pcoll.pipeline.options.view_as(
<https://builds.apache.org/job/beam_PostCommit_Python37/ws/src/sdks/python/apache_beam/runners/dataflow/dataflow_runner.py>:787: BeamDeprecationWarning: BigQuerySink is deprecated since 2.11.0. Use WriteToBigQuery instead.
  kms_key=transform.kms_key))
<https://builds.apache.org/job/beam_PostCommit_Python37/ws/src/sdks/python/apache_beam/runners/dataflow/dataflow_runner.py>:787: BeamDeprecationWarning: BigQuerySink is deprecated since 2.11.0. Use WriteToBigQuery instead.
  kms_key=transform.kms_key))
<https://builds.apache.org/job/beam_PostCommit_Python37/ws/src/sdks/python/apache_beam/runners/dataflow/dataflow_runner.py>:787: BeamDeprecationWarning: BigQuerySink is deprecated since 2.11.0. Use WriteToBigQuery instead.
  kms_key=transform.kms_key))
Worker logs: https://console.cloud.google.com/dataflow/jobsDetail/locations/us-central1/jobs/2020-02-18_15_09_58-9342543512338583079?project=apache-beam-testing
Worker logs: https://console.cloud.google.com/dataflow/jobsDetail/locations/us-central1/jobs/2020-02-18_15_18_04-8541690568071742979?project=apache-beam-testing
Worker logs: https://console.cloud.google.com/dataflow/jobsDetail/locations/us-central1/jobs/2020-02-18_15_24_13-13667381436349689366?project=apache-beam-testing
Worker logs: https://console.cloud.google.com/dataflow/jobsDetail/locations/us-central1/jobs/2020-02-18_15_30_37-7750823350153770643?project=apache-beam-testing
Worker logs: https://console.cloud.google.com/dataflow/jobsDetail/locations/us-central1/jobs/2020-02-18_15_37_25-14873567349074559099?project=apache-beam-testing
Worker logs: https://console.cloud.google.com/dataflow/jobsDetail/locations/us-central1/jobs/2020-02-18_15_43_52-9245567863817846306?project=apache-beam-testing
Worker logs: https://console.cloud.google.com/dataflow/jobsDetail/locations/us-central1/jobs/2020-02-18_15_09_54-10217051290441182859?project=apache-beam-testing
<https://builds.apache.org/job/beam_PostCommit_Python37/ws/src/sdks/python/apache_beam/runners/dataflow/dataflow_runner.py>:787: BeamDeprecationWarning: BigQuerySink is deprecated since 2.11.0. Use WriteToBigQuery instead.
  kms_key=transform.kms_key))
<https://builds.apache.org/job/beam_PostCommit_Python37/ws/src/sdks/python/apache_beam/io/gcp/bigquery.py>:1466: BeamDeprecationWarning: options is deprecated since First stable release. References to <pipeline>.options will not be supported
Worker logs: https://console.cloud.google.com/dataflow/jobsDetail/locations/us-central1/jobs/2020-02-18_15_16_22-16120850392242786018?project=apache-beam-testing
Worker logs: https://console.cloud.google.com/dataflow/jobsDetail/locations/us-central1/jobs/2020-02-18_15_23_23-10279543851341847969?project=apache-beam-testing
  experiments = p.options.view_as(DebugOptions).experiments or []
Worker logs: https://console.cloud.google.com/dataflow/jobsDetail/locations/us-central1/jobs/2020-02-18_15_31_27-7366103577799065938?project=apache-beam-testing
Worker logs: https://console.cloud.google.com/dataflow/jobsDetail/locations/us-central1/jobs/2020-02-18_15_38_17-15751836069146783661?project=apache-beam-testing
<https://builds.apache.org/job/beam_PostCommit_Python37/ws/src/sdks/python/apache_beam/io/gcp/bigquery_file_loads.py>:818: BeamDeprecationWarning: options is deprecated since First stable release. References to <pipeline>.options will not be supported
Worker logs: https://console.cloud.google.com/dataflow/jobsDetail/locations/us-central1/jobs/2020-02-18_15_45_02-14728199278408183940?project=apache-beam-testing
  temp_location = p.options.view_as(GoogleCloudOptions).temp_location
<https://builds.apache.org/job/beam_PostCommit_Python37/ws/src/sdks/python/apache_beam/io/gcp/bigquery.py>:1466: BeamDeprecationWarning: options is deprecated since First stable release. References to <pipeline>.options will not be supported
  experiments = p.options.view_as(DebugOptions).experiments or []
<https://builds.apache.org/job/beam_PostCommit_Python37/ws/src/sdks/python/apache_beam/io/gcp/bigquery_file_loads.py>:818: BeamDeprecationWarning: options is deprecated since First stable release. References to <pipeline>.options will not be supported
  temp_location = p.options.view_as(GoogleCloudOptions).temp_location
<https://builds.apache.org/job/beam_PostCommit_Python37/ws/src/sdks/python/apache_beam/io/fileio_test.py>:303: FutureWarning: MatchAll is experimental.
  | 'GetPath' >> beam.Map(lambda metadata: metadata.path))
<https://builds.apache.org/job/beam_PostCommit_Python37/ws/src/sdks/python/apache_beam/io/fileio_test.py>:316: FutureWarning: MatchAll is experimental.
  | 'Checksums' >> beam.Map(compute_hash))
<https://builds.apache.org/job/beam_PostCommit_Python37/ws/src/sdks/python/apache_beam/io/fileio_test.py>:316: FutureWarning: ReadMatches is experimental.
  | 'Checksums' >> beam.Map(compute_hash))
Worker logs: https://console.cloud.google.com/dataflow/jobsDetail/locations/us-central1/jobs/2020-02-18_15_09_55-16131580374116999313?project=apache-beam-testing
<https://builds.apache.org/job/beam_PostCommit_Python37/ws/src/sdks/python/apache_beam/io/avroio.py>:205: UserWarning: Due to a known issue in avro-python3 package, it is recommended to use fastavro with Beam Avro IO on Python 3 until BEAM-6522 is addressed.
Worker logs: https://console.cloud.google.com/dataflow/jobsDetail/locations/us-central1/jobs/2020-02-18_15_18_06-15980267692992857150?project=apache-beam-testing
Worker logs: https://console.cloud.google.com/dataflow/jobsDetail/locations/us-central1/jobs/2020-02-18_15_27_21-16700382374620712304?project=apache-beam-testing
  "Due to a known issue in avro-python3 package, it is "
<https://builds.apache.org/job/beam_PostCommit_Python37/ws/src/sdks/python/apache_beam/io/gcp/bigquery_test.py>:823: BeamDeprecationWarning: options is deprecated since First stable release. References to <pipeline>.options will not be supported
  streaming = self.test_pipeline.options.view_as(StandardOptions).streaming
Worker logs: https://console.cloud.google.com/dataflow/jobsDetail/locations/us-central1/jobs/2020-02-18_15_34_50-3550197513742353389?project=apache-beam-testing
<https://builds.apache.org/job/beam_PostCommit_Python37/ws/src/sdks/python/apache_beam/io/gcp/bigquery.py>:1466: BeamDeprecationWarning: options is deprecated since First stable release. References to <pipeline>.options will not be supported
  experiments = p.options.view_as(DebugOptions).experiments or []
<https://builds.apache.org/job/beam_PostCommit_Python37/ws/src/sdks/python/apache_beam/io/gcp/bigquery.py>:1463: BeamDeprecationWarning: options is deprecated since First stable release. References to <pipeline>.options will not be supported
  self.table_reference.projectId = pcoll.pipeline.options.view_as(

======================================================================
ERROR: test_copy_kms (apache_beam.io.gcp.gcsio_integration_test.GcsIOIntegrationTest)
----------------------------------------------------------------------
Traceback (most recent call last):
  File "<https://builds.apache.org/job/beam_PostCommit_Python37/ws/src/sdks/python/apache_beam/io/gcp/gcsio_integration_test.py",> line 83, in tearDown
    FileSystems.delete([self.gcs_tempdir + '/'])
  File "<https://builds.apache.org/job/beam_PostCommit_Python37/ws/src/sdks/python/apache_beam/io/filesystems.py",> line 343, in delete
    return filesystem.delete(paths)
  File "<https://builds.apache.org/job/beam_PostCommit_Python37/ws/src/sdks/python/apache_beam/io/gcp/gcsfilesystem.py",> line 348, in delete
    raise BeamIOError("Delete operation failed", exceptions)
apache_beam.io.filesystem.BeamIOError: Delete operation failed with exceptions {'gs://temp-storage-for-end-to-end-tests/temp-it/gcs_it-6203ce40-4f1b-4f38-bb11-562c9a1143eb/': HttpError('HttpError accessing <https://www.googleapis.com/batch/storage/v1>: response: <{\'Content-Type\': \'application/json; charset=UTF-8\', \'Date\': \'Tue, 18 Feb 2020 23:37:36 GMT\', \'Expires\': \'Tue, 18 Feb 2020 23:37:36 GMT\', \'Cache-Control\': \'private, max-age=0\', \'Content-Length\': \'617\', \'status\': \'429\'}>, content <{\n "error": {\n  "errors": [\n   {\n    "domain": "usageLimits",\n    "reason": "rateLimitExceeded",\n    "message": "The rate of change requests to the object temp-storage-for-end-to-end-tests/temp-it/gcs_it-6203ce40-4f1b-4f38-bb11-562c9a1143eb/test_copy_kms exceeds the rate limit. Please reduce the rate of create, update, and delete requests."\n   }\n  ],\n  "code": 429,\n  "message": "The rate of change requests to the object temp-storage-for-end-to-end-tests/temp-it/gcs_it-6203ce40-4f1b-4f38-bb11-562c9a1143eb/test_copy_kms exceeds the rate limit. Please reduce the rate of create, update, and delete requests."\n }\n}\n>')}
-------------------- >> begin captured logging << --------------------
apache_beam.options.pipeline_options: WARNING: --region not set; will default to us-central1. Future releases of Beam will require the user to set --region explicitly, or else have a default set via the gcloud tool. https://cloud.google.com/compute/docs/regions-zones
apache_beam.io.gcp.gcsio: DEBUG: Rewrite done: gs://dataflow-samples/shakespeare/kinglear.txt to gs://temp-storage-for-end-to-end-tests/temp-it/gcs_it-6203ce40-4f1b-4f38-bb11-562c9a1143eb/test_copy_kms
apache_beam.io.filesystem: DEBUG: Listing files in 'gs://temp-storage-for-end-to-end-tests/temp-it/gcs_it-6203ce40-4f1b-4f38-bb11-562c9a1143eb/'
apache_beam.io.filesystem: DEBUG: translate_pattern: 'gs://temp-storage-for-end-to-end-tests/temp-it/gcs_it-6203ce40-4f1b-4f38-bb11-562c9a1143eb/*' -> 'gs://temp\\-storage\\-for\\-end\\-to\\-end\\-tests/temp\\-it/gcs_it\\-6203ce40\\-4f1b\\-4f38\\-bb11\\-562c9a1143eb/[^/\\\\]*'
apache_beam.io.gcp.gcsio: INFO: Starting the size estimation of the input
apache_beam.io.gcp.gcsio: INFO: Finished listing 1 files in 0.03626084327697754 seconds.
--------------------- >> end captured logging << ---------------------

----------------------------------------------------------------------
XML: nosetests-postCommitIT-df-py37.xml
----------------------------------------------------------------------
XML: <https://builds.apache.org/job/beam_PostCommit_Python37/ws/src/sdks/python/nosetests.xml>
----------------------------------------------------------------------
Ran 52 tests in 2773.498s

FAILED (SKIP=8, errors=2)

> Task :sdks:python:test-suites:dataflow:py37:postCommitIT FAILED

FAILURE: Build failed with an exception.

* Where:
Build file '<https://builds.apache.org/job/beam_PostCommit_Python37/ws/src/sdks/python/test-suites/dataflow/py37/build.gradle'> line: 89

* What went wrong:
Execution failed for task ':sdks:python:test-suites:dataflow:py37:postCommitIT'.
> Process 'command 'sh'' finished with non-zero exit value 1

* Try:
Run with --stacktrace option to get the stack trace. Run with --info or --debug option to get more log output. Run with --scan to get full insights.

* Get more help at https://help.gradle.org

Deprecated Gradle features were used in this build, making it incompatible with Gradle 6.0.
Use '--warning-mode all' to show the individual deprecation warnings.
See https://docs.gradle.org/5.2.1/userguide/command_line_interface.html#sec:command_line_warnings

BUILD FAILED in 48m 2s
85 actionable tasks: 64 executed, 21 from cache

Publishing build scan...
https://gradle.com/s/eg5ua7w5fwr3w

Build step 'Invoke Gradle script' changed build result to FAILURE
Build step 'Invoke Gradle script' marked build as failure

---------------------------------------------------------------------
To unsubscribe, e-mail: builds-unsubscribe@beam.apache.org
For additional commands, e-mail: builds-help@beam.apache.org